%YAML 1.1
%TAG !u! tag:unity3d.com,2011:
--- !u!1001 &783725929070609092
PrefabInstance:
  m_ObjectHideFlags: 0
  serializedVersion: 2
  m_Modification:
    m_TransformParent: {fileID: 0}
    m_Modifications:
    - target: {fileID: 7220706057620116566, guid: 6665d3a049ff90743b536ea4e86af5d5, type: 3}
      propertyPath: m_RootOrder
      value: 0
      objectReference: {fileID: 0}
    - target: {fileID: 7220706057620116566, guid: 6665d3a049ff90743b536ea4e86af5d5, type: 3}
      propertyPath: m_LocalScale.x
      value: 0.5
      objectReference: {fileID: 0}
    - target: {fileID: 7220706057620116566, guid: 6665d3a049ff90743b536ea4e86af5d5, type: 3}
      propertyPath: m_LocalScale.z
      value: 0.5
      objectReference: {fileID: 0}
    - target: {fileID: 7220706057620116566, guid: 6665d3a049ff90743b536ea4e86af5d5, type: 3}
      propertyPath: m_LocalPosition.x
      value: -0.88
      objectReference: {fileID: 0}
    - target: {fileID: 7220706057620116566, guid: 6665d3a049ff90743b536ea4e86af5d5, type: 3}
      propertyPath: m_LocalPosition.y
      value: 0
      objectReference: {fileID: 0}
    - target: {fileID: 7220706057620116566, guid: 6665d3a049ff90743b536ea4e86af5d5, type: 3}
      propertyPath: m_LocalPosition.z
      value: -2.79
      objectReference: {fileID: 0}
    - target: {fileID: 7220706057620116566, guid: 6665d3a049ff90743b536ea4e86af5d5, type: 3}
      propertyPath: m_LocalRotation.w
      value: 1
      objectReference: {fileID: 0}
    - target: {fileID: 7220706057620116566, guid: 6665d3a049ff90743b536ea4e86af5d5, type: 3}
      propertyPath: m_LocalRotation.x
      value: -0
      objectReference: {fileID: 0}
    - target: {fileID: 7220706057620116566, guid: 6665d3a049ff90743b536ea4e86af5d5, type: 3}
      propertyPath: m_LocalRotation.y
      value: -0
      objectReference: {fileID: 0}
    - target: {fileID: 7220706057620116566, guid: 6665d3a049ff90743b536ea4e86af5d5, type: 3}
      propertyPath: m_LocalRotation.z
      value: -0
      objectReference: {fileID: 0}
    - target: {fileID: 7220706057620116566, guid: 6665d3a049ff90743b536ea4e86af5d5, type: 3}
      propertyPath: m_LocalEulerAnglesHint.x
      value: 0
      objectReference: {fileID: 0}
    - target: {fileID: 7220706057620116566, guid: 6665d3a049ff90743b536ea4e86af5d5, type: 3}
      propertyPath: m_LocalEulerAnglesHint.y
      value: 0
      objectReference: {fileID: 0}
    - target: {fileID: 7220706057620116566, guid: 6665d3a049ff90743b536ea4e86af5d5, type: 3}
      propertyPath: m_LocalEulerAnglesHint.z
      value: 0
      objectReference: {fileID: 0}
    - target: {fileID: 8248648791123696175, guid: 6665d3a049ff90743b536ea4e86af5d5, type: 3}
      propertyPath: m_Name
      value: Tree2
      objectReference: {fileID: 0}
    m_RemovedComponents: []
  m_SourcePrefab: {fileID: 100100000, guid: 6665d3a049ff90743b536ea4e86af5d5, type: 3}
