# ProBuilder 4.2.3
# https://unity3d.com/unity/features/worldbuilding/probuilder
# 2/2/2020 1:37:57 AM

mtllib ./heart.mtl
o heart

g heart
v -0.374301 -0.195 1.14149
v -0.374301 -0.1949999 0.35051
v -0.4346666 -0.06559044 1.14149
v -0.4346666 -0.06559041 0.35051
v -0.4330127 0.05500001 1.14149
v -0.4330127 0.05500007 0.35051
v -0.3535534 0.1585534 1.14149
v -0.3535534 0.1585535 0.35051
v -0.25 0.2110969 1.14149
v -0.25 0.211097 0.35051
v -0.1294096 0.1828401 1.14149
v -0.1294096 0.1828402 0.35051
v 0 0.0752942 1.14149
v 0 0.0752942 0.35051
v 0.1294096 0.1828401 1.14149
v 0.1294096 0.1828402 0.35051
v 0.25 0.2110969 1.14149
v 0.25 0.211097 0.35051
v 0.3535534 0.1585534 1.14149
v 0.3535534 0.1585535 0.35051
v 0.4330127 0.05500001 1.14149
v 0.4330127 0.0550001 0.3505101
v 0.4346666 -0.06559044 1.14149
v 0.4346666 -0.06559038 0.3505101
v 0.374301 -0.195 1.14149
v 0.374301 -0.195 0.35051
v 0.2591317 -0.3244095 1.14149
v 0.2591317 -0.3244095 0.35051
v 0.2124555 -0.3667343 1.14149
v 0.2124555 -0.3667343 0.35051
v 0.162772 -0.4088033 1.14149
v 0.162772 -0.4088033 0.35051
v 0.1135194 -0.4443212 0.35051
v 0.1135194 -0.4443212 0.746
v 0.1135194 -0.4443212 1.14149
v 0.06785559 -0.4716558 0.35051
v 0.06785559 -0.4716559 1.14149
v 0 -0.5043787 1.14149
v 0 -0.5043787 0.35051
v -0.06785559 -0.4716558 1.14149
v -0.06785559 -0.4716558 0.35051
v -0.1135194 -0.4443212 0.746
v -0.1135194 -0.4443212 1.14149
v -0.1135194 -0.4443212 0.35051
v -0.1627719 -0.4088034 1.14149
v -0.1627719 -0.4088034 0.35051
v -0.2124554 -0.3667344 1.14149
v -0.2124554 -0.3667343 0.35051
v -0.2591317 -0.3244096 1.14149
v -0.2591317 -0.3244095 0.35051
v 0 -0.195 1.14149
v 0 -0.1949999 0.35051

vt -0.06526309 -0.5
vt -0.06526309 0.5
vt 0.0652631 -0.5
vt 0.0652631 0.5
vt 0.06526313 0
vt -0.4829629 0.1294096
vt 0 2.980232E-08
vt -0.5 2.980232E-08
vt -0.4330127 0.25
vt -0.3535534 0.3535534
vt -0.25 0.4330128
vt -0.1294096 0.4829629
vt 0 0.5
vt 0.1294096 0.4829629
vt 0.25 0.4330127
vt 0.3535534 0.3535534
vt 0.4330127 0.2500001
vt 0.4829629 0.1294096
vt 0.5 -1.390907E-08
vt 0.4829629 -0.1294095
vt 0.4330127 -0.25
vt 0.3535534 -0.3535533
vt 0.2499999 -0.4330127
vt 0.1294095 -0.4829629
vt 0 -0.5
vt -0.1294095 -0.4829629
vt -0.2499999 -0.4330127
vt -0.3535533 -0.3535534
vt -0.4330127 -0.2500001
vt -0.4829629 -0.1294096
vt -0.4330127 -0.25
vt 0.4330127 -0.2500001

vn -0.8076616 -0.5896463 -5.286157E-08
vn -0.8612436 -0.5081924 -3.293555E-08
vn -0.9589413 -0.2836047 -1.611646E-08
vn -0.9908744 -0.1347883 -4.902332E-09
vn -0.9750287 0.2220789 1.655448E-08
vn -0.902926 0.429796 2.438079E-08
vn -0.6950595 0.7189522 3.490646E-08
vn -0.5788759 0.8154156 4.217551E-08
vn -0.2384042 0.971166 6.134766E-08
vn 0.001336157 0.9999991 7.535538E-08
vn 0.374007 0.9274259 6.988659E-08
vn 0.514335 0.8575894 4.483687E-08
vn 0.2669632 0.9637067 2.420685E-08
vn -0.2669632 0.9637067 2.420685E-08
vn -0.514335 0.8575894 4.483687E-08
vn -0.374007 0.9274259 5.736172E-08
vn -0.001336178 0.9999991 5.059903E-08
vn 0.2384042 0.971166 3.659132E-08
vn 0.5788758 0.8154157 3.0723E-08
vn 0.6950595 0.7189522 4.272446E-08
vn 0.902926 0.4297959 3.256784E-08
vn 0.9750287 0.2220788 2.49219E-08
vn 0.9908744 -0.1347884 -9.980861E-09
vn 0.9589413 -0.2836047 -2.137116E-08
vn 0.8612436 -0.5081924 -3.829506E-08
vn 0.8076614 -0.5896465 -4.443307E-08
vn 0.7228382 -0.6910174 -5.207191E-08
vn 0.6977131 -0.7163773 -5.398293E-08
vn 0.6633075 -0.7483469 -5.639201E-08
vn 0.6547965 -0.7558052 -5.695403E-08
vn 0.6160239 -0.7877275 -5.935955E-08
vn 0.6057501 -0.795655 -5.995694E-08
vn 0.5497651 -0.8353193 -6.294586E-08
vn 0.4744751 -0.8802689 -8.291632E-08
vn 0.4876408 -0.8730443 -8.789716E-08
vn 0.1587101 -0.9873253 -8.680038E-08
vn -0.1587103 -0.9873252 -7.440033E-08
vn -0.4744751 -0.8802689 -6.633305E-08
vn -0.4876407 -0.8730444 -6.578864E-08
vn -0.5497649 -0.8353195 -5.784785E-08
vn -0.6057499 -0.7956551 -4.017209E-08
vn -0.6160237 -0.7877276 -5.17137E-08
vn -0.6547965 -0.7558053 -6.625904E-08
vn -0.6633074 -0.748347 -8.458803E-08
vn -0.697713 -0.7163774 -8.097439E-08
vn -0.7228382 -0.6910173 -6.974772E-08
vn 0 0 1
vn 0 -2.302947E-07 -1

usemtl ProBuilderDefault
f 3/3/3 2/2/2 1/1/1
f 3/3/3 4/4/4 2/2/2
f 5/3/5 4/2/4 3/1/3
f 5/3/5 6/4/6 4/2/4
f 7/3/7 6/2/6 5/1/5
f 7/3/7 8/4/8 6/2/6
f 9/3/9 8/2/8 7/1/7
f 9/3/9 10/4/10 8/2/8
f 11/3/11 10/2/10 9/1/9
f 11/3/11 12/4/12 10/2/10
f 13/3/13 12/2/12 11/1/11
f 13/3/13 14/4/14 12/2/12
f 15/3/15 14/2/14 13/1/13
f 15/3/15 16/4/16 14/2/14
f 17/3/17 16/2/16 15/1/15
f 17/3/17 18/4/18 16/2/16
f 19/3/19 18/2/18 17/1/17
f 19/3/19 20/4/20 18/2/18
f 21/3/21 20/2/20 19/1/19
f 21/3/21 22/4/22 20/2/20
f 23/3/23 22/2/22 21/1/21
f 23/3/23 24/4/24 22/2/22
f 25/3/25 24/2/24 23/1/23
f 25/3/25 26/4/26 24/2/24
f 27/3/27 26/2/26 25/1/25
f 27/3/27 28/4/28 26/2/26
f 29/3/29 28/2/28 27/1/27
f 29/3/29 30/4/30 28/2/28
f 31/3/31 30/2/30 29/1/29
f 31/3/31 32/4/32 30/2/30
f 32/2/32 34/5/33 33/4/33
f 31/1/31 34/5/33 32/2/32
f 35/3/33 34/5/33 31/1/31
f 34/5/33 36/4/34 33/2/33
f 37/3/35 36/4/34 34/5/33
f 35/1/33 37/3/35 34/5/33
f 38/3/36 36/2/34 37/1/35
f 38/3/36 39/4/37 36/2/34
f 40/3/38 39/2/37 38/1/36
f 40/3/38 41/4/39 39/2/37
f 40/1/38 43/3/40 42/5/40
f 40/1/38 42/5/40 41/2/39
f 42/5/40 44/4/40 41/2/39
f 45/3/41 42/5/40 43/1/40
f 42/5/40 46/4/42 44/2/40
f 42/5/40 45/3/41 46/4/42
f 47/3/43 46/2/42 45/1/41
f 47/3/43 48/4/44 46/2/42
f 49/3/45 48/2/44 47/1/43
f 49/3/45 50/4/46 48/2/44
f 1/3/1 50/2/46 49/1/45
f 1/3/1 2/4/2 50/2/46
f 1/8/47 51/7/47 3/6/47
f 3/6/47 51/7/47 5/9/47
f 5/9/47 51/7/47 7/10/47
f 7/10/47 51/7/47 9/11/47
f 9/11/47 51/7/47 11/12/47
f 11/12/47 51/7/47 13/13/47
f 13/13/47 51/7/47 15/14/47
f 15/14/47 51/7/47 17/15/47
f 17/15/47 51/7/47 19/16/47
f 19/16/47 51/7/47 21/17/47
f 21/17/47 51/7/47 23/18/47
f 23/18/47 51/7/47 25/19/47
f 25/19/47 51/7/47 27/20/47
f 27/20/47 51/7/47 29/21/47
f 29/21/47 51/7/47 31/22/47
f 31/22/47 51/7/47 35/23/47
f 35/23/47 51/7/47 37/24/47
f 37/24/47 51/7/47 38/25/47
f 38/25/47 51/7/47 40/26/47
f 40/26/47 51/7/47 43/27/47
f 43/27/47 51/7/47 45/28/47
f 45/28/47 51/7/47 47/29/47
f 47/29/47 51/7/47 49/30/47
f 49/30/47 51/7/47 1/8/47
f 4/18/48 52/7/48 2/19/48
f 6/17/48 52/7/48 4/18/48
f 8/16/48 52/7/48 6/17/48
f 10/15/48 52/7/48 8/16/48
f 12/14/48 52/7/48 10/15/48
f 14/13/48 52/7/48 12/14/48
f 16/12/48 52/7/48 14/13/48
f 18/11/48 52/7/48 16/12/48
f 20/10/48 52/7/48 18/11/48
f 22/9/48 52/7/48 20/10/48
f 24/6/48 52/7/48 22/9/48
f 26/8/48 52/7/48 24/6/48
f 28/30/48 52/7/48 26/8/48
f 30/31/48 52/7/48 28/30/48
f 32/28/48 52/7/48 30/31/48
f 33/27/48 52/7/48 32/28/48
f 36/26/48 52/7/48 33/27/48
f 39/25/48 52/7/48 36/26/48
f 41/24/48 52/7/48 39/25/48
f 44/23/48 52/7/48 41/24/48
f 46/22/48 52/7/48 44/23/48
f 48/32/48 52/7/48 46/22/48
f 50/20/48 52/7/48 48/32/48
f 2/19/48 52/7/48 50/20/48

