# ProBuilder 4.2.3
# https://unity3d.com/unity/features/worldbuilding/probuilder
# 2/2/2020 1:58:50 AM

mtllib ./body.mtl
o body

g body
v -0.03184795 -0.929138 1.142856
v -0.2101741 -0.5468494 1.142856
v -0.525 0.3458619 1.142856
v -0.4290234 0.3458619 1.142856
v -0.2098265 0.3458619 1.142856
v -0.25 0.2110969 1.142856
v 0.01559639 0.3458619 1.142856
v 0.3255731 0.3458619 1.142856
v 0.525 0.3458619 1.142856
v 0.525 0.2755351 1.142856
v 0.3656791 0.1524008 1.142856
v 0.4532354 0.2587191 1.142856
v 0.4367055 0.05018759 1.142856
v 0.361846 0.1477463 1.142856
v 0.4330127 0.05499995 1.142856
v 0.3535534 0.1585534 1.142856
v 0.25 0.2110969 1.142856
v 0.1294096 0.18284 1.142856
v 0.07248414 0.1355322 1.142856
v 0.4330671 0.05104011 1.142856
v 0.4377235 -0.2884763 1.142856
v 0.4346666 -0.06559044 1.142856
v 0.3605963 -0.2243797 1.142856
v 0.374301 -0.1950002 1.142856
v 0 0.0752942 1.142856
v 0.3066084 0.08067209 1.142856
v 0.525 -0.3610075 1.142856
v 0.3534441 -0.2184358 1.142856
v 0.525 -0.9291381 1.142856
v -0.1168604 -0.7468916 1.142856
v 0.2591318 -0.3244095 1.142856
v -0.1435908 -0.6895879 1.142856
v 0.2124556 -0.3667342 1.142856
v -0.1507385 -0.6742651 1.142856
v 0.1627716 -0.4088036 1.142856
v -0.1644833 -0.6447995 1.142856
v 0.1135198 -0.444321 1.142856
v -0.1769048 -0.6181708 1.142856
v 0.067855 -0.4716562 1.142856
v -0.1877505 -0.5949202 1.142856
v 0 -0.5043788 1.142856
v -0.1253976 -0.4439066 1.142856
v -0.2967367 -0.3612795 1.142856
v -0.1217042 -0.4394218 1.142856
v -0.3139733 -0.3243284 1.142856
v -0.121186 -0.4387925 1.142856
v -0.3312385 -0.2873158 1.142856
v -0.3475525 -0.2523425 1.142856
v -0.3541092 -0.2382866 1.142856
v -0.06785583 -0.4716558 1.142856
v -0.1135197 -0.444321 1.142856
v 0.1793995 -0.07379586 1.142856
v -0.1294097 0.1828401 1.142856
v -0.1627718 -0.4088035 1.142856
v -0.2124556 -0.3667343 1.142856
v -0.2591318 -0.3244096 1.142856
v -0.3743011 -0.1950001 1.142856
v -0.4346666 -0.06559056 1.142856
v -0.4330127 0.05499998 1.142856
v -0.3535534 0.1585534 1.142856
v -0.75 -0.9291381 0.9928557
v -0.75 -0.9291381 0.2928557
v -0.75 0.3458619 0.9928557
v -0.75 0.3458619 0.2928557
v -0.525 0.1280629 0.1428556
v -0.525 -0.9291381 0.1428556
v -0.4346666 -0.06559047 0.1428556
v -0.4305956 0.2312281 0.1428556
v -0.525 0.3458619 0.1428556
v -0.4330127 0.05500013 0.1428556
v -0.361846 0.1477463 0.1428556
v -0.2098266 0.3458619 0.1428556
v -0.4290234 0.3458619 0.1428556
v -0.3535535 0.1585534 0.1428556
v 0.01559639 0.3458619 0.1428556
v -0.25 0.2110969 0.1428556
v 0.3255731 0.3458619 0.1428556
v 0.1294096 0.1828402 0.1428556
v 0.525 0.3458619 0.1428556
v 0.25 0.211097 0.1428556
v 0.525 0.2755352 0.1428556
v 0.3535534 0.1585534 0.1428556
v 0.4367054 0.05018777 0.1428556
v 0.525 0.07156056 0.1428556
v 0.4330127 0.05500004 0.1428556
v 0.07248425 0.1355323 0.1428556
v -0.1294096 0.1828401 0.1428556
v 0 0.0752942 0.1428556
v 0.433067 0.05104029 0.1428556
v 0.4377235 -0.2884762 0.1428556
v 0.525 0.02949852 0.1428556
v 0.4346666 -0.06559044 0.1428556
v 0.3605963 -0.2243796 0.1428556
v 0.374301 -0.195 0.1428556
v -0.1168604 -0.7468916 0.1428556
v -0.03184783 -0.9291381 0.1428556
v 0.525 -0.9291381 0.1428556
v 0.1385599 -0.4598895 0.1428556
v 0.3534441 -0.2184358 0.1428556
v 0.525 -0.3610075 0.1428556
v -0.1435908 -0.6895879 0.1428556
v 0.2591316 -0.3244095 0.1428556
v -0.1507385 -0.674265 0.1428556
v 0.1262319 -0.4449196 0.1428556
v 0.2124547 -0.366735 0.1428556
v -0.1644832 -0.6447994 0.1428556
v 0.1237203 -0.4418699 0.1428556
v 0.121186 -0.4387925 0.1428556
v 0.1627721 -0.4088033 0.1428556
v -0.1769047 -0.6181708 0.1428556
v 0.1135195 -0.4443211 0.1428556
v -0.1877505 -0.59492 0.1428556
v 0.06785536 -0.4716559 0.1428556
v -0.2967366 -0.3612795 0.1428556
v 0 -0.5043787 0.1428556
v -0.3139733 -0.3243283 0.1428556
v -0.06785583 -0.4716557 0.1428556
v -0.3312384 -0.2873158 0.1428556
v -0.1135195 -0.4443211 0.1428556
v -0.3475524 -0.2523425 0.1428556
v -0.1627719 -0.4088033 0.1428556
v -0.354109 -0.2382867 0.1428556
v -0.2124552 -0.3667346 0.1428556
v -0.374301 -0.1950001 0.1428556
v -0.2591318 -0.3244095 0.1428556
v 0.7499999 0.3282573 0.2928557
v 0.7499999 0.3282573 0.3025209
v 0.7499999 0.3458619 0.2928557
v 0.7499999 0.3282573 0.9928556
v 0.7499999 0.3458619 0.9928557
v 0.7499999 -0.02322376 0.2928557
v 0.7499999 -0.0232237 0.4954909
v 0.7499999 -0.0232237 0.9928557
v 0.7499999 -0.5479939 0.2928557
v 0.7499999 -0.5479939 0.7836
v 0.7499999 -0.547994 0.9928557
v 0.7499999 -0.9291381 0.2928557
v 0.7499999 -0.9291381 0.9928557
v 0.696967 0.420862 0.2075003
v 0.7010554 0.3167886 0.2140805
v 0.696967 0.3158306 0.2075003
v 0.7140816 -0.01480728 0.235046
v 0.696967 -0.01079702 0.2075003
v 0.734522 -0.5351308 0.267944
v 0.696967 -0.5039207 0.2075003
v 0.696967 -0.9291381 0.2075003
v 0.696967 0.473895 1.042856
v 0.696967 0.473895 0.2428556
v 0.7492605 0.3280839 0.9940459
v 0.7347964 -0.01966131 1.017326
v 0.7140628 -0.5181283 1.050696
v 0.696967 -0.5039208 1.078211
v -0.4259374 0.5708619 0.9928556
v -0.525 0.5708619 0.9928557
v -0.4259375 0.5708619 0.926814
v -0.525 0.5708619 0.2928557
v -0.4259375 0.5708619 0.2928557
v -0.03717804 0.5708619 0.9928557
v -0.03717816 0.5708619 0.667641
v -0.03717816 0.5708619 0.2928557
v 0.4590288 0.5708619 0.9928557
v 0.4590288 0.5708619 0.3368364
v 0.4590288 0.5708619 0.2928557
v 0.525 0.5708619 0.9928557
v 0.525 0.5708619 0.2928557
v 0.6530331 0.5178289 1.042856
v 0.6530331 0.5178289 0.2428556
v -0.6897068 0.4811551 0.2428556
v -0.6897068 0.4811552 0.9106538
v -0.696967 0.473895 1.042856
v -0.696967 0.473895 0.2428556
v -0.6897069 0.4811552 1.042856
v -0.653033 0.5178289 0.2428556
v -0.653033 0.5178289 1.042856
v -0.4271806 0.4802222 0.1824291
v -0.6 0.473895 0.178211
v -0.4272674 0.473895 0.178211
v -0.4266648 0.5178289 0.2075003
v -0.6 0.5178289 0.2075003
v -0.09746563 0.4922935 0.1904767
v -0.1115835 0.473895 0.178211
v -0.07787168 0.5178289 0.2075003
v 0.3354203 0.5081422 0.2010425
v 0.2679254 0.473895 0.178211
v 0.3545108 0.5178289 0.2075003
v 0.5293895 0.5152437 0.2057768
v 0.4796346 0.473895 0.178211
v 0.5325001 0.5178289 0.2075003
v 0.6 0.5178289 0.2075003
v 0.6 0.473895 0.178211
v -0.4265527 0.5260053 0.22066
v 0.4605359 0.458023 0.1738281
v -0.653033 -0.9291381 0.178211
v -0.696967 0.420862 0.2075003
v -0.696967 -0.9291381 0.2075003
v -0.653033 0.4025353 0.178211
v -0.6615819 0.420862 0.1839102
v -0.653033 0.420862 0.178211
v 0.6567577 0.3064087 0.1806941
v 0.6530331 0.420862 0.178211
v 0.6530331 0.3055359 0.178211
v 0.666741 -0.0003595054 0.1873497
v 0.6530331 0.006595999 0.178211
v 0.6790262 -0.006593049 0.1955397
v 0.6668512 -0.003740191 0.1874231
v 0.6530331 -0.0005024076 0.178211
v 0.6827441 -0.4921008 0.1980184
v 0.6530331 -0.4674094 0.178211
v 0.6530331 -0.9291381 0.178211
v -0.4267519 0.511486 1.08244
v -0.09213912 0.4992353 1.090607
v -0.4266648 0.5178289 1.078211
v 0.2902735 0.4852346 1.099941
v -0.07787168 0.5178289 1.078211
v 0.4847136 0.4781158 1.104686
v 0.3545109 0.5178289 1.078211
v 0.5325001 0.5178289 1.078211
v 0.696967 0.420862 1.078211
v 0.6935226 0.3150234 1.080507
v 0.6790262 -0.006593168 1.090171
v 0.696967 0.3158305 1.078211
v 0.6530331 0.006595969 1.1075
v 0.6830255 -0.007530272 1.087505
v 0.696967 -0.01079708 1.078211
v 0.6530331 -0.4674094 1.1075
v 0.6676637 -0.4795682 1.097747
v 0.696967 -0.9291381 1.078211
v -0.6535906 0.4037304 1.107129
v -0.653033 0.4025351 1.1075
v -0.653033 -0.9291381 1.1075
v -0.6615819 0.420862 1.101801
v 0.5725931 0.5511482 0.2742694
v 0.5725931 0.5511482 0.7140617
v 0.5725931 0.5511482 1.011442
v -0.05827653 0.543366 0.2486016
v 0.4522722 0.5674334 0.2873377
v 0.5635306 0.5436167 0.2490052
v -0.4288734 0.3568018 0.1458766
v -0.17967 0.3851629 0.1537083
v 0.1719074 0.425175 0.1647573
v 0.5318998 0.2771519 0.144761
v 0.5540236 0.05683386 0.1508703
v 0.5575341 0.02187496 0.1518397
v 0.6024455 -0.4253685 0.1642416
v -0.6508514 0.3978583 0.1776085
v -0.696967 0.420862 1.078211
v -0.696967 -0.9291381 1.078211
v -0.5429968 0.1666436 1.137886
v -0.525 0.1280628 1.142856
v -0.525 -0.9291381 1.142856
v -0.653033 0.420862 1.1075
v -0.6 0.473895 1.1075
v -0.4275366 0.4542674 1.11292
v -0.4272674 0.473895 1.1075
v -0.1508099 0.4227739 1.121617
v -0.1115834 0.473895 1.1075
v 0.3495938 0.3658244 1.137343
v 0.10892 0.3932148 1.12978
v 0.2679254 0.473895 1.1075
v 0.4796346 0.473895 1.1075
v 0.6 0.473895 1.1075
v -0.4260015 0.5661951 1.000367
v -0.05420756 0.5486685 1.028575
v 0.3753793 0.5284176 1.061169
v 0.5361235 0.52084 1.073365
v 0.6530331 0.420862 1.1075
v 0.641847 0.3029148 1.110589
v 0.6530331 0.3055359 1.1075
v 0.525 0.07156056 1.142856
v 0.6155483 0.02561599 1.117851
v 0.6139399 0.008657873 1.118296
v 0.525 0.0294984 1.142856
v 0.6530331 -0.0005025268 1.1075
v 0.5749446 -0.402514 1.129064
v 0.6530331 -0.9291381 1.1075
v 0.6 0.5178289 1.078211
v -0.6881777 0.4778772 0.239651
v -0.6728376 0.4449914 0.2075003
v -0.6687744 0.436281 0.1989846
v -0.03184795 -0.9291381 0.5140876
v -0.03184795 -0.9291381 1.035219
v -0.03184795 -0.9291381 1.051537
v -0.03184795 -0.929138 1.077344
v -0.6687744 0.436281 1.086727
v -0.6728375 0.4449914 1.078211
v -0.6795321 0.4593428 1.06418
v -0.6 0.5178289 1.078211
v 0.5635306 0.5436167 1.036706
v -0.4346666 -0.06559044 0.39549
v -0.4153862 -0.106923 0.1428556
v -0.3743011 -0.195 0.1428556
v -0.3743011 -0.195 0.39549
v -0.4330127 0.05500001 0.39549
v -0.4335409 0.01648414 0.1428556
v -0.3535534 0.1585534 0.39549
v -0.3789322 0.1254791 0.1428556
v -0.25 0.2110969 0.39549
v -0.2830744 0.1943149 0.1428556
v -0.1294096 0.1828401 0.39549
v -0.1679255 0.1918652 0.1428556
v 0 0.0752942 0.39549
v -0.0413326 0.1096438 0.1428556
v 0.3534441 -0.2184358 0.39549
v 0.2591317 -0.3244095 0.39549
v 0.2959161 -0.2830769 0.1428556
v 0.2124555 -0.3667343 0.39549
v 0.2273636 -0.353216 0.1428556
v 0.1627719 -0.4088033 0.39549
v 0.1786406 -0.3953667 0.1428556
v 0.13131 -0.4314917 0.1428556
v 0.1135194 -0.4443212 0.39549
v 0.09702504 -0.4541948 0.1428556
v 0.0678556 -0.4716558 0.3954899
v 0 -0.5043787 0.39549
v 0.02167273 -0.4939272 0.1428556
v -0.0678556 -0.4716558 0.39549
v -0.04618287 -0.4821073 0.1428556
v -0.09702504 -0.4541948 0.1428556
v -0.1135194 -0.4443212 0.39549
v -0.1627718 -0.4088034 0.39549
v -0.13131 -0.4314917 0.1428556
v -0.2124554 -0.3667344 0.3954899
v -0.1965867 -0.380171 0.1428556
v -0.2591317 -0.3244096 0.39549
v -0.2442236 -0.3379279 0.1428556
v -0.3375167 -0.2363327 0.1428556
v 0.07206357 0.01540571 0.39549
v 0.1100798 -0.01618767 0.39549
v 0.147617 -0.04738301 0.39549
v 0.1919156 -0.08419743 0.39549
v 0 -0.195 0.39549
v 0.07248414 0.1355323 0.39549
v 0.4330671 0.05104023 0.39549
v 0.4346666 -0.06559044 0.39549
v 0.4341384 -0.02707452 0.1428556
v 0.3743011 -0.195 0.39549
v 0.3935815 -0.1536673 0.1428556
v 0.1101813 0.126699 0.39549
v 0.1869668 0.1087066 0.39549
v 0.281545 0.08654499 0.39549
v 0.4281498 0.05219245 0.39549
v 0.2394586 -0.123708 0.39549
v 0.3252439 -0.195 0.39549
v 0.1294096 0.1828401 0.39549
v 0.08807695 0.1484906 0.1428556
v 0.25 0.2110969 0.39549
v 0.2114841 0.2020719 0.1428556
v 0.3535534 0.1585534 0.39549
v 0.320479 0.1753355 0.1428556
v 0.4330127 0.05500001 0.39549
v 0.4076339 0.08807439 0.1428556

vt -1.418846 -1.280302
vt -1.597173 -0.8980137
vt -1.912036 -0.005302384
vt -1.816022 -0.005302384
vt -1.596825 -0.00530237
vt -1.636999 -0.1400673
vt -1.371402 -0.00530237
vt -1.061426 -0.00530237
vt -0.8619985 -0.005302388
vt -0.8619985 -0.07562921
vt -1.021319 -0.1987635
vt -0.9337631 -0.09244512
vt -0.9502931 -0.3009767
vt -1.025152 -0.203418
vt -0.9539857 -0.2961643
vt -1.033445 -0.1926109
vt -1.136998 -0.1400674
vt -1.257589 -0.1683242
vt -1.314514 -0.2156321
vt -0.9539315 -0.3001242
vt -0.9491651 -0.6396651
vt -0.9523319 -0.4167547
vt -1.026402 -0.575544
vt -1.012698 -0.5461645
vt -1.386999 -0.2758701
vt -1.08039 -0.2704923
vt -0.8619983 -0.7121718
vt -1.033554 -0.5696001
vt -0.8619984 -1.280303
vt -1.503859 -1.098056
vt -1.127867 -0.6755738
vt -1.530589 -1.040752
vt -1.174543 -0.7178985
vt -1.537737 -1.025429
vt -1.224227 -0.7599679
vt -1.551482 -0.9959638
vt -1.273479 -0.7954853
vt -1.563903 -0.9693351
vt -1.319144 -0.8228205
vt -1.574749 -0.9460844
vt -1.386999 -0.8555431
vt -1.512396 -0.7950709
vt -1.683735 -0.7124438
vt -1.508703 -0.7905861
vt -1.700972 -0.6754926
vt NaN NaN
vt -1.718237 -0.6384801
vt -1.734551 -0.6035067
vt -1.741108 -0.5894509
vt -1.454854 -0.8228201
vt -1.500518 -0.7954853
vt -1.207599 -0.4249601
vt -1.516408 -0.1683242
vt -1.54977 -0.7599678
vt -1.599454 -0.7178986
vt -1.64613 -0.6755739
vt -1.761268 -0.54612
vt -1.821687 -0.4167942
vt -1.820011 -0.2961643
vt -1.740552 -0.1926109
vt 0.07188261 -1.280302
vt -0.6281174 -1.280302
vt 0.07188261 -0.00530237
vt -0.6281174 -0.00530237
vt 1.911999 -0.2231014
vt 1.911999 -1.280302
vt 1.821598 -0.4167391
vt 1.817628 -0.1199207
vt 1.911973 -0.00527931
vt 1.820011 -0.2961642
vt 1.748845 -0.203418
vt 1.59684 -0.005290486
vt 1.816022 -0.00530237
vt 1.740552 -0.1926109
vt 1.371402 -0.00530237
vt 1.636999 -0.1400674
vt 1.061426 -0.005302347
vt 1.257589 -0.1683242
vt 0.8619986 -0.005302377
vt 1.136998 -0.1400673
vt 0.8619984 -0.0756291
vt 1.033445 -0.1926109
vt 0.9502931 -0.3009765
vt 0.8619984 -0.2796037
vt 0.9539858 -0.2961643
vt 1.314514 -0.215632
vt 1.516408 -0.1683242
vt 1.386999 -0.2758701
vt 0.9539315 -0.300124
vt 0.9492748 -0.6396405
vt 0.8619984 -0.3216658
vt 0.9523319 -0.4167547
vt 1.026402 -0.5755439
vt 1.012698 -0.5461643
vt 1.503859 -1.098056
vt 1.418846 -1.280302
vt 0.8619984 -1.280302
vt 1.248438 -0.8110538
vt 1.033554 -0.5696001
vt 0.8619984 -0.7121717
vt 1.530603 -1.040784
vt 1.127871 -0.6755708
vt 1.537737 -1.025429
vt 1.260767 -0.7960839
vt 1.174544 -0.7178993
vt 1.551482 -0.9959637
vt 1.263278 -0.7930342
vt 1.265813 -0.7899568
vt 1.224227 -0.7599676
vt 1.563903 -0.9693351
vt 1.273479 -0.7954854
vt 1.574749 -0.9460843
vt 1.319143 -0.8228202
vt 1.683735 -0.7124438
vt 1.386999 -0.855543
vt 1.700972 -0.6754925
vt 1.454854 -0.82282
vt 1.718237 -0.6384801
vt 1.500518 -0.7954854
vt 1.734551 -0.6035068
vt 1.549771 -0.7599676
vt 1.741107 -0.589451
vt 1.599454 -0.7178989
vt 1.761299 -0.5461643
vt 1.64613 -0.6755738
vt 0.6281174 -0.02290705
vt 0.6184521 -0.02290705
vt 0.6281174 -0.005302399
vt -0.07188249 -0.02290443
vt -0.07188255 -0.005299777
vt 0.6281174 -0.374388
vt 0.4254822 -0.374388
vt -0.07188267 -0.374388
vt 0.6281174 -0.8991582
vt 0.1373731 -0.8991582
vt -0.07188261 -0.8991582
vt 0.6281174 -1.280302
vt -0.07188261 -1.280302
vt 0.9701865 0.06969778
vt 0.9624397 -0.03437562
vt 0.8696976 -0.0229069
vt 0.8696975 -0.00530237
vt 0.9701878 -0.03533371
vt 0.9377573 -0.3659717
vt 0.8696979 -0.3743881
vt 0.970186 -0.3619613
vt 0.8990214 -0.8862944
vt 0.869693 -0.8991576
vt 0.9701883 -0.855085
vt 0.8696932 -1.280302
vt 0.9701884 -1.280302
vt -0.1218826 0.3774507
vt 0.6281174 0.2388687
vt -0.07188261 0.2388687
vt 0.6781174 0.3774508
vt -0.398499 -0.02308038
vt -0.3970978 -0.005302399
vt -0.3970978 -0.02290705
vt -0.3986357 -0.02307983
vt -0.3972305 -0.374388
vt -0.4260426 -0.3708257
vt -0.4653258 -0.8692927
vt -0.3972315 -0.8991582
vt -0.3972315 -1.280302
vt -0.497723 -0.8550851
vt 0.8831098 0.2126214
vt 0.9160287 0.1580426
vt 0.817209 0.08085635
vt -0.3652082 0.2605733
vt 1.812936 0.07188255
vt 1.911999 0.07188261
vt 1.812936 0.005840898
vt 1.911999 -0.6281174
vt 1.812936 -0.6281174
vt 1.424177 0.0719775
vt 1.424177 -0.253332
vt 1.424177 -0.6281174
vt 0.9279696 0.07188267
vt 0.9279696 -0.5841366
vt 0.9279697 -0.6281174
vt 0.8619984 0.07188261
vt 0.8619984 -0.6281174
vt 0.6368402 0.1218826
vt 0.5747081 -0.6781174
vt 0.5747081 0.1218826
vt 0.6368402 -0.6781174
vt 1.376534 -0.6781173
vt 1.376534 -0.01031923
vt 1.386801 0.1218826
vt 1.386809 -0.6781174
vt 1.376529 0.1218836
vt 1.324671 -0.6781173
vt 1.324671 0.1218826
vt 1.814179 -0.3022893
vt 1.986999 -0.3098937
vt 1.814266 -0.3098937
vt 1.813663 -0.2570901
vt 1.986999 -0.2570902
vt 1.484464 -0.2877814
vt 1.498582 -0.3098934
vt 1.46487 -0.2570902
vt 1.051578 -0.2687335
vt 1.119073 -0.3098923
vt 1.032488 -0.2570926
vt 0.8576092 -0.2601971
vt 0.907364 -0.3098925
vt 0.8544992 -0.2570818
vt 0.7869983 -0.2570907
vt 0.7869985 -0.3098924
vt 1.813551 -0.5025741
vt 1.986999 -0.5180671
vt 1.813663 -0.5180671
vt 0.9264627 -0.09587047
vt 0.9073639 -0.07940443
vt 1.285399 -1.280302
vt 1.338201 0.06969768
vt 1.338201 -1.280302
vt 1.285406 0.05137098
vt 1.29568 0.06969768
vt 1.285401 0.0697
vt 1.018223 -0.04475558
vt 1.0227 0.06969768
vt 1.0227 -0.04562837
vt 0.9698536 -0.03531197
vt 0.9699049 0.06969775
vt 1.006225 -0.3515228
vt 1.022652 -0.3445738
vt 0.9914649 -0.3577571
vt 0.9699038 -0.3619611
vt 1.006092 -0.3548942
vt 1.022706 -0.3516667
vt 0.9869973 -0.8432651
vt 1.022706 -0.8185737
vt 0.9699028 -0.8550848
vt 0.9699036 -1.280302
vt 1.022706 -1.280302
vt 0.9051954 -0.8185737
vt -1.813758 0.04388109
vt -1.479138 0.0291063
vt -1.813663 0.05145118
vt -1.096728 0.01236357
vt -1.46487 0.05145258
vt -0.902285 0.003723025
vt -1.032488 0.05145282
vt -0.8544983 0.05145282
vt -0.6613594 0.06969771
vt -0.6654969 -0.0361409
vt -0.6829194 -0.3577575
vt -0.6613618 -0.03533383
vt -0.7141606 -0.3445683
vt -0.6781136 -0.3586946
vt -0.6613603 -0.3619614
vt -0.71416 -0.8185737
vt -0.6965777 -0.8307325
vt -0.6613594 -1.280302
vt -1.594612 0.05256611
vt -1.593941 0.05137086
vt -1.593942 -1.280302
vt -1.604213 0.0697099
vt 0.828943 -0.6467037
vt 0.828943 -0.2069114
vt 0.8804574 0.07188261
vt 0.8804574 -0.6281174
vt 0.8289429 0.09046888
vt 0.8291587 -0.6466639
vt 0.7418764 -0.6781174
vt 0.8290005 -0.2068964
vt 0.741657 0.1218674
vt 1.812936 -0.4175779
vt 1.911999 -0.4175777
vt 1.445275 -0.4696781
vt 1.424177 -0.4175778
vt 1.424177 -0.4174827
vt 1.46487 -0.5180669
vt 0.9347265 -0.4240714
vt 0.9279698 -0.4175751
vt 1.032488 -0.518067
vt 0.8619986 -0.417575
vt 0.8544983 -0.518067
vt 0.8234679 -0.4692035
vt 0.7869985 -0.5180672
vt 1.815872 -0.2008813
vt 1.911999 -0.2122306
vt 1.816022 -0.2122306
vt 1.986999 -0.07940552
vt 1.566669 -0.1714587
vt 1.596825 -0.212231
vt 1.814266 -0.0794055
vt 1.371402 -0.2122304
vt 1.498582 -0.07940549
vt 1.215091 -0.1299858
vt 1.119085 -0.07944231
vt 0.7869985 -0.0794054
vt 1.061425 -0.2122304
vt 0.8619986 -0.2122303
vt 1.030864 -0.07401244
vt 1.038022 -0.005302381
vt 1.038022 -0.07562916
vt 0.9051387 -0.0455791
vt 0.905195 0.06969769
vt 1.03802 -0.2796037
vt 1.00791 -0.2943305
vt 0.9051951 -0.3445683
vt 1.03802 -0.3216659
vt 1.004268 -0.3292894
vt 0.9051952 -0.3516666
vt 0.9576759 -0.7765327
vt 0.905195 -1.280302
vt 1.03802 -0.7121717
vt 1.03802 -1.280302
vt 1.066832 0.01930231
vt 1.022706 -0.04134324
vt 0.9699037 -0.04134324
vt 0.8505083 -0.03374305
vt 0.902755 0.02006468
vt 0.9827084 -0.1098388
vt 1.766462 0.04669404
vt 1.635901 -1.280302
vt 1.635901 -0.2231013
vt 1.768728 0.05137098
vt 1.768728 -1.280302
vt 1.768723 0.06969911
vt 1.635901 -0.00530237
vt 0.4937874 -1.280302
vt 0.5942767 -0.00530237
vt 0.5942764 -1.280302
vt 0.4937875 0.06969768
vt -0.6781174 -0.6841103
vt 0.07188261 -0.8226923
vt -0.6281174 -0.8226922
vt 0.1218826 -0.6841103
vt 1.820964 0.1218826
vt 1.682382 -0.6281174
vt 1.682382 0.07188261
vt 1.820964 -0.6781174
vt -1.066743 -0.00530237
vt -0.9662544 0.06969768
vt -0.9662544 -1.280302
vt -1.066743 -1.280302
vt -1.802628 -0.1845209
vt -1.783959 -0.2231015
vt -1.783959 -1.280302
vt -1.916784 0.06969737
vt -1.986999 0.06865368
vt -1.814535 0.04829116
vt -1.814266 0.06865329
vt -1.537808 0.01561898
vt -1.498582 0.06865332
vt -1.037405 -0.04346198
vt -1.278078 -0.01504621
vt -1.119073 0.06865303
vt -0.9073639 0.06865316
vt -0.7869985 0.06865321
vt 1.813 -0.04608746
vt 1.812936 -0.05488953
vt 1.441206 -0.01283556
vt 1.424177 -0.05488846
vt 0.9279695 -0.05488846
vt 1.011619 0.02553692
vt 0.8619989 -0.05488728
vt 0.8508749 0.03989345
vt -0.7571366 0.06969769
vt -0.768741 -0.04824957
vt -0.7571365 -0.04562847
vt -0.889961 -0.2796037
vt -0.7960245 -0.3255489
vt -0.7976927 -0.3425064
vt -0.8899612 -0.3216659
vt -0.7571365 -0.3516668
vt -0.8381477 -0.7536783
vt -0.7571366 -1.280302
vt 1.050586 0.06954065
vt 0.9502929 0.01930037
vt 0.9868488 0.06953867
vt -0.6783054 0.2940379
vt -0.7420408 0.294041
vt 1.351782 -0.7187786
vt 1.357824 -0.7270809
vt 1.348734 -0.7225291
vt 1.33818 -0.7877485
vt 1.318129 -0.7601435
vt 1.295677 -0.7877356
vt 1.310023 -0.7701032
vt 1.257527 -0.6768405
vt 1.321256 -0.6768588
vt 1.285386 -0.7877538
vt 1.24126 -0.7271081
vt 1.931688 -0.3941714
vt 1.880377 -0.4319819
vt 1.794409 -0.3406993
vt 1.750163 -0.1903043
vt 1.830117 -0.06040087
vt 1.882364 -0.1142086
vt 0.194755 -0.5295023
vt 0.0959353 -0.452316
vt 0.1288541 -0.3977372
vt -1.418846 -0.4068854
vt -2.136999 0.07188261
vt -1.418846 0.1142457
vt -1.418847 0.1305737
vt -1.418846 0.156365
vt -1.911999 0.2218826
vt -1.418846 0.2218826
vt -2.083966 0.1572379
vt -2.040031 0.1865273
vt -1.418846 -0.778118
vt -1.911998 -0.7781178
vt -2.040031 -0.7427621
vt -2.136999 -0.6281174
vt -2.083966 -0.7134728
vt -0.8619985 -0.7781174
vt -0.6900313 0.1572379
vt -0.6369985 0.07188258
vt -0.7339653 -0.7427621
vt -0.6369985 -0.6281174
vt -0.6900315 -0.7134728
vt -0.7339662 0.1865368
vt -0.8619985 0.2218832
vt -1.618561 -0.5456146
vt -1.626666 -0.5356539
vt -1.64002 -0.5192392
vt -1.56606 -0.452361
vt -1.629801 -0.4523578
vt -1.660314 -0.4942973
vt 0.8453738 -0.6360987
vt 0.8385089 -0.6090801
vt 0.8895392 -0.5892031
vt 0.8035717 -0.6804872
vt 0.7522601 -0.6426767
vt 0.8385096 0.08896382
vt 0.8453745 0.1159833
vt -0.6467564 -0.3497849
vt 1.794409 -0.1794177
vt 0.5254828 0.3924029
vt 0.7781172 0.3467945
vt 0.7781172 0.2496064
vt 0.5254337 0.2496505
vt 0.7781174 0.3924045
vt 0.5254828 -0.3210965
vt 0.7781171 -0.359616
vt 0.7781171 -0.4416982
vt 0.5254831 -0.4416976
vt 0.7781175 -0.3210944
vt 0.5254831 -1.212389
vt 0.7781175 -1.254079
vt 0.7781175 -1.342916
vt 0.5254833 -1.342915
vt 0.7781174 -1.21239
vt -1.523205 -0.5254832
vt -1.560293 -0.7781175
vt -1.639326 -0.7781175
vt -1.639327 -0.5254831
vt -1.523206 -0.7781175
vt -1.438016 -0.5254831
vt -1.477575 -0.7781176
vt -1.561872 -0.7781175
vt -1.561873 -0.5254829
vt -1.438016 -0.7781175
vt -0.8903973 -0.5254827
vt -0.94414 -0.7781171
vt -1.058662 -0.778117
vt -1.058661 -0.5254831
vt -0.8903954 -0.7781174
vt -0.7781175 -1.112616
vt -0.5254832 -1.112616
vt -0.5254832 -1.25448
vt -0.7781174 -1.199149
vt -0.7781174 -1.25448
vt 1.35233 -0.525483
vt 1.332205 -0.7781174
vt 1.289321 -0.7781174
vt 1.289321 -0.5254831
vt 1.35233 -0.7781174
vt 1.425381 -0.525483
vt 1.404588 -0.7781174
vt 1.360279 -0.7781174
vt 1.360279 -0.5254831
vt 1.425382 -0.7781174
vt 1.43748 -0.7781174
vt 1.43748 -0.5254831
vt 1.47627 -0.7781174
vt 1.498203 -0.5254831
vt 1.498203 -0.7781174
vt 1.520468 -0.7781174
vt 1.554464 -0.5254831
vt 1.554464 -0.7781174
vt 1.501245 -0.7781174
vt 1.501245 -0.5254831
vt 1.62094 -0.5254831
vt 1.596879 -0.7781174
vt 1.545606 -0.7781174
vt 1.545606 -0.5254831
vt 1.62094 -0.7781174
vt 0.9530249 -0.525483
vt 0.9289637 -0.7781173
vt 0.8776911 -0.7781173
vt 0.8776915 -0.5254831
vt 0.9530263 -0.7781174
vt 0.8596771 -0.7781171
vt 0.8256809 -0.5254828
vt 0.878901 -0.5254828
vt 0.8789048 -0.7781174
vt 0.8256787 -0.7781174
vt 0.8124967 -0.5254828
vt 0.7737074 -0.7781171
vt 0.7517734 -0.7781171
vt 0.7517749 -0.5254831
vt 0.8124988 -0.7781174
vt 0.7567409 -0.5254831
vt 0.7359477 -0.7781174
vt 0.6916391 -0.7781174
vt 0.6916393 -0.5254831
vt 0.7567409 -0.7781173
vt 0.7656397 -0.5254832
vt 0.7455151 -0.7781175
vt 0.7026312 -0.7781175
vt 0.7026306 -0.5254831
vt 0.7656374 -0.7781173
vt 0.5254832 0.7629398
vt 0.7781175 0.7076091
vt 0.7781175 0.5897034
vt 0.5254829 0.5897033
vt 0.7781174 0.7629393
vt 1.314935 -0.3357586
vt 1.276919 -0.3673519
vt 1.239382 -0.3985473
vt 1.195083 -0.4353617
vt 1.386998 -0.5461643
vt -1.148792 -0.5254831
vt -1.148792 -0.7781174
vt -1.24304 -0.7781174
vt -1.24304 -0.5254831
vt -0.7781175 -0.2870143
vt -0.5254831 -0.2870143
vt -0.5254831 -0.403656
vt -0.7781173 -0.3651359
vt -0.7781174 -0.4036562
vt -0.525483 -0.9230682
vt -0.7781173 -0.8774598
vt -0.7781173 -0.7802717
vt -0.5254831 -0.7802717
vt -0.7781175 -0.923069
vt -0.7781175 -1.081244
vt -0.5254833 -1.081244
vt 1.276817 -0.2244653
vt 1.200032 -0.2424577
vt 1.105453 -0.2646193
vt 0.9588487 -0.2989718
vt 1.14754 -0.4748723
vt 1.061755 -0.5461643
vt -1.074776 -0.5254831
vt -1.12852 -0.7781171
vt -1.074775 -0.7781175
vt -1.138969 -0.5254831
vt -1.178528 -0.7781175
vt -1.262826 -0.7781174
vt -1.262826 -0.5254831
vt -1.138969 -0.7781174
vt -0.8344413 -0.5254831
vt -0.8715298 -0.7781174
vt -0.9505624 -0.7781174
vt -0.950686 -0.5255115
vt -0.8344415 -0.7781174
vt -0.5254829 0.3457872
vt -0.7781172 0.3874766
vt -0.7781172 0.4763135
vt -0.5254831 0.4763131
vt -0.7781174 0.3457866
vt -0.5254831 -0.2869951
vt -0.7781174 -0.2869951
vt -0.7781174 -0.2830348
vt -0.5254831 -0.2830382

vn 0 -0.8944272 0.4472136
vn 0 0 1
vn -0.1184758 0.07351691 0.9902316
vn 4.21051E-08 0.1611091 0.9869366
vn -6.438353E-08 0.1343067 0.9909399
vn 0.07351689 0.1184752 0.9902318
vn 0.1343067 -1.065346E-08 0.9909399
vn 0.05962716 -0.8960451 0.4399407
vn -0.224771 -0.9722982 0.06414093
vn -0.8092536 -0.5680168 -0.1498852
vn -0.9788486 0.1830412 0.09138571
vn -0.9467378 0.1294406 -0.2948434
vn 0 0 -1
vn 0.9616134 2.68487E-08 -0.2744077
vn 1 0 0
vn 0.9727665 0.1739418 -0.1531975
vn 0.973586 0.1048544 0.2028198
vn 0.9907326 -7.505075E-08 0.1358271
vn 0.7664827 -0.5680166 -0.2997688
vn 0.7841823 -0.6111463 0.1075106
vn 0.7065575 0.1986135 -0.6792122
vn 0.8494003 -4.918231E-08 -0.5277492
vn 0.7478002 -1.009944E-07 -0.6639239
vn 0.7183489 1.249733E-07 -0.695683
vn 0.6875504 9.915496E-08 -0.7261367
vn 0.6736156 -0.2003074 -0.7114204
vn 0.8619673 0.486229 0.1435053
vn 0.7686121 0.5479324 -0.3301596
vn 0.8494291 3.232367E-08 0.5277027
vn 0.7477999 -5.511926E-08 0.6639242
vn -2.038872E-08 0.983277 0.1821166
vn -0.1199052 0.9852455 0.1221229
vn -7.147091E-08 1 -3.054628E-08
vn -0.1739422 0.9727664 -0.1531978
vn -1.512256E-08 0.9616132 -0.2744083
vn -6.094457E-08 0.9907324 0.1358287
vn 1.222974E-07 0.9444146 -0.3287572
vn 0.218099 0.9729645 0.07597943
vn 0.1078791 0.9633163 -0.2457314
vn 0.5367008 0.8359938 0.1143091
vn 0.4330919 0.8642269 -0.2560143
vn -0.6492288 0.6492282 -0.3962382
vn -0.7071072 0.7071064 -2.80291E-07
vn -0.7775528 0.6156939 0.1277989
vn -0.8077558 0.488501 -0.3299963
vn -0.6825089 0.6825083 0.2614651
vn -0.5442507 0.8056684 -0.2338584
vn -0.5546861 0.8210022 0.1351989
vn 1.023691E-08 0.5547009 -0.8320498
vn -0.2419559 0.4468624 -0.8612615
vn 6.320088E-09 0.4871898 -0.8732961
vn -1.380122E-08 0.7478005 -0.6639236
vn -0.255732 0.6713714 -0.6956016
vn 8.379248E-09 0.7183484 -0.6956836
vn -4.436558E-08 0.6875495 -0.7261375
vn 0.2229976 0.642473 -0.7331442
vn 0.2377176 0.4090077 -0.8810238
vn -7.730591E-10 0.8494003 -0.5277492
vn -4.23996E-09 0.2661796 -0.9639235
vn -0.3800789 -0.5191259 -0.7655379
vn -0.6330098 0.2868167 -0.7190513
vn -0.725762 -0.3220598 -0.6079038
vn -0.4157004 -3.378863E-07 -0.9095016
vn -0.5370105 0.2505243 -0.8055168
vn -0.3449764 0.1124185 -0.9318548
vn 0.5547054 5.305257E-08 -0.8320468
vn 0.3955629 0.1127036 -0.9114977
vn 0.4447037 1.185109E-07 -0.8956777
vn 0.4871944 5.711823E-06 -0.8732935
vn 0.2285578 -0.8352896 -0.5000526
vn 3.145944E-08 0.554701 0.8320497
vn 0 0.6875483 0.7261385
vn 1.007878E-08 0.7183483 0.6956837
vn -1.563571E-07 0.7477989 0.6639253
vn 0.6712453 0.1984047 0.7141886
vn 0.5546963 1.301714E-07 0.832053
vn 0.687544 1.920715E-07 0.7261428
vn 0.4157046 3.125228E-07 0.9094996
vn 0.718348 1.54159E-07 0.6956839
vn 0.4446954 2.761473E-08 0.8956819
vn 0.2318269 -0.9507328 0.2058238
vn -0.5546992 -1.58679E-06 0.832051
vn -0.4446951 -4.69461E-09 0.895682
vn -0.2403583 -0.7104661 0.661412
vn -0.5370073 0.2505284 0.8055176
vn 0.3300272 0.9328668 -0.1443661
vn 0.3826829 0.9238797 0
vn 0.3395016 0.9329012 0.1201419
vn 0.1194927 0.8869717 -0.4460973
vn -0.1101939 0.1775815 -0.9779173
vn 0.1775808 0.1101939 -0.9779174
vn 0.2661793 9.505809E-09 -0.9639236
vn 0.05220218 -0.9805807 -0.1890409
vn -0.2661797 -2.305109E-07 -0.9639235
vn -0.1476503 -0.8320504 -0.5346884
vn -0.6638871 0.2556101 0.7027925
vn -0.2819684 -0.8974519 0.3392256
vn -0.2661809 7.978713E-10 0.9639231
vn -0.1611101 5.929166E-08 0.9869365
vn -0.02152953 -0.9706003 0.2397321
vn -0.4134158 0.1693587 0.8946536
vn -0.1692011 0.370188 0.9134177
vn 2.401008E-08 0.2661796 0.9639235
vn -1.554517E-08 0.4157027 0.9095006
vn 5.561247E-08 0.4446979 0.8956806
vn 0.1127033 0.395561 0.9114985
vn 4.415389E-08 0.8494003 0.5277491
vn 0.370188 0.1692013 0.9134176
vn 0.2661795 5.72828E-08 0.9639235
vn 0.4157037 -9.624641E-08 0.9095001
vn 0.1150984 2.25505E-08 0.9933541
vn 0.1611086 4.046163E-07 0.9869367
vn 0.3862827 -5.589916E-08 0.9223804
vn 0.09962016 -0.9708614 0.2179543
vn 0.2236451 0.683303 0.6950394
vn -0.4850702 0.485069 -0.7276091
vn -5.530109E-09 -1 1.284472E-07
vn -0.4850696 0.4850752 0.7276053
vn -0.1984041 0.6712462 0.7141879
vn 0.1023989 0.8827711 0.458508
vn 0.9475344 0.3196537 8.155948E-08
vn 0.9062517 0.4227386 1.608517E-07
vn 0.8612438 0.508192 9.146874E-08
vn 0.7930889 0.6091059 -1.591761E-08
vn 0.9908744 0.1347884 8.109171E-08
vn 0.9856369 -0.1688784 1.067917E-08
vn 0.999906 -0.01371358 9.317074E-08
vn 0.9029261 -0.4297957 -4.673557E-08
vn 0.721539 -0.6923738 -3.328016E-08
vn 0.7933533 -0.6087615 6.489252E-09
vn 0.578876 -0.8154156 -1.062896E-07
vn 0.2956576 -0.955294 -1.417774E-07
vn 0.4524883 -0.8917704 -1.559185E-07
vn -0.001336886 -0.9999991 -8.243187E-08
vn -0.3376316 -0.9412783 -5.969809E-08
vn -0.2281416 -0.973628 -2.158005E-09
vn -0.5143349 -0.8575894 -1.039791E-07
vn -0.3837173 -0.9234506 -9.141785E-08
vn -0.6391481 -0.7690838 -1.522723E-07
vn 0.2669632 -0.9637067 0
vn -0.7470115 0.6648112 1.14192E-08
vn -0.7289743 0.684541 8.573603E-09
vn -0.6977131 0.7163772 8.77909E-08
vn -0.6654226 0.7464669 6.576653E-08
vn -0.6717335 0.740793 1.315188E-07
vn -0.6547971 0.7558047 -1.90706E-09
vn -0.6221387 0.7829069 5.725546E-08
vn -0.6462025 0.7631661 -2.860223E-09
vn -0.6160241 0.7877273 9.575444E-08
vn -0.5849131 0.811096 9.726324E-08
vn -0.5616022 0.8274074 3.35024E-08
vn -0.5378164 0.843062 2.153304E-07
vn -0.5136153 0.8580207 3.22734E-07
vn -0.4941803 0.8693594 1.614898E-07
vn -0.461203 0.8872947 -4.5193E-08
vn -0.2344036 0.9721394 -3.654881E-08
vn -0.4343722 0.9007335 -6.772843E-08
vn 0.1587107 0.9873251 4.949299E-08
vn 0.4665239 0.8845086 7.379343E-08
vn 0.4343722 0.9007335 6.772843E-08
vn 0.4744753 0.8802688 0
vn 0.5136154 0.8580205 7.771711E-08
vn 0.5378162 0.8430622 7.77801E-08
vn 0.5616013 0.827408 6.451508E-08
vn 0.6005763 0.7995674 4.837459E-08
vn 0.5849131 0.811096 9.669426E-08
vn 0.6261938 0.7796674 1.908099E-09
vn 0.6526554 0.7576549 1.430266E-09
vn 0.6462024 0.7631661 2.860223E-09
vn 0.663307 0.7483474 -5.166883E-08
vn 0.691294 0.7225736 -3.878828E-08
vn 0.6717324 0.7407939 -7.749332E-08
vn 0.7228383 0.6910173 -2.108259E-08
vn 0.7470119 0.6648108 -3.158366E-08
vn 0.6391479 -0.7690839 0
vn -0.9999059 -0.01371779 -3.256265E-08
vn -0.948594 -0.01301796 -0.3162278
vn -0.9952616 0.09723331 -1.259674E-08
vn -0.9589413 0.2836047 -3.424792E-08
vn -0.8733428 0.4871061 -2.490319E-08
vn -0.9062517 0.4227385 -7.434723E-08
vn -0.8076607 0.5896475 0
vn 0.5473191 -0.836924 1.556896E-07
vn 0.3740072 -0.9274258 -7.695523E-08
vn 0.06072053 -0.9981548 -5.900836E-08
vn 0.2281409 -0.9736282 -1.126972E-07
vn -0.2384044 -0.971166 9.525272E-10
vn -0.5478812 -0.8365562 6.88858E-10
vn -0.4524887 -0.8917702 1.352126E-09
vn -0.6950595 -0.7189522 -5.337883E-08
vn -0.8500588 -0.4627614 -0.2514993
vn -0.7933533 -0.6087615 -1.501159E-07
vn -0.9750268 -0.2220872 -5.12671E-08

usemtl ProBuilderDefault
f 63/63/11 62/62/10 61/61/9
f 63/63/11 64/64/12 62/62/10
f 128/128/16 127/127/15 126/126/14
f 130/130/17 129/129/15 127/127/15
f 128/128/16 130/130/17 127/127/15
f 132/132/15 131/131/14 126/126/14
f 127/127/15 132/132/15 126/126/14
f 133/133/18 132/132/15 127/127/15
f 129/129/15 133/133/18 127/127/15
f 135/135/15 134/134/14 131/131/14
f 132/132/15 135/135/15 131/131/14
f 136/136/18 135/135/15 132/132/15
f 133/133/18 136/136/18 132/132/15
f 138/138/20 137/137/19 134/134/14
f 135/135/15 138/138/20 134/134/14
f 136/136/18 138/138/20 135/135/15
f 126/141/14 140/140/22 139/139/21
f 128/142/16 126/141/14 139/139/21
f 141/143/23 139/139/21 140/140/22
f 131/145/14 142/144/22 140/140/22
f 126/141/14 131/145/14 140/140/22
f 141/143/23 140/140/22 142/144/22
f 143/146/24 141/143/23 142/144/22
f 134/148/14 144/147/22 142/144/22
f 131/145/14 134/148/14 142/144/22
f 143/146/24 142/144/22 144/147/22
f 145/149/25 143/146/24 144/147/22
f 134/148/14 137/150/19 144/147/22
f 146/151/26 145/149/25 144/147/22
f 137/150/19 146/151/26 144/147/22
f 130/154/17 128/153/16 147/152/27
f 128/153/16 148/155/28 147/152/27
f 129/158/29 130/157/17 149/156/29
f 128/168/16 139/167/21 148/166/28
f 155/172/33 154/171/32 153/170/31
f 156/173/34 154/171/32 155/172/33
f 157/174/35 156/173/34 155/172/33
f 155/172/33 153/170/31 158/175/36
f 159/176/33 155/172/33 158/175/36
f 157/174/35 155/172/33 159/176/33
f 160/177/35 157/174/35 159/176/33
f 159/176/33 158/175/36 161/178/36
f 162/179/33 159/176/33 161/178/36
f 160/177/35 159/176/33 162/179/33
f 163/180/37 160/177/35 162/179/33
f 162/179/33 161/178/36 164/181/38
f 165/182/39 162/179/33 164/181/38
f 165/182/39 163/180/37 162/179/33
f 147/185/27 148/184/28 166/183/40
f 148/184/28 167/186/41 166/183/40
f 170/189/44 169/188/43 168/187/42
f 171/190/45 170/189/44 168/187/42
f 170/189/44 172/191/46 169/188/43
f 169/188/43 173/192/47 168/187/42
f 174/193/48 173/192/47 169/188/43
f 172/191/46 174/193/48 169/188/43
f 177/196/51 176/195/50 175/194/49
f 179/198/53 178/197/52 175/194/49
f 176/195/50 179/198/53 175/194/49
f 177/196/51 175/194/49 180/199/49
f 181/200/51 177/196/51 180/199/49
f 182/201/54 180/199/49 175/194/49
f 178/197/52 182/201/54 175/194/49
f 181/200/51 180/199/49 183/202/49
f 184/203/51 181/200/51 183/202/49
f 185/204/55 183/202/49 180/199/49
f 182/201/54 185/204/55 180/199/49
f 184/203/51 183/202/49 186/205/49
f 187/206/51 184/203/51 186/205/49
f 188/207/54 186/205/49 183/202/49
f 185/204/55 188/207/54 183/202/49
f 187/206/51 186/205/49 189/208/56
f 190/209/57 187/206/51 189/208/56
f 188/207/54 189/208/56 186/205/49
f 178/212/52 179/211/53 191/210/58
f 195/217/62 194/216/61 193/215/60
f 197/219/64 196/218/63 193/215/60
f 194/216/61 197/219/64 193/215/60
f 197/219/64 198/220/65 196/218/63
f 201/223/68 200/222/67 199/221/66
f 139/225/21 141/224/23 199/221/66
f 200/222/67 139/225/21 199/221/66
f 201/223/68 199/221/66 202/226/66
f 203/227/69 201/223/68 202/226/66
f 204/228/66 202/226/66 199/221/66
f 143/229/24 204/228/66 199/221/66
f 141/224/23 143/229/24 199/221/66
f 203/227/69 202/226/66 205/230/66
f 206/231/69 203/227/69 205/230/66
f 204/228/66 205/230/66 202/226/66
f 206/231/69 205/230/66 207/232/66
f 208/233/69 206/231/69 207/232/66
f 145/234/25 207/232/66 205/230/66
f 143/229/24 145/234/25 205/230/66
f 208/233/69 207/232/66 146/235/26
f 209/236/70 208/233/69 146/235/26
f 145/234/25 146/235/26 207/232/66
f 164/262/38 233/261/87 232/260/86
f 165/263/39 164/262/38 232/260/86
f 164/262/38 234/264/88 233/261/87
f 233/261/87 167/266/41 232/265/86
f 166/268/40 167/266/41 233/267/87
f 234/264/88 166/268/40 233/261/87
f 157/269/35 191/210/58 179/211/53
f 156/270/34 157/269/35 179/211/53
f 160/272/35 235/271/58 191/210/58
f 157/269/35 160/273/35 191/210/58
f 178/212/52 191/210/58 235/271/58
f 182/274/54 178/212/52 235/271/58
f 163/276/37 236/275/58 235/271/58
f 160/272/35 163/276/37 235/271/58
f 182/274/54 235/271/58 236/275/58
f 185/277/55 182/274/54 236/275/58
f 163/276/37 165/278/39 236/275/58
f 188/279/54 185/277/55 236/275/58
f 237/280/89 188/279/54 236/275/58
f 165/278/39 237/280/89 236/275/58
f 237/280/89 189/281/56 188/279/54
f 73/284/59 69/283/90 238/282/59
f 73/284/59 238/282/59 239/286/59
f 72/287/59 73/284/59 239/286/59
f 81/298/92 79/297/91 241/296/92
f 200/300/67 201/299/68 241/296/92
f 79/297/91 200/300/67 241/296/92
f 139/313/21 200/312/67 190/311/57
f 79/316/91 190/315/57 200/314/67
f 65/319/94 66/318/95 245/317/94
f 193/321/60 196/320/63 245/317/94
f 66/318/95 193/321/60 245/317/94
f 65/319/94 245/317/94 198/322/65
f 69/323/90 65/319/94 198/322/65
f 196/320/63 198/322/65 245/317/94
f 62/326/10 64/325/12 195/324/62
f 64/325/12 194/327/61 195/324/62
f 64/330/12 63/329/11 171/328/45
f 63/329/11 170/331/44 171/328/45
f 154/334/32 156/333/34 174/332/48
f 156/333/34 173/335/47 174/332/48
f 139/313/21 190/311/57 189/372/56
f 139/313/21 189/372/56 148/373/28
f 148/373/28 189/372/56 167/374/41
f 277/379/116 171/378/45 168/377/42
f 277/379/116 278/381/116 194/380/61
f 171/378/45 277/379/116 194/380/61
f 194/380/61 279/383/116 197/382/64
f 194/380/61 278/381/116 279/383/116
f 179/384/53 277/379/116 168/377/42
f 173/385/47 179/384/53 168/377/42
f 277/379/116 179/384/53 278/381/116
f 176/387/50 198/386/65 197/382/64
f 279/383/116 176/387/50 197/382/64
f 179/384/53 176/387/50 279/383/116
f 278/381/116 179/384/53 279/383/116
f 156/390/34 179/389/53 173/388/47
f 198/393/65 176/392/50 69/391/90
f 171/396/45 194/395/61 64/394/12
f 281/399/117 61/398/9 280/397/117
f 282/400/117 61/398/9 281/399/117
f 283/401/117 61/398/9 282/400/117
f 250/402/100 61/398/9 283/401/117
f 1/403/1 250/402/100 283/401/117
f 250/402/100 247/404/97 61/398/9
f 250/402/100 230/405/84 247/404/97
f 66/407/95 96/406/117 280/397/117
f 61/398/9 66/407/95 280/397/117
f 66/407/95 61/398/9 193/408/60
f 193/408/60 61/398/9 62/409/10
f 62/409/10 195/410/62 193/408/60
f 138/413/20 227/412/81 97/411/93
f 138/413/20 97/411/93 209/414/70
f 137/415/19 138/413/20 209/414/70
f 137/415/19 209/414/70 146/416/26
f 281/399/117 280/397/117 97/411/93
f 227/412/81 281/399/117 97/411/93
f 275/417/114 282/400/117 281/399/117
f 227/412/81 275/417/114 281/399/117
f 283/401/117 282/400/117 275/417/114
f 29/418/8 283/401/117 275/417/114
f 29/418/8 1/403/1 283/401/117
f 96/406/117 97/411/93 280/397/117
f 165/427/39 232/426/86 237/425/89
f 167/429/41 189/428/56 237/425/89
f 232/426/86 167/429/41 237/425/89
f 291/436/123 290/435/122 289/434/121
f 292/437/124 291/436/123 289/434/121
f 67/438/125 289/434/121 290/435/122
f 67/441/125 294/440/127 293/439/126
f 289/442/121 67/441/125 293/439/126
f 70/443/128 293/439/126 294/440/127
f 70/446/128 296/445/130 295/444/129
f 293/447/126 70/446/128 295/444/129
f 74/448/131 295/444/129 296/445/130
f 74/451/131 298/450/133 297/449/132
f 295/452/129 74/451/131 297/449/132
f 76/453/134 297/449/132 298/450/133
f 76/456/134 300/455/136 299/454/135
f 297/457/132 76/456/134 299/454/135
f 87/458/137 299/454/135 300/455/136
f 87/461/137 302/460/139 301/459/138
f 299/462/135 87/461/137 301/459/138
f 88/463/140 301/459/138 302/460/139
f 304/466/142 303/465/141 99/464/141
f 305/467/141 304/466/142 99/464/141
f 102/468/143 304/466/142 305/467/141
f 102/471/143 307/470/145 306/469/144
f 304/472/142 102/471/143 306/469/144
f 105/473/146 306/469/144 307/470/145
f 105/476/146 309/475/148 308/474/147
f 306/477/144 105/476/146 308/474/147
f 109/478/149 308/474/147 309/475/148
f 310/481/150 308/480/147 109/479/149
f 310/481/150 111/483/152 311/482/151
f 308/480/147 310/481/150 311/482/151
f 113/486/155 313/485/154 312/484/153
f 313/485/154 311/488/151 111/487/152
f 312/484/153 313/485/154 111/487/152
f 113/491/155 315/490/157 314/489/156
f 313/492/154 113/491/155 314/489/156
f 115/493/158 314/489/156 315/490/157
f 115/496/158 317/495/160 316/494/159
f 314/497/156 115/496/158 316/494/159
f 117/498/161 316/494/159 317/495/160
f 319/501/163 316/500/159 318/499/162
f 119/502/164 319/501/163 318/499/162
f 318/499/162 316/500/159 117/503/161
f 119/506/164 321/505/166 320/504/165
f 319/507/163 119/506/164 320/504/165
f 121/508/167 320/504/165 321/505/166
f 121/511/167 323/510/169 322/509/168
f 320/512/165 121/511/167 322/509/168
f 123/513/170 322/509/168 323/510/169
f 123/516/170 325/515/172 324/514/171
f 322/517/168 123/516/170 324/514/171
f 125/518/173 324/514/171 325/515/172
f 125/521/173 326/520/174 292/519/124
f 324/522/171 125/521/173 292/519/124
f 291/523/123 292/519/124 326/520/174
f 88/531/140 86/530/175 332/529/175
f 301/532/138 88/531/140 332/529/175
f 334/535/178 333/534/177 89/533/176
f 335/536/176 334/535/178 89/533/176
f 92/537/179 334/535/178 335/536/176
f 92/540/179 337/539/181 336/538/180
f 334/541/178 92/540/179 336/538/180
f 94/542/182 336/538/180 337/539/181
f 94/543/182 99/464/141 303/465/141
f 336/544/180 94/543/182 303/465/141
f 344/551/183 332/529/175 86/530/175
f 345/552/175 344/551/183 86/530/175
f 78/553/184 344/551/183 345/552/175
f 78/556/184 347/555/186 346/554/185
f 344/557/183 78/556/184 346/554/185
f 80/558/187 346/554/185 347/555/186
f 80/561/187 349/560/189 348/559/188
f 346/562/185 80/561/187 348/559/188
f 82/563/190 348/559/188 349/560/189
f 82/566/190 351/565/192 350/564/191
f 348/567/188 82/566/190 350/564/191
f 85/568/193 350/564/191 351/565/192
f 85/571/193 89/570/176 333/569/177
f 350/572/191 85/571/193 333/569/177
f 341/548/13 350/85/191 333/89/177
f 97/97/13 96/96/13 95/95/13
f 96/96/13 66/66/13 65/65/13
f 98/98/13 97/97/13 95/95/13
f 97/97/13 98/98/13 99/99/13
f 100/100/13 97/97/13 99/99/13
f 98/98/13 95/95/13 101/101/13
f 104/104/13 101/101/13 103/103/13
f 104/104/13 98/98/13 101/101/13
f 107/107/13 103/103/13 106/106/13
f 107/107/13 104/104/13 103/103/13
f 111/111/13 106/106/13 110/110/13
f 108/108/13 107/107/13 106/106/13
f 113/113/13 110/110/13 112/112/13
f 115/115/13 112/112/13 114/114/13
f 314/115/13 331/528/13 313/113/13
f 316/117/13 331/528/13 314/115/13
f 313/113/13 331/528/13 311/111/13
f 319/119/13 331/528/13 316/117/13
f 117/117/13 114/114/13 116/116/13
f 98/98/13 104/104/13 102/102/13
f 104/104/13 107/107/13 105/105/13
f 107/107/13 108/108/13 109/109/13
f 311/111/13 331/528/13 308/109/13
f 320/121/13 331/528/13 319/119/13
f 119/119/13 116/116/13 118/118/13
f 308/109/13 331/528/13 306/105/13
f 322/123/13 331/528/13 320/121/13
f 121/121/13 118/118/13 120/120/13
f 306/105/13 331/528/13 304/102/13
f 324/125/13 331/528/13 322/123/13
f 123/123/13 120/120/13 122/122/13
f 100/100/13 90/90/13 89/89/13
f 304/102/13 331/528/13 303/99/13
f 292/124/13 331/528/13 324/125/13
f 125/125/13 122/122/13 124/124/13
f 90/90/13 93/93/13 92/92/13
f 93/93/13 99/99/13 94/94/13
f 343/550/13 336/94/13 303/99/13
f 331/528/13 343/550/13 303/99/13
f 336/94/13 343/550/13 334/92/13
f 343/550/13 342/549/13 334/92/13
f 343/550/13 331/528/13 342/549/13
f 342/549/13 331/528/13 330/527/13
f 327/524/13 331/528/13 301/88/13
f 295/74/13 331/528/13 293/70/13
f 293/70/13 331/528/13 289/67/13
f 289/67/13 331/528/13 292/124/13
f 330/527/13 331/528/13 329/526/13
f 329/526/13 331/528/13 328/525/13
f 299/87/13 331/528/13 297/76/13
f 328/525/13 331/528/13 327/524/13
f 297/76/13 331/528/13 295/74/13
f 301/88/13 331/528/13 299/87/13
f 91/91/13 100/100/13 89/89/13
f 334/92/13 342/549/13 333/89/13
f 342/549/13 330/527/13 333/89/13
f 341/548/13 330/527/13 340/547/13
f 330/527/13 329/526/13 340/547/13
f 330/527/13 341/548/13 333/89/13
f 68/68/13 67/67/13 65/65/13
f 329/526/13 328/525/13 339/546/13
f 340/547/13 329/526/13 339/546/13
f 328/525/13 327/524/13 338/545/13
f 339/546/13 328/525/13 338/545/13
f 327/524/13 301/88/13 332/86/13
f 338/545/13 327/524/13 332/86/13
f 91/91/13 83/83/13 82/82/13
f 83/83/13 89/89/13 85/85/13
f 350/85/13 341/548/13 348/82/13
f 341/548/13 340/547/13 348/82/13
f 68/68/13 71/71/13 70/70/13
f 84/84/13 91/91/13 82/82/13
f 88/88/13 87/87/13 86/86/13
f 348/82/13 340/547/13 346/80/13
f 340/547/13 339/546/13 346/80/13
f 81/81/13 84/84/13 80/80/13
f 346/80/13 339/546/13 344/78/13
f 339/546/13 338/545/13 344/78/13
f 344/78/13 338/545/13 332/86/13
f 77/77/13 86/86/13 76/76/13
f 72/72/13 71/71/13 68/68/13
f 72/72/13 75/75/13 74/74/13
f 69/69/13 68/68/13 65/65/13
f 79/79/13 81/81/13 78/78/13
f 77/77/13 79/79/13 78/78/13
f 75/75/13 77/77/13 76/76/13
f 73/73/13 72/72/13 68/68/13
f 69/69/13 73/73/13 68/68/13
f 79/295/91 77/294/59 190/293/57
f 187/214/51 190/293/57 192/213/59
f 184/292/51 187/214/51 240/291/59
f 187/214/51 192/213/59 240/291/59
f 75/289/59 72/287/59 240/291/59
f 72/287/59 239/286/59 240/291/59
f 184/292/51 240/291/59 239/286/59
f 181/290/51 184/292/51 239/286/59
f 181/290/51 239/286/59 238/282/59
f 177/288/51 181/290/51 238/282/59
f 176/285/50 177/288/51 238/282/59
f 69/283/90 176/285/50 238/282/59
f 77/294/59 192/213/59 190/293/57
f 77/294/59 75/289/59 192/213/59
f 75/289/59 240/291/59 192/213/59
f 97/310/93 100/309/92 209/308/70
f 100/309/92 244/307/92 209/308/70
f 208/237/69 209/308/70 244/307/92
f 208/237/69 244/307/92 243/305/92
f 100/309/92 91/304/92 244/307/92
f 91/304/92 243/305/92 244/307/92
f 206/306/69 208/237/69 243/305/92
f 206/306/69 243/305/92 242/302/92
f 203/303/69 206/306/69 242/302/92
f 203/303/69 242/302/92 241/296/92
f 201/299/68 203/303/69 241/296/92
f 84/301/92 81/298/92 242/302/92
f 84/301/92 242/302/92 243/305/92
f 91/304/92 84/301/92 243/305/92
f 81/298/92 241/296/92 242/302/92
f 61/339/9 247/338/97 246/337/96
f 230/258/84 229/257/83 247/338/97
f 250/342/100 249/341/99 230/258/84
f 2/2/2 250/342/100 1/1/1
f 1/1/1 29/29/8 28/28/2
f 29/29/8 275/371/114 274/370/109
f 275/371/114 227/255/81 226/254/76
f 138/164/20 136/163/18 227/255/81
f 249/341/99 250/342/100 2/2/2
f 30/30/2 1/1/1 28/28/2
f 136/163/18 151/162/29 227/255/81
f 29/29/8 27/27/7 28/28/2
f 27/27/7 29/29/8 274/370/109
f 225/253/80 275/371/114 226/254/76
f 275/371/114 225/253/80 274/370/109
f 152/165/30 227/255/81 151/162/29
f 249/341/99 248/340/98 230/258/84
f 229/257/83 230/258/84 248/340/98
f 227/255/81 152/165/30 226/254/76
f 63/336/11 61/339/9 246/337/96
f 229/257/83 228/256/82 247/338/97
f 246/337/96 247/338/97 228/256/82
f 32/32/2 30/30/2 31/31/2
f 34/34/2 32/32/2 33/33/2
f 36/36/2 34/34/2 35/35/2
f 38/38/2 36/36/2 37/37/2
f 40/40/2 38/38/2 39/39/2
f 2/2/2 40/40/2 41/41/2
f 42/42/2 2/2/2 41/41/2
f 136/163/18 133/160/18 151/162/29
f 43/43/2 2/2/2 42/42/2
f 152/165/30 151/162/29 150/161/29
f 50/50/2 41/41/2 28/28/2
f 41/41/2 39/39/2 28/28/2
f 152/165/30 224/252/79 226/254/76
f 133/160/18 150/161/29 151/162/29
f 224/252/79 152/165/30 150/161/29
f 225/253/80 226/254/76 223/251/76
f 224/252/79 223/251/76 226/254/76
f 51/51/2 50/50/2 28/28/2
f 39/39/2 37/37/2 28/28/2
f 44/44/2 42/42/2 50/50/2
f 225/253/80 273/369/113 274/370/109
f 273/369/113 225/253/80 223/251/76
f 43/43/2 42/42/2 44/44/2
f 46/46/2 44/44/2 51/51/2
f 46/46/2 51/51/2 28/28/2
f 37/37/2 35/35/2 28/28/2
f 45/45/2 43/43/2 44/44/2
f 47/47/2 45/45/2 46/46/2
f 54/54/2 46/46/2 53/53/2
f 46/46/2 52/52/2 53/53/2
f 52/52/2 46/46/2 28/28/2
f 45/45/2 44/44/2 46/46/2
f 55/55/2 54/54/2 53/53/2
f 48/48/2 47/47/2 54/54/2
f 27/27/7 274/370/109 271/367/109
f 35/35/2 33/33/2 28/28/2
f 273/369/113 271/367/109 274/370/109
f 56/56/2 55/55/2 53/53/2
f 33/33/2 31/31/2 28/28/2
f 21/21/2 27/27/7 20/20/2
f 272/368/112 27/27/7 271/367/109
f 27/27/7 272/368/112 20/20/2
f 49/49/2 48/48/2 55/55/2
f 57/57/2 56/56/2 53/53/2
f 57/57/2 49/49/2 56/56/2
f 23/23/2 21/21/2 22/22/2
f 28/28/2 23/23/2 24/24/2
f 28/28/2 24/24/2 20/20/2
f 52/52/2 28/28/2 20/20/2
f 58/58/2 57/57/2 53/53/2
f 24/24/2 22/22/2 20/20/2
f 52/52/2 26/26/2 25/25/2
f 26/26/2 52/52/2 20/20/2
f 59/59/2 58/58/2 53/53/2
f 3/3/3 249/341/99 58/58/2
f 4/4/4 3/3/3 58/58/2
f 133/160/18 129/158/29 150/161/29
f 224/252/79 150/161/29 149/159/29
f 224/252/79 221/249/77 223/251/76
f 220/248/76 223/251/76 219/247/76
f 222/250/78 273/369/113 220/248/76
f 222/250/78 220/248/76 219/247/76
f 221/249/77 224/252/79 149/159/29
f 273/369/113 222/250/78 271/367/109
f 222/250/78 270/366/109 271/367/109
f 222/250/78 268/364/110 270/366/109
f 272/368/112 271/367/109 270/366/109
f 268/364/110 222/250/78 219/247/76
f 129/158/29 149/159/29 150/161/29
f 269/365/111 272/368/112 270/366/109
f 269/365/111 270/366/109 267/363/109
f 13/13/2 272/368/112 269/365/111
f 268/364/110 267/363/109 270/366/109
f 26/26/2 20/20/2 15/15/2
f 20/20/2 13/13/2 15/15/2
f 14/14/2 13/13/2 269/365/111
f 14/14/2 26/26/2 15/15/2
f 5/5/4 4/4/4 59/59/2
f 60/60/2 59/59/2 53/53/2
f 221/249/77 219/247/76 223/251/76
f 11/11/2 269/365/111 10/10/7
f 10/10/7 269/365/111 267/363/109
f 19/19/2 53/53/2 25/25/2
f 26/26/2 19/19/2 25/25/2
f 11/11/2 14/14/2 269/365/111
f 19/19/2 26/26/2 17/17/2
f 26/26/2 14/14/2 17/17/2
f 249/341/99 3/3/3 248/340/98
f 8/8/5 7/7/5 19/19/2
f 7/7/5 6/6/2 19/19/2
f 18/18/2 19/19/2 17/17/2
f 14/14/2 16/16/2 17/17/2
f 14/14/2 11/11/2 16/16/2
f 11/11/2 12/12/2 17/17/2
f 6/6/2 60/60/2 53/53/2
f 12/12/2 11/11/2 10/10/7
f 7/7/5 5/5/4 60/60/2
f 3/3/3 251/343/101 248/340/98
f 251/343/101 229/257/83 248/340/98
f 8/8/5 18/18/2 12/12/2
f 9/9/6 8/8/5 12/12/2
f 9/9/6 12/12/2 10/10/7
f 9/9/6 10/10/7 266/362/108
f 10/10/7 267/363/109 266/362/108
f 268/364/110 266/362/108 267/363/109
f 266/362/108 268/364/110 218/246/75
f 268/364/110 219/247/76 218/246/75
f 221/249/77 218/246/75 219/247/76
f 218/246/75 221/249/77 149/159/29
f 130/157/17 218/246/75 149/159/29
f 3/3/3 4/4/4 252/344/102
f 4/4/4 5/5/4 253/345/103
f 5/5/4 7/7/5 255/347/103
f 7/7/5 8/8/5 258/350/103
f 8/8/5 257/349/103 258/350/103
f 8/8/5 9/9/6 257/349/103
f 9/9/6 261/353/106 257/349/103
f 246/337/96 170/432/44 63/336/11
f 252/344/102 251/343/101 3/3/3
f 4/4/4 253/345/103 252/344/102
f 5/5/4 255/347/103 253/345/103
f 7/7/5 258/350/103 255/347/103
f 266/362/108 261/353/106 9/9/6
f 130/157/17 147/169/27 218/246/75
f 259/351/104 258/350/103 257/349/103
f 261/353/106 260/352/105 257/349/103
f 260/352/105 259/351/104 257/349/103
f 259/351/104 256/348/104 258/350/103
f 256/348/104 255/347/103 258/350/103
f 231/259/85 246/337/96 228/256/82
f 229/257/83 251/343/101 228/256/82
f 251/343/101 231/259/85 228/256/82
f 285/420/118 246/337/96 284/419/118
f 246/337/96 231/259/85 284/419/118
f 231/259/85 251/343/101 284/419/118
f 251/343/101 252/344/102 284/419/118
f 256/348/104 254/346/104 255/347/103
f 276/376/115 266/362/108 218/246/75
f 276/376/115 218/246/75 166/375/40
f 170/432/44 246/337/96 286/421/118
f 254/346/104 253/345/103 255/347/103
f 166/375/40 218/246/75 147/169/27
f 286/421/118 246/337/96 285/420/118
f 276/376/115 261/353/106 266/362/108
f 287/422/119 285/420/118 284/419/118
f 252/344/102 287/422/119 284/419/118
f 174/423/48 286/421/118 285/420/118
f 287/422/119 174/423/48 285/420/118
f 254/346/104 252/344/102 253/345/103
f 174/423/48 172/424/46 286/421/118
f 172/424/46 170/432/44 286/421/118
f 252/344/102 254/346/104 287/422/119
f 254/346/104 210/238/71 287/422/119
f 254/346/104 256/348/104 210/238/71
f 256/348/104 211/239/71 210/238/71
f 256/348/104 259/351/104 211/239/71
f 259/351/104 213/241/71 211/239/71
f 259/351/104 260/352/105 213/241/71
f 260/352/105 215/243/71 213/241/71
f 260/352/105 261/353/106 215/243/71
f 261/353/106 276/376/115 215/243/71
f 216/244/73 213/241/71 215/243/71
f 217/245/74 216/244/73 215/243/71
f 276/376/115 217/245/74 215/243/71
f 214/242/73 211/239/71 213/241/71
f 216/244/73 214/242/73 213/241/71
f 212/240/72 210/238/71 211/239/71
f 214/242/73 212/240/72 211/239/71
f 212/240/72 287/422/119 210/238/71
f 154/433/32 174/423/48 287/422/119
f 287/422/119 212/240/72 262/354/107
f 212/240/72 214/242/73 262/354/107
f 214/242/73 263/356/107 262/354/107
f 214/242/73 216/244/73 263/356/107
f 216/244/73 264/359/107 263/356/107
f 216/244/73 217/245/74 264/359/107
f 217/245/74 265/361/107 264/359/107
f 217/245/74 276/376/115 265/361/107
f 276/376/115 166/375/40 288/431/120
f 154/433/32 287/422/119 262/354/107
f 264/359/107 265/361/107 288/431/120
f 265/361/107 276/376/115 288/431/120
f 166/375/40 234/430/88 288/431/120
f 158/357/36 263/356/107 264/359/107
f 161/358/36 158/357/36 264/359/107
f 161/358/36 264/359/107 288/431/120
f 164/360/38 161/358/36 288/431/120
f 234/430/88 164/360/38 288/431/120
f 153/355/31 262/354/107 263/356/107
f 158/357/36 153/355/31 263/356/107
f 153/355/31 154/433/32 262/354/107

