%YAML 1.1
%TAG !u! tag:unity3d.com,2011:
--- !u!114 &11400000
MonoBehaviour:
  m_ObjectHideFlags: 0
  m_CorrespondingSourceObject: {fileID: 0}
  m_PrefabInstance: {fileID: 0}
  m_PrefabAsset: {fileID: 0}
  m_GameObject: {fileID: 0}
  m_Enabled: 1
  m_EditorHideFlags: 0
  m_Script: {fileID: 11500000, guid: 8ef083def43d7a24f9a043af35038fd3, type: 3}
  m_Name: GameValues
  m_EditorClassIdentifier: 
  BubbleCountInRow: 6
  InitialRowCount: 4
  RowXOffset: 0.2
  ColYOffset: -0.03
  OffsetBetweenBubbles: 0.01
