{
  "layout":{
    "children":[
      {
        "children":[
          {
            "cls":"starling.display.Image",
            "constructorParams":[
              {
                "cls":"starling.textures.Texture",
                "textureName":"sidebar-healf"
              }
            ],
            "customParams":{},
            "params":{
              "name":"sidebar-healf",
              "x":34,
              "y":32
            }
          },
          {
            "cls":"starling.display.Image",
            "constructorParams":[
              {
                "cls":"starling.textures.Texture",
                "textureName":"sidebar-healf-full"
              }
            ],
            "customParams":{},
            "params":{
              "mask":{
                "cls":"starling.display.Image",
                "constructorParams":[
                  {
                    "cls":"starling.textures.Texture",
                    "textureName":"sidebar-healf"
                  }
                ],
                "customParams":{},
                "params":{
                  "name":"healthBarMask"
                }
              },
              "name":"healthBar",
              "x":34,
              "y":32
            }
          },
          {
            "cls":"starling.display.Image",
            "constructorParams":[
              {
                "cls":"starling.textures.Texture",
                "textureName":"healf"
              }
            ],
            "customParams":{},
            "params":{
              "name":"healf",
              "scaleX":0.3,
              "scaleY":0.3,
              "x":19.5,
              "y":23
            }
          },
          {
            "cls":"starling.text.TextField",
            "constructorParams":[
              {
                "value":200
              },
              {
                "value":100
              },
              {
                "value":""
              }
            ],
            "customParams":{},
            "params":{
              "format":{
                "cls":"starling.text.TextFormat",
                "customParams":{},
                "params":{
                  "color":16777215,
                  "font":"Arial",
                  "size":20
                }
              },
              "height":24,
              "name":"healthLabel",
              "text":"Abc123",
              "width":122,
              "x":53.7,
              "y":32
            }
          }
        ],
        "cls":"starling.display.Sprite",
        "customParams":{},
        "params":{
          "name":"health",
          "x":-2.5,
          "y":-5
        }
      },
      {
        "children":[
          {
            "cls":"starling.display.Image",
            "constructorParams":[
              {
                "cls":"starling.textures.Texture",
                "textureName":"exp"
              }
            ],
            "customParams":{},
            "params":{
              "name":"exp",
              "x":282,
              "y":-277
            }
          },
          {
            "cls":"starling.display.Image",
            "constructorParams":[
              {
                "cls":"starling.textures.Texture",
                "textureName":"Expa"
              }
            ],
            "customParams":{},
            "params":{
              "name":"Expa",
              "scaleX":0.3,
              "scaleY":0.3,
              "x":350.6,
              "y":-286.7
            }
          },
          {
            "cls":"starling.text.TextField",
            "constructorParams":[
              {
                "value":200
              },
              {
                "value":100
              },
              {
                "value":""
              }
            ],
            "customParams":{},
            "params":{
              "format":{
                "cls":"starling.text.TextFormat",
                "customParams":{},
                "params":{
                  "color":13998848,
                  "font":"Arial",
                  "size":20
                }
              },
              "height":24,
              "name":"expLabel",
              "text":"200",
              "width":73,
              "x":284.5,
              "y":-278
            }
          }
        ],
        "cls":"starling.display.Sprite",
        "customParams":{},
        "params":{
          "name":"exp",
          "pivotX":282,
          "pivotY":-286,
          "x":673,
          "y":14
        }
      },
      {
        "children":[
          {
            "cls":"starling.display.Image",
            "constructorParams":[
              {
                "cls":"starling.textures.Texture",
                "textureName":"button-paus and skill"
              }
            ],
            "customParams":{},
            "params":{
              "color":13958160,
              "name":"button-paus and skill",
              "x":678,
              "y":530
            }
          },
          {
            "cls":"starling.display.Image",
            "constructorParams":[
              {
                "cls":"starling.textures.Texture",
                "textureName":"skill"
              }
            ],
            "customParams":{},
            "params":{
              "name":"skill",
              "scaleX":0.31,
              "scaleY":0.31,
              "x":697.5,
              "y":532
            }
          }
        ],
        "cls":"starling.display.Sprite",
        "customParams":{},
        "params":{
          "name":"skills",
          "x":18
        }
      }
    ],
    "cls":"starling.display.Sprite",
    "customParams":{},
    "params":{
      "name":"root"
    }
  },
  "setting":{
    "canvasColor":16777215,
    "canvasSize":{
      "x":800,
      "y":600
    },
    "lock":"0100001000000"
  },
  "version":"2.0"
}