# MagicaVoxel @ Ephtracy

# group
g gates

# material
mtllib gates.mtl
usemtl palette

# normals
vn -1 0 0
vn 1 0 0
vn 0 0 1
vn 0 0 -1
vn 0 -1 0
vn 0 1 0

# texcoords
vt 0.0449219 0.5
vt 0.0683594 0.5
vt 0.400391 0.5
vt 0.494141 0.5

# verts
v -5 0 20
v -5 0 12
v -5 0 4
v -5 0 -4
v -5 0 -12
v -5 0 -20
v -5 1 20
v -5 1 12
v -5 1 4
v -5 1 -4
v -5 1 -12
v -5 1 -20
v -5 32 20
v -5 32 12
v -5 32 4
v -5 32 -4
v -5 32 -12
v -5 32 -20
v -5 33 20
v -5 33 12
v -5 33 4
v -5 33 -4
v -5 33 -12
v -5 33 -20
v -4 1 19
v -4 1 13
v -4 1 3
v -4 1 -3
v -4 1 -13
v -4 1 -19
v -4 2 19
v -4 2 13
v -4 2 3
v -4 2 -3
v -4 2 -13
v -4 2 -19
v -4 17 9
v -4 17 8
v -4 17 -8
v -4 17 -9
v -4 23 9
v -4 23 8
v -4 23 -8
v -4 23 -9
v -4 31 19
v -4 31 13
v -4 31 3
v -4 31 -3
v -4 31 -13
v -4 31 -19
v -4 32 19
v -4 32 13
v -4 32 3
v -4 32 -3
v -4 32 -13
v -4 32 -19
v -3 2 18
v -3 2 17
v -3 2 15
v -3 2 14
v -3 2 2
v -3 2 1
v -3 2 -1
v -3 2 -2
v -3 2 -14
v -3 2 -15
v -3 2 -17
v -3 2 -18
v -3 17 2
v -3 17 1
v -3 17 -1
v -3 17 -2
v -3 18 14
v -3 18 9
v -3 18 8
v -3 18 3
v -3 18 2
v -3 18 -2
v -3 18 -3
v -3 18 -8
v -3 18 -9
v -3 18 -14
v -3 19 15
v -3 19 9
v -3 19 8
v -3 19 3
v -3 19 1
v -3 19 -1
v -3 19 -3
v -3 19 -8
v -3 19 -9
v -3 19 -15
v -3 21 15
v -3 21 9
v -3 21 8
v -3 21 3
v -3 21 1
v -3 21 -1
v -3 21 -3
v -3 21 -8
v -3 21 -9
v -3 21 -15
v -3 22 14
v -3 22 9
v -3 22 8
v -3 22 3
v -3 22 2
v -3 22 -2
v -3 22 -3
v -3 22 -8
v -3 22 -9
v -3 22 -14
v -3 23 2
v -3 23 1
v -3 23 -1
v -3 23 -2
v -3 31 18
v -3 31 17
v -3 31 15
v -3 31 14
v -3 31 2
v -3 31 1
v -3 31 -1
v -3 31 -2
v -3 31 -14
v -3 31 -15
v -3 31 -17
v -3 31 -18
v -2 19 3
v -2 19 2
v -2 19 -2
v -2 19 -3
v -2 21 3
v -2 21 2
v -2 21 -2
v -2 21 -3
v 0 2 18
v 0 2 17
v 0 2 15
v 0 2 14
v 0 2 2
v 0 2 1
v 0 2 -1
v 0 2 -2
v 0 2 -14
v 0 2 -15
v 0 2 -17
v 0 2 -18
v 0 17 2
v 0 17 1
v 0 17 -1
v 0 17 -2
v 0 18 14
v 0 18 9
v 0 18 8
v 0 18 3
v 0 18 2
v 0 18 -2
v 0 18 -3
v 0 18 -8
v 0 18 -9
v 0 18 -14
v 0 19 15
v 0 19 3
v 0 19 2
v 0 19 1
v 0 19 -1
v 0 19 -2
v 0 19 -3
v 0 19 -8
v 0 19 -9
v 0 19 -15
v 0 21 15
v 0 21 3
v 0 21 2
v 0 21 1
v 0 21 -1
v 0 21 -2
v 0 21 -3
v 0 21 -8
v 0 21 -9
v 0 21 -15
v 0 22 14
v 0 22 9
v 0 22 8
v 0 22 3
v 0 22 2
v 0 22 -2
v 0 22 -3
v 0 22 -8
v 0 22 -9
v 0 22 -14
v 0 23 2
v 0 23 1
v 0 23 -1
v 0 23 -2
v 0 31 18
v 0 31 17
v 0 31 15
v 0 31 14
v 0 31 2
v 0 31 1
v 0 31 -1
v 0 31 -2
v 0 31 -14
v 0 31 -15
v 0 31 -17
v 0 31 -18
v 1 19 9
v 1 19 8
v 1 21 9
v 1 21 8
v -3 19 9
v -3 19 8
v -3 19 -8
v -3 19 -9
v -3 21 9
v -3 21 8
v -3 21 -8
v -3 21 -9
v -2 2 18
v -2 2 17
v -2 2 15
v -2 2 14
v -2 2 2
v -2 2 1
v -2 2 -1
v -2 2 -2
v -2 2 -14
v -2 2 -15
v -2 2 -17
v -2 2 -18
v -2 17 2
v -2 17 1
v -2 17 -1
v -2 17 -2
v -2 18 14
v -2 18 9
v -2 18 8
v -2 18 3
v -2 18 2
v -2 18 -2
v -2 18 -3
v -2 18 -8
v -2 18 -9
v -2 18 -14
v -2 19 15
v -2 19 3
v -2 19 2
v -2 19 1
v -2 19 -1
v -2 19 -2
v -2 19 -3
v -2 19 -15
v -2 21 15
v -2 21 3
v -2 21 2
v -2 21 1
v -2 21 -1
v -2 21 -2
v -2 21 -3
v -2 21 -15
v -2 22 14
v -2 22 9
v -2 22 8
v -2 22 3
v -2 22 2
v -2 22 -2
v -2 22 -3
v -2 22 -8
v -2 22 -9
v -2 22 -14
v -2 23 2
v -2 23 1
v -2 23 -1
v -2 23 -2
v -2 31 18
v -2 31 17
v -2 31 15
v -2 31 14
v -2 31 2
v -2 31 1
v -2 31 -1
v -2 31 -2
v -2 31 -14
v -2 31 -15
v -2 31 -17
v -2 31 -18
v 0 19 3
v 0 19 2
v 0 19 -2
v 0 19 -3
v 0 21 3
v 0 21 2
v 0 21 -2
v 0 21 -3
v 1 2 18
v 1 2 17
v 1 2 15
v 1 2 14
v 1 2 2
v 1 2 1
v 1 2 -1
v 1 2 -2
v 1 2 -14
v 1 2 -15
v 1 2 -17
v 1 2 -18
v 1 17 2
v 1 17 1
v 1 17 -1
v 1 17 -2
v 1 18 14
v 1 18 9
v 1 18 8
v 1 18 3
v 1 18 2
v 1 18 -2
v 1 18 -3
v 1 18 -8
v 1 18 -9
v 1 18 -14
v 1 19 15
v 1 19 9
v 1 19 8
v 1 19 3
v 1 19 1
v 1 19 -1
v 1 19 -3
v 1 19 -8
v 1 19 -9
v 1 19 -15
v 1 21 15
v 1 21 9
v 1 21 8
v 1 21 3
v 1 21 1
v 1 21 -1
v 1 21 -3
v 1 21 -8
v 1 21 -9
v 1 21 -15
v 1 22 14
v 1 22 9
v 1 22 8
v 1 22 3
v 1 22 2
v 1 22 -2
v 1 22 -3
v 1 22 -8
v 1 22 -9
v 1 22 -14
v 1 23 2
v 1 23 1
v 1 23 -1
v 1 23 -2
v 1 31 18
v 1 31 17
v 1 31 15
v 1 31 14
v 1 31 2
v 1 31 1
v 1 31 -1
v 1 31 -2
v 1 31 -14
v 1 31 -15
v 1 31 -17
v 1 31 -18
v 2 1 19
v 2 1 13
v 2 1 3
v 2 1 -3
v 2 1 -13
v 2 1 -19
v 2 2 19
v 2 2 13
v 2 2 3
v 2 2 -3
v 2 2 -13
v 2 2 -19
v 2 17 9
v 2 17 8
v 2 17 -8
v 2 17 -9
v 2 23 9
v 2 23 8
v 2 23 -8
v 2 23 -9
v 2 31 19
v 2 31 13
v 2 31 3
v 2 31 -3
v 2 31 -13
v 2 31 -19
v 2 32 19
v 2 32 13
v 2 32 3
v 2 32 -3
v 2 32 -13
v 2 32 -19
v 3 0 20
v 3 0 12
v 3 0 4
v 3 0 -4
v 3 0 -12
v 3 0 -20
v 3 1 20
v 3 1 12
v 3 1 4
v 3 1 -4
v 3 1 -12
v 3 1 -20
v 3 32 20
v 3 32 12
v 3 32 4
v 3 32 -4
v 3 32 -12
v 3 32 -20
v 3 33 20
v 3 33 12
v 3 33 4
v 3 33 -4
v 3 33 -12
v 3 33 -20
v -5 0 20
v -5 1 20
v -5 32 20
v -5 33 20
v 3 0 20
v 3 1 20
v 3 32 20
v 3 33 20
v -4 1 19
v -4 2 19
v -4 31 19
v -4 32 19
v 2 1 19
v 2 2 19
v 2 31 19
v 2 32 19
v -3 2 18
v -3 31 18
v -2 2 18
v -2 31 18
v 0 2 18
v 0 31 18
v 1 2 18
v 1 31 18
v -3 2 15
v -3 19 15
v -3 21 15
v -3 31 15
v -2 2 15
v -2 19 15
v -2 21 15
v -2 31 15
v 0 2 15
v 0 19 15
v 0 21 15
v 0 31 15
v 1 2 15
v 1 19 15
v 1 21 15
v 1 31 15
v -4 17 9
v -4 23 9
v -3 18 9
v -3 19 9
v -3 21 9
v -3 22 9
v -2 18 9
v -2 22 9
v 0 18 9
v 0 22 9
v 1 18 9
v 1 19 9
v 1 21 9
v 1 22 9
v 2 17 9
v 2 23 9
v -5 0 4
v -5 1 4
v -5 32 4
v -5 33 4
v 3 0 4
v 3 1 4
v 3 32 4
v 3 33 4
v -4 1 3
v -4 2 3
v -4 31 3
v -4 32 3
v -2 18 3
v -2 19 3
v -2 21 3
v -2 22 3
v 0 18 3
v 0 19 3
v 0 21 3
v 0 22 3
v 2 1 3
v 2 2 3
v 2 31 3
v 2 32 3
v -3 2 2
v -3 17 2
v -3 18 2
v -3 22 2
v -3 23 2
v -3 31 2
v -2 2 2
v -2 17 2
v -2 18 2
v -2 22 2
v -2 23 2
v -2 31 2
v 0 2 2
v 0 17 2
v 0 18 2
v 0 22 2
v 0 23 2
v 0 31 2
v 1 2 2
v 1 17 2
v 1 18 2
v 1 22 2
v 1 23 2
v 1 31 2
v -3 2 -1
v -3 17 -1
v -3 19 -1
v -3 21 -1
v -3 23 -1
v -3 31 -1
v -2 2 -1
v -2 17 -1
v -2 19 -1
v -2 21 -1
v -2 23 -1
v -2 31 -1
v 0 2 -1
v 0 17 -1
v 0 19 -1
v 0 21 -1
v 0 23 -1
v 0 31 -1
v 1 2 -1
v 1 17 -1
v 1 19 -1
v 1 21 -1
v 1 23 -1
v 1 31 -1
v -2 18 -2
v -2 19 -2
v -2 21 -2
v -2 22 -2
v 0 18 -2
v 0 19 -2
v 0 21 -2
v 0 22 -2
v -4 17 -8
v -4 23 -8
v -3 18 -8
v -3 19 -8
v -3 21 -8
v -3 22 -8
v -2 18 -8
v -2 22 -8
v 0 18 -8
v 0 19 -8
v 0 21 -8
v 0 22 -8
v 1 18 -8
v 1 19 -8
v 1 21 -8
v 1 22 -8
v 2 17 -8
v 2 23 -8
v -5 0 -12
v -5 1 -12
v -5 32 -12
v -5 33 -12
v 3 0 -12
v 3 1 -12
v 3 32 -12
v 3 33 -12
v -4 1 -13
v -4 2 -13
v -4 31 -13
v -4 32 -13
v 2 1 -13
v 2 2 -13
v 2 31 -13
v 2 32 -13
v -3 2 -14
v -3 18 -14
v -3 22 -14
v -3 31 -14
v -2 2 -14
v -2 18 -14
v -2 22 -14
v -2 31 -14
v 0 2 -14
v 0 18 -14
v 0 22 -14
v 0 31 -14
v 1 2 -14
v 1 18 -14
v 1 22 -14
v 1 31 -14
v -3 2 -17
v -3 31 -17
v -2 2 -17
v -2 31 -17
v 0 2 -17
v 0 31 -17
v 1 2 -17
v 1 31 -17
v -3 2 17
v -3 31 17
v -2 2 17
v -2 31 17
v 0 2 17
v 0 31 17
v 1 2 17
v 1 31 17
v -3 2 14
v -3 18 14
v -3 22 14
v -3 31 14
v -2 2 14
v -2 18 14
v -2 22 14
v -2 31 14
v 0 2 14
v 0 18 14
v 0 22 14
v 0 31 14
v 1 2 14
v 1 18 14
v 1 22 14
v 1 31 14
v -4 1 13
v -4 2 13
v -4 31 13
v -4 32 13
v 2 1 13
v 2 2 13
v 2 31 13
v 2 32 13
v -5 0 12
v -5 1 12
v -5 32 12
v -5 33 12
v 3 0 12
v 3 1 12
v 3 32 12
v 3 33 12
v -4 17 8
v -4 23 8
v -3 18 8
v -3 19 8
v -3 21 8
v -3 22 8
v -2 18 8
v -2 22 8
v 0 18 8
v 0 22 8
v 1 18 8
v 1 19 8
v 1 21 8
v 1 22 8
v 2 17 8
v 2 23 8
v -2 18 2
v -2 19 2
v -2 21 2
v -2 22 2
v 0 18 2
v 0 19 2
v 0 21 2
v 0 22 2
v -3 2 1
v -3 17 1
v -3 19 1
v -3 21 1
v -3 23 1
v -3 31 1
v -2 2 1
v -2 17 1
v -2 19 1
v -2 21 1
v -2 23 1
v -2 31 1
v 0 2 1
v 0 17 1
v 0 19 1
v 0 21 1
v 0 23 1
v 0 31 1
v 1 2 1
v 1 17 1
v 1 19 1
v 1 21 1
v 1 23 1
v 1 31 1
v -3 2 -2
v -3 17 -2
v -3 18 -2
v -3 22 -2
v -3 23 -2
v -3 31 -2
v -2 2 -2
v -2 17 -2
v -2 18 -2
v -2 22 -2
v -2 23 -2
v -2 31 -2
v 0 2 -2
v 0 17 -2
v 0 18 -2
v 0 22 -2
v 0 23 -2
v 0 31 -2
v 1 2 -2
v 1 17 -2
v 1 18 -2
v 1 22 -2
v 1 23 -2
v 1 31 -2
v -4 1 -3
v -4 2 -3
v -4 31 -3
v -4 32 -3
v -2 18 -3
v -2 19 -3
v -2 21 -3
v -2 22 -3
v 0 18 -3
v 0 19 -3
v 0 21 -3
v 0 22 -3
v 2 1 -3
v 2 2 -3
v 2 31 -3
v 2 32 -3
v -5 0 -4
v -5 1 -4
v -5 32 -4
v -5 33 -4
v 3 0 -4
v 3 1 -4
v 3 32 -4
v 3 33 -4
v -4 17 -9
v -4 23 -9
v -3 18 -9
v -3 19 -9
v -3 21 -9
v -3 22 -9
v -2 18 -9
v -2 22 -9
v 0 18 -9
v 0 19 -9
v 0 21 -9
v 0 22 -9
v 1 18 -9
v 1 19 -9
v 1 21 -9
v 1 22 -9
v 2 17 -9
v 2 23 -9
v -3 2 -15
v -3 19 -15
v -3 21 -15
v -3 31 -15
v -2 2 -15
v -2 19 -15
v -2 21 -15
v -2 31 -15
v 0 2 -15
v 0 19 -15
v 0 21 -15
v 0 31 -15
v 1 2 -15
v 1 19 -15
v 1 21 -15
v 1 31 -15
v -3 2 -18
v -3 31 -18
v -2 2 -18
v -2 31 -18
v 0 2 -18
v 0 31 -18
v 1 2 -18
v 1 31 -18
v -4 1 -19
v -4 2 -19
v -4 31 -19
v -4 32 -19
v 2 1 -19
v 2 2 -19
v 2 31 -19
v 2 32 -19
v -5 0 -20
v -5 1 -20
v -5 32 -20
v -5 33 -20
v 3 0 -20
v 3 1 -20
v 3 32 -20
v 3 33 -20
v -5 0 20
v 3 0 20
v -5 0 12
v 3 0 12
v -5 0 4
v 3 0 4
v -5 0 -4
v 3 0 -4
v -5 0 -12
v 3 0 -12
v -5 0 -20
v 3 0 -20
v -4 17 9
v 2 17 9
v -4 17 8
v 2 17 8
v -4 17 -8
v 2 17 -8
v -4 17 -9
v 2 17 -9
v -3 18 14
v -2 18 14
v 0 18 14
v 1 18 14
v -3 18 9
v -2 18 9
v 0 18 9
v 1 18 9
v -3 18 8
v -2 18 8
v 0 18 8
v 1 18 8
v -3 18 3
v -2 18 3
v 0 18 3
v 1 18 3
v -3 18 2
v -2 18 2
v 0 18 2
v 1 18 2
v -3 18 -2
v -2 18 -2
v 0 18 -2
v 1 18 -2
v -3 18 -3
v -2 18 -3
v 0 18 -3
v 1 18 -3
v -3 18 -8
v -2 18 -8
v 0 18 -8
v 1 18 -8
v -3 18 -9
v -2 18 -9
v 0 18 -9
v 1 18 -9
v -3 18 -14
v -2 18 -14
v 0 18 -14
v 1 18 -14
v -3 21 15
v -2 21 15
v 0 21 15
v 1 21 15
v -3 21 9
v 1 21 9
v -3 21 8
v 1 21 8
v -3 21 3
v -2 21 3
v 0 21 3
v 1 21 3
v -2 21 2
v 0 21 2
v -3 21 1
v -2 21 1
v 0 21 1
v 1 21 1
v -3 21 -1
v -2 21 -1
v 0 21 -1
v 1 21 -1
v -2 21 -2
v 0 21 -2
v -3 21 -3
v -2 21 -3
v 0 21 -3
v 1 21 -3
v -3 21 -8
v 0 21 -8
v 1 21 -8
v -3 21 -9
v 0 21 -9
v 1 21 -9
v -3 21 -15
v -2 21 -15
v 0 21 -15
v 1 21 -15
v -2 22 9
v 0 22 9
v -2 22 8
v 0 22 8
v -2 22 -8
v 0 22 -8
v -2 22 -9
v 0 22 -9
v -4 31 19
v 2 31 19
v -3 31 18
v -2 31 18
v 0 31 18
v 1 31 18
v -3 31 17
v -2 31 17
v 0 31 17
v 1 31 17
v -3 31 15
v -2 31 15
v 0 31 15
v 1 31 15
v -3 31 14
v -2 31 14
v 0 31 14
v 1 31 14
v -4 31 13
v 2 31 13
v -4 31 3
v 2 31 3
v -3 31 2
v -2 31 2
v 0 31 2
v 1 31 2
v -3 31 1
v -2 31 1
v 0 31 1
v 1 31 1
v -3 31 -1
v -2 31 -1
v 0 31 -1
v 1 31 -1
v -3 31 -2
v -2 31 -2
v 0 31 -2
v 1 31 -2
v -4 31 -3
v 2 31 -3
v -4 31 -13
v 2 31 -13
v -3 31 -14
v -2 31 -14
v 0 31 -14
v 1 31 -14
v -3 31 -15
v -2 31 -15
v 0 31 -15
v 1 31 -15
v -3 31 -17
v -2 31 -17
v 0 31 -17
v 1 31 -17
v -3 31 -18
v -2 31 -18
v 0 31 -18
v 1 31 -18
v -4 31 -19
v 2 31 -19
v -5 32 20
v 3 32 20
v -4 32 19
v 2 32 19
v -4 32 13
v 2 32 13
v -5 32 12
v 3 32 12
v -5 32 4
v 3 32 4
v -4 32 3
v 2 32 3
v -4 32 -3
v 2 32 -3
v -5 32 -4
v 3 32 -4
v -5 32 -12
v 3 32 -12
v -4 32 -13
v 2 32 -13
v -4 32 -19
v 2 32 -19
v -5 32 -20
v 3 32 -20
v -5 1 20
v 3 1 20
v -4 1 19
v 2 1 19
v -4 1 13
v 2 1 13
v -5 1 12
v 3 1 12
v -5 1 4
v 3 1 4
v -4 1 3
v 2 1 3
v -4 1 -3
v 2 1 -3
v -5 1 -4
v 3 1 -4
v -5 1 -12
v 3 1 -12
v -4 1 -13
v 2 1 -13
v -4 1 -19
v 2 1 -19
v -5 1 -20
v 3 1 -20
v -4 2 19
v 2 2 19
v -3 2 18
v -2 2 18
v 0 2 18
v 1 2 18
v -3 2 17
v -2 2 17
v 0 2 17
v 1 2 17
v -3 2 15
v -2 2 15
v 0 2 15
v 1 2 15
v -3 2 14
v -2 2 14
v 0 2 14
v 1 2 14
v -4 2 13
v 2 2 13
v -4 2 3
v 2 2 3
v -3 2 2
v -2 2 2
v 0 2 2
v 1 2 2
v -3 2 1
v -2 2 1
v 0 2 1
v 1 2 1
v -3 2 -1
v -2 2 -1
v 0 2 -1
v 1 2 -1
v -3 2 -2
v -2 2 -2
v 0 2 -2
v 1 2 -2
v -4 2 -3
v 2 2 -3
v -4 2 -13
v 2 2 -13
v -3 2 -14
v -2 2 -14
v 0 2 -14
v 1 2 -14
v -3 2 -15
v -2 2 -15
v 0 2 -15
v 1 2 -15
v -3 2 -17
v -2 2 -17
v 0 2 -17
v 1 2 -17
v -3 2 -18
v -2 2 -18
v 0 2 -18
v 1 2 -18
v -4 2 -19
v 2 2 -19
v -2 18 9
v 0 18 9
v -2 18 8
v 0 18 8
v -2 18 -8
v 0 18 -8
v -2 18 -9
v 0 18 -9
v -3 19 15
v -2 19 15
v 0 19 15
v 1 19 15
v -3 19 9
v 1 19 9
v -3 19 8
v 1 19 8
v -3 19 3
v -2 19 3
v 0 19 3
v 1 19 3
v -2 19 2
v 0 19 2
v -3 19 1
v -2 19 1
v 0 19 1
v 1 19 1
v -3 19 -1
v -2 19 -1
v 0 19 -1
v 1 19 -1
v -2 19 -2
v 0 19 -2
v -3 19 -3
v -2 19 -3
v 0 19 -3
v 1 19 -3
v -3 19 -8
v 0 19 -8
v 1 19 -8
v -3 19 -9
v 0 19 -9
v 1 19 -9
v -3 19 -15
v -2 19 -15
v 0 19 -15
v 1 19 -15
v -3 22 14
v -2 22 14
v 0 22 14
v 1 22 14
v -3 22 9
v -2 22 9
v 0 22 9
v 1 22 9
v -3 22 8
v -2 22 8
v 0 22 8
v 1 22 8
v -3 22 3
v -2 22 3
v 0 22 3
v 1 22 3
v -3 22 2
v -2 22 2
v 0 22 2
v 1 22 2
v -3 22 -2
v -2 22 -2
v 0 22 -2
v 1 22 -2
v -3 22 -3
v -2 22 -3
v 0 22 -3
v 1 22 -3
v -3 22 -8
v -2 22 -8
v 0 22 -8
v 1 22 -8
v -3 22 -9
v -2 22 -9
v 0 22 -9
v 1 22 -9
v -3 22 -14
v -2 22 -14
v 0 22 -14
v 1 22 -14
v -4 23 9
v 2 23 9
v -4 23 8
v 2 23 8
v -4 23 -8
v 2 23 -8
v -4 23 -9
v 2 23 -9
v -5 33 20
v 3 33 20
v -5 33 12
v 3 33 12
v -5 33 4
v 3 33 4
v -5 33 -4
v 3 33 -4
v -5 33 -12
v 3 33 -12
v -5 33 -20
v 3 33 -20

# faces
f 7/3/1 2/3/1 1/3/1
f 8/3/1 2/3/1 7/3/1
f 9/3/1 4/3/1 3/3/1
f 10/3/1 4/3/1 9/3/1
f 11/3/1 6/3/1 5/3/1
f 12/3/1 6/3/1 11/3/1
f 19/3/1 14/3/1 13/3/1
f 20/3/1 14/3/1 19/3/1
f 21/3/1 16/3/1 15/3/1
f 22/3/1 16/3/1 21/3/1
f 23/3/1 18/3/1 17/3/1
f 24/3/1 18/3/1 23/3/1
f 31/4/1 26/4/1 25/4/1
f 32/4/1 26/4/1 31/4/1
f 33/4/1 28/4/1 27/4/1
f 34/4/1 28/4/1 33/4/1
f 35/4/1 30/4/1 29/4/1
f 36/4/1 30/4/1 35/4/1
f 41/2/1 38/2/1 37/2/1
f 42/2/1 38/2/1 41/2/1
f 43/2/1 40/2/1 39/2/1
f 44/2/1 40/2/1 43/2/1
f 51/4/1 46/4/1 45/4/1
f 52/4/1 46/4/1 51/4/1
f 53/4/1 48/4/1 47/4/1
f 54/4/1 48/4/1 53/4/1
f 55/4/1 50/4/1 49/4/1
f 56/4/1 50/4/1 55/4/1
f 69/4/1 62/4/1 61/4/1
f 70/4/1 62/4/1 69/4/1
f 71/4/1 64/4/1 63/4/1
f 72/4/1 64/4/1 71/4/1
f 73/4/1 60/4/1 59/4/1
f 77/1/1 70/1/1 69/1/1
f 78/1/1 72/1/1 71/1/1
f 82/4/1 66/4/1 65/4/1
f 83/4/1 73/4/1 59/4/1
f 83/4/1 74/4/1 73/4/1
f 84/4/1 74/4/1 83/4/1
f 85/4/1 76/4/1 75/4/1
f 86/1/1 77/1/1 76/1/1
f 86/4/1 76/4/1 85/4/1
f 87/1/1 70/1/1 77/1/1
f 87/1/1 77/1/1 86/1/1
f 88/1/1 78/1/1 71/1/1
f 88/1/1 79/1/1 78/1/1
f 89/4/1 80/4/1 79/4/1
f 89/1/1 79/1/1 88/1/1
f 90/4/1 80/4/1 89/4/1
f 91/4/1 82/4/1 81/4/1
f 92/4/1 66/4/1 82/4/1
f 92/4/1 82/4/1 91/4/1
f 103/4/1 94/4/1 93/4/1
f 104/4/1 94/4/1 103/4/1
f 105/4/1 96/4/1 95/4/1
f 106/1/1 97/1/1 96/1/1
f 106/4/1 96/4/1 105/4/1
f 107/1/1 97/1/1 106/1/1
f 108/1/1 99/1/1 98/1/1
f 109/4/1 100/4/1 99/4/1
f 109/1/1 99/1/1 108/1/1
f 110/4/1 100/4/1 109/4/1
f 111/4/1 102/4/1 101/4/1
f 112/4/1 102/4/1 111/4/1
f 113/1/1 97/1/1 107/1/1
f 114/1/1 97/1/1 113/1/1
f 115/1/1 108/1/1 98/1/1
f 116/1/1 108/1/1 115/1/1
f 117/4/1 58/4/1 57/4/1
f 118/4/1 58/4/1 117/4/1
f 119/4/1 103/4/1 93/4/1
f 120/4/1 103/4/1 119/4/1
f 121/4/1 114/4/1 113/4/1
f 122/4/1 114/4/1 121/4/1
f 123/4/1 116/4/1 115/4/1
f 124/4/1 116/4/1 123/4/1
f 125/4/1 102/4/1 112/4/1
f 126/4/1 102/4/1 125/4/1
f 127/4/1 68/4/1 67/4/1
f 128/4/1 68/4/1 127/4/1
f 133/1/1 130/1/1 129/1/1
f 134/1/1 130/1/1 133/1/1
f 135/1/1 132/1/1 131/1/1
f 136/1/1 132/1/1 135/1/1
f 149/4/1 142/4/1 141/4/1
f 150/4/1 142/4/1 149/4/1
f 151/4/1 144/4/1 143/4/1
f 152/4/1 144/4/1 151/4/1
f 153/4/1 140/4/1 139/4/1
f 157/1/1 150/1/1 149/1/1
f 158/1/1 152/1/1 151/1/1
f 162/4/1 146/4/1 145/4/1
f 163/4/1 156/4/1 155/4/1
f 163/4/1 153/4/1 139/4/1
f 163/4/1 154/4/1 153/4/1
f 163/4/1 155/4/1 154/4/1
f 164/4/1 156/4/1 163/4/1
f 165/1/1 150/1/1 157/1/1
f 166/1/1 150/1/1 165/1/1
f 167/1/1 158/1/1 151/1/1
f 168/1/1 158/1/1 167/1/1
f 169/4/1 162/4/1 161/4/1
f 169/4/1 161/4/1 160/4/1
f 169/4/1 160/4/1 159/4/1
f 170/4/1 162/4/1 169/4/1
f 171/4/1 162/4/1 170/4/1
f 172/4/1 146/4/1 162/4/1
f 172/4/1 162/4/1 171/4/1
f 180/2/1 171/2/1 170/2/1
f 181/2/1 171/2/1 180/2/1
f 183/4/1 174/4/1 173/4/1
f 184/4/1 174/4/1 183/4/1
f 185/4/1 174/4/1 184/4/1
f 186/4/1 174/4/1 185/4/1
f 187/1/1 176/1/1 175/1/1
f 188/1/1 178/1/1 177/1/1
f 189/4/1 182/4/1 181/4/1
f 189/4/1 180/4/1 179/4/1
f 189/4/1 181/4/1 180/4/1
f 190/4/1 182/4/1 189/4/1
f 191/4/1 182/4/1 190/4/1
f 192/4/1 182/4/1 191/4/1
f 193/1/1 176/1/1 187/1/1
f 194/1/1 176/1/1 193/1/1
f 195/1/1 188/1/1 177/1/1
f 196/1/1 188/1/1 195/1/1
f 197/4/1 138/4/1 137/4/1
f 198/4/1 138/4/1 197/4/1
f 199/4/1 183/4/1 173/4/1
f 200/4/1 183/4/1 199/4/1
f 201/4/1 194/4/1 193/4/1
f 202/4/1 194/4/1 201/4/1
f 203/4/1 196/4/1 195/4/1
f 204/4/1 196/4/1 203/4/1
f 205/4/1 182/4/1 192/4/1
f 206/4/1 182/4/1 205/4/1
f 207/4/1 148/4/1 147/4/1
f 208/4/1 148/4/1 207/4/1
f 211/2/1 210/2/1 209/2/1
f 212/2/1 210/2/1 211/2/1
f 213/2/2 214/2/2 217/2/2
f 217/2/2 214/2/2 218/2/2
f 215/2/2 216/2/2 219/2/2
f 219/2/2 216/2/2 220/2/2
f 225/4/2 226/4/2 233/4/2
f 233/4/2 226/4/2 234/4/2
f 227/4/2 228/4/2 235/4/2
f 235/4/2 228/4/2 236/4/2
f 223/4/2 224/4/2 237/4/2
f 233/1/2 234/1/2 241/1/2
f 235/1/2 236/1/2 242/1/2
f 229/4/2 230/4/2 246/4/2
f 239/4/2 240/4/2 247/4/2
f 223/4/2 237/4/2 247/4/2
f 237/4/2 238/4/2 247/4/2
f 238/4/2 239/4/2 247/4/2
f 247/4/2 240/4/2 248/4/2
f 241/1/2 234/1/2 249/1/2
f 249/1/2 234/1/2 250/1/2
f 235/1/2 242/1/2 251/1/2
f 251/1/2 242/1/2 252/1/2
f 245/4/2 246/4/2 253/4/2
f 244/4/2 245/4/2 253/4/2
f 243/4/2 244/4/2 253/4/2
f 246/4/2 230/4/2 254/4/2
f 253/4/2 246/4/2 254/4/2
f 255/4/2 256/4/2 263/4/2
f 263/4/2 256/4/2 264/4/2
f 264/4/2 256/4/2 265/4/2
f 265/4/2 256/4/2 266/4/2
f 257/1/2 258/1/2 267/1/2
f 259/1/2 260/1/2 268/1/2
f 261/4/2 262/4/2 269/4/2
f 269/4/2 262/4/2 270/4/2
f 270/4/2 262/4/2 271/4/2
f 271/4/2 262/4/2 272/4/2
f 267/1/2 258/1/2 273/1/2
f 273/1/2 258/1/2 274/1/2
f 259/1/2 268/1/2 275/1/2
f 275/1/2 268/1/2 276/1/2
f 221/4/2 222/4/2 277/4/2
f 277/4/2 222/4/2 278/4/2
f 255/4/2 263/4/2 279/4/2
f 279/4/2 263/4/2 280/4/2
f 273/4/2 274/4/2 281/4/2
f 281/4/2 274/4/2 282/4/2
f 275/4/2 276/4/2 283/4/2
f 283/4/2 276/4/2 284/4/2
f 272/4/2 262/4/2 285/4/2
f 285/4/2 262/4/2 286/4/2
f 231/4/2 232/4/2 287/4/2
f 287/4/2 232/4/2 288/4/2
f 289/1/2 290/1/2 293/1/2
f 293/1/2 290/1/2 294/1/2
f 291/1/2 292/1/2 295/1/2
f 295/1/2 292/1/2 296/1/2
f 301/4/2 302/4/2 309/4/2
f 309/4/2 302/4/2 310/4/2
f 303/4/2 304/4/2 311/4/2
f 311/4/2 304/4/2 312/4/2
f 299/4/2 300/4/2 313/4/2
f 309/1/2 310/1/2 317/1/2
f 311/1/2 312/1/2 318/1/2
f 305/4/2 306/4/2 322/4/2
f 299/4/2 313/4/2 323/4/2
f 313/4/2 314/4/2 323/4/2
f 323/4/2 314/4/2 324/4/2
f 315/4/2 316/4/2 325/4/2
f 316/1/2 317/1/2 326/1/2
f 325/4/2 316/4/2 326/4/2
f 317/1/2 310/1/2 327/1/2
f 326/1/2 317/1/2 327/1/2
f 311/1/2 318/1/2 328/1/2
f 318/1/2 319/1/2 328/1/2
f 319/4/2 320/4/2 329/4/2
f 328/1/2 319/1/2 329/1/2
f 329/4/2 320/4/2 330/4/2
f 321/4/2 322/4/2 331/4/2
f 322/4/2 306/4/2 332/4/2
f 331/4/2 322/4/2 332/4/2
f 333/4/2 334/4/2 343/4/2
f 343/4/2 334/4/2 344/4/2
f 335/4/2 336/4/2 345/4/2
f 336/1/2 337/1/2 346/1/2
f 345/4/2 336/4/2 346/4/2
f 346/1/2 337/1/2 347/1/2
f 338/1/2 339/1/2 348/1/2
f 339/4/2 340/4/2 349/4/2
f 348/1/2 339/1/2 349/1/2
f 349/4/2 340/4/2 350/4/2
f 341/4/2 342/4/2 351/4/2
f 351/4/2 342/4/2 352/4/2
f 347/1/2 337/1/2 353/1/2
f 353/1/2 337/1/2 354/1/2
f 338/1/2 348/1/2 355/1/2
f 355/1/2 348/1/2 356/1/2
f 297/4/2 298/4/2 357/4/2
f 357/4/2 298/4/2 358/4/2
f 333/4/2 343/4/2 359/4/2
f 359/4/2 343/4/2 360/4/2
f 353/4/2 354/4/2 361/4/2
f 361/4/2 354/4/2 362/4/2
f 355/4/2 356/4/2 363/4/2
f 363/4/2 356/4/2 364/4/2
f 352/4/2 342/4/2 365/4/2
f 365/4/2 342/4/2 366/4/2
f 307/4/2 308/4/2 367/4/2
f 367/4/2 308/4/2 368/4/2
f 369/4/2 370/4/2 375/4/2
f 375/4/2 370/4/2 376/4/2
f 371/4/2 372/4/2 377/4/2
f 377/4/2 372/4/2 378/4/2
f 373/4/2 374/4/2 379/4/2
f 379/4/2 374/4/2 380/4/2
f 381/2/2 382/2/2 385/2/2
f 385/2/2 382/2/2 386/2/2
f 383/2/2 384/2/2 387/2/2
f 387/2/2 384/2/2 388/2/2
f 389/4/2 390/4/2 395/4/2
f 395/4/2 390/4/2 396/4/2
f 391/4/2 392/4/2 397/4/2
f 397/4/2 392/4/2 398/4/2
f 393/4/2 394/4/2 399/4/2
f 399/4/2 394/4/2 400/4/2
f 401/3/2 402/3/2 407/3/2
f 407/3/2 402/3/2 408/3/2
f 403/3/2 404/3/2 409/3/2
f 409/3/2 404/3/2 410/3/2
f 405/3/2 406/3/2 411/3/2
f 411/3/2 406/3/2 412/3/2
f 413/3/2 414/3/2 419/3/2
f 419/3/2 414/3/2 420/3/2
f 415/3/2 416/3/2 421/3/2
f 421/3/2 416/3/2 422/3/2
f 417/3/2 418/3/2 423/3/2
f 423/3/2 418/3/2 424/3/2
f 429/3/3 426/3/3 425/3/3
f 430/3/3 426/3/3 429/3/3
f 431/3/3 428/3/3 427/3/3
f 432/3/3 428/3/3 431/3/3
f 437/4/3 434/4/3 433/4/3
f 438/4/3 434/4/3 437/4/3
f 439/4/3 436/4/3 435/4/3
f 440/4/3 436/4/3 439/4/3
f 443/4/3 442/4/3 441/4/3
f 444/4/3 442/4/3 443/4/3
f 447/4/3 446/4/3 445/4/3
f 448/4/3 446/4/3 447/4/3
f 453/4/3 450/4/3 449/4/3
f 454/4/3 450/4/3 453/4/3
f 455/4/3 452/4/3 451/4/3
f 456/4/3 452/4/3 455/4/3
f 461/4/3 458/4/3 457/4/3
f 462/4/3 458/4/3 461/4/3
f 463/4/3 460/4/3 459/4/3
f 464/4/3 460/4/3 463/4/3
f 467/2/3 466/2/3 465/2/3
f 468/2/3 466/2/3 467/2/3
f 469/2/3 466/2/3 468/2/3
f 470/2/3 466/2/3 469/2/3
f 471/2/3 467/2/3 465/2/3
f 472/2/3 466/2/3 470/2/3
f 473/2/3 471/2/3 465/2/3
f 474/2/3 466/2/3 472/2/3
f 475/2/3 473/2/3 465/2/3
f 478/2/3 466/2/3 474/2/3
f 479/2/3 477/2/3 476/2/3
f 479/2/3 478/2/3 477/2/3
f 479/2/3 475/2/3 465/2/3
f 479/2/3 476/2/3 475/2/3
f 480/2/3 466/2/3 478/2/3
f 480/2/3 478/2/3 479/2/3
f 485/3/3 482/3/3 481/3/3
f 486/3/3 482/3/3 485/3/3
f 487/3/3 484/3/3 483/3/3
f 488/3/3 484/3/3 487/3/3
f 497/1/3 494/1/3 493/1/3
f 497/1/3 496/1/3 495/1/3
f 497/1/3 495/1/3 494/1/3
f 498/1/3 496/1/3 497/1/3
f 499/1/3 496/1/3 498/1/3
f 500/1/3 496/1/3 499/1/3
f 501/4/3 490/4/3 489/4/3
f 502/4/3 490/4/3 501/4/3
f 503/4/3 492/4/3 491/4/3
f 504/4/3 492/4/3 503/4/3
f 511/4/3 506/4/3 505/4/3
f 512/1/3 507/1/3 506/1/3
f 512/4/3 506/4/3 511/4/3
f 513/1/3 507/1/3 512/1/3
f 514/1/3 509/1/3 508/1/3
f 515/4/3 510/4/3 509/4/3
f 515/1/3 509/1/3 514/1/3
f 516/4/3 510/4/3 515/4/3
f 523/4/3 518/4/3 517/4/3
f 524/1/3 519/1/3 518/1/3
f 524/4/3 518/4/3 523/4/3
f 525/1/3 519/1/3 524/1/3
f 526/1/3 521/1/3 520/1/3
f 527/4/3 522/4/3 521/4/3
f 527/1/3 521/1/3 526/1/3
f 528/4/3 522/4/3 527/4/3
f 535/4/3 530/4/3 529/4/3
f 536/1/3 531/1/3 530/1/3
f 536/4/3 530/4/3 535/4/3
f 537/1/3 531/1/3 536/1/3
f 538/1/3 533/1/3 532/1/3
f 539/4/3 534/4/3 533/4/3
f 539/1/3 533/1/3 538/1/3
f 540/4/3 534/4/3 539/4/3
f 547/4/3 542/4/3 541/4/3
f 548/1/3 543/1/3 542/1/3
f 548/4/3 542/4/3 547/4/3
f 549/1/3 543/1/3 548/1/3
f 550/1/3 545/1/3 544/1/3
f 551/4/3 546/4/3 545/4/3
f 551/1/3 545/1/3 550/1/3
f 552/4/3 546/4/3 551/4/3
f 557/1/3 554/1/3 553/1/3
f 557/1/3 556/1/3 555/1/3
f 557/1/3 555/1/3 554/1/3
f 558/1/3 556/1/3 557/1/3
f 559/1/3 556/1/3 558/1/3
f 560/1/3 556/1/3 559/1/3
f 563/2/3 562/2/3 561/2/3
f 564/2/3 562/2/3 563/2/3
f 565/2/3 562/2/3 564/2/3
f 566/2/3 562/2/3 565/2/3
f 567/2/3 563/2/3 561/2/3
f 568/2/3 562/2/3 566/2/3
f 569/2/3 567/2/3 561/2/3
f 572/2/3 562/2/3 568/2/3
f 573/2/3 569/2/3 561/2/3
f 574/2/3 571/2/3 570/2/3
f 575/2/3 571/2/3 574/2/3
f 576/2/3 562/2/3 572/2/3
f 577/2/3 573/2/3 561/2/3
f 577/2/3 576/2/3 575/2/3
f 577/2/3 575/2/3 574/2/3
f 577/2/3 574/2/3 573/2/3
f 578/2/3 562/2/3 576/2/3
f 578/2/3 576/2/3 577/2/3
f 583/3/3 580/3/3 579/3/3
f 584/3/3 580/3/3 583/3/3
f 585/3/3 582/3/3 581/3/3
f 586/3/3 582/3/3 585/3/3
f 591/4/3 588/4/3 587/4/3
f 592/4/3 588/4/3 591/4/3
f 593/4/3 590/4/3 589/4/3
f 594/4/3 590/4/3 593/4/3
f 599/4/3 596/4/3 595/4/3
f 600/4/3 596/4/3 599/4/3
f 601/4/3 598/4/3 597/4/3
f 602/4/3 598/4/3 601/4/3
f 607/4/3 604/4/3 603/4/3
f 608/4/3 604/4/3 607/4/3
f 609/4/3 606/4/3 605/4/3
f 610/4/3 606/4/3 609/4/3
f 613/4/3 612/4/3 611/4/3
f 614/4/3 612/4/3 613/4/3
f 617/4/3 616/4/3 615/4/3
f 618/4/3 616/4/3 617/4/3
f 619/4/4 620/4/4 621/4/4
f 621/4/4 620/4/4 622/4/4
f 623/4/4 624/4/4 625/4/4
f 625/4/4 624/4/4 626/4/4
f 627/4/4 628/4/4 631/4/4
f 631/4/4 628/4/4 632/4/4
f 629/4/4 630/4/4 633/4/4
f 633/4/4 630/4/4 634/4/4
f 635/4/4 636/4/4 639/4/4
f 639/4/4 636/4/4 640/4/4
f 637/4/4 638/4/4 641/4/4
f 641/4/4 638/4/4 642/4/4
f 643/4/4 644/4/4 647/4/4
f 647/4/4 644/4/4 648/4/4
f 645/4/4 646/4/4 649/4/4
f 649/4/4 646/4/4 650/4/4
f 651/3/4 652/3/4 655/3/4
f 655/3/4 652/3/4 656/3/4
f 653/3/4 654/3/4 657/3/4
f 657/3/4 654/3/4 658/3/4
f 659/2/4 660/2/4 661/2/4
f 661/2/4 660/2/4 662/2/4
f 662/2/4 660/2/4 663/2/4
f 663/2/4 660/2/4 664/2/4
f 659/2/4 661/2/4 665/2/4
f 664/2/4 660/2/4 666/2/4
f 659/2/4 665/2/4 667/2/4
f 666/2/4 660/2/4 668/2/4
f 659/2/4 667/2/4 669/2/4
f 668/2/4 660/2/4 672/2/4
f 670/2/4 671/2/4 673/2/4
f 671/2/4 672/2/4 673/2/4
f 659/2/4 669/2/4 673/2/4
f 669/2/4 670/2/4 673/2/4
f 672/2/4 660/2/4 674/2/4
f 673/2/4 672/2/4 674/2/4
f 675/1/4 676/1/4 679/1/4
f 677/1/4 678/1/4 679/1/4
f 676/1/4 677/1/4 679/1/4
f 679/1/4 678/1/4 680/1/4
f 680/1/4 678/1/4 681/1/4
f 681/1/4 678/1/4 682/1/4
f 683/4/4 684/4/4 689/4/4
f 684/1/4 685/1/4 690/1/4
f 689/4/4 684/4/4 690/4/4
f 690/1/4 685/1/4 691/1/4
f 686/1/4 687/1/4 692/1/4
f 687/4/4 688/4/4 693/4/4
f 692/1/4 687/1/4 693/1/4
f 693/4/4 688/4/4 694/4/4
f 695/4/4 696/4/4 701/4/4
f 696/1/4 697/1/4 702/1/4
f 701/4/4 696/4/4 702/4/4
f 702/1/4 697/1/4 703/1/4
f 698/1/4 699/1/4 704/1/4
f 699/4/4 700/4/4 705/4/4
f 704/1/4 699/1/4 705/1/4
f 705/4/4 700/4/4 706/4/4
f 707/4/4 708/4/4 713/4/4
f 708/1/4 709/1/4 714/1/4
f 713/4/4 708/4/4 714/4/4
f 714/1/4 709/1/4 715/1/4
f 710/1/4 711/1/4 716/1/4
f 711/4/4 712/4/4 717/4/4
f 716/1/4 711/1/4 717/1/4
f 717/4/4 712/4/4 718/4/4
f 719/4/4 720/4/4 725/4/4
f 720/1/4 721/1/4 726/1/4
f 725/4/4 720/4/4 726/4/4
f 726/1/4 721/1/4 727/1/4
f 722/1/4 723/1/4 728/1/4
f 723/4/4 724/4/4 729/4/4
f 728/1/4 723/1/4 729/1/4
f 729/4/4 724/4/4 730/4/4
f 735/1/4 736/1/4 739/1/4
f 737/1/4 738/1/4 739/1/4
f 736/1/4 737/1/4 739/1/4
f 739/1/4 738/1/4 740/1/4
f 740/1/4 738/1/4 741/1/4
f 741/1/4 738/1/4 742/1/4
f 731/4/4 732/4/4 743/4/4
f 743/4/4 732/4/4 744/4/4
f 733/4/4 734/4/4 745/4/4
f 745/4/4 734/4/4 746/4/4
f 747/3/4 748/3/4 751/3/4
f 751/3/4 748/3/4 752/3/4
f 749/3/4 750/3/4 753/3/4
f 753/3/4 750/3/4 754/3/4
f 755/2/4 756/2/4 757/2/4
f 757/2/4 756/2/4 758/2/4
f 758/2/4 756/2/4 759/2/4
f 759/2/4 756/2/4 760/2/4
f 755/2/4 757/2/4 761/2/4
f 760/2/4 756/2/4 762/2/4
f 755/2/4 761/2/4 763/2/4
f 762/2/4 756/2/4 766/2/4
f 755/2/4 763/2/4 767/2/4
f 764/2/4 765/2/4 768/2/4
f 768/2/4 765/2/4 769/2/4
f 766/2/4 756/2/4 770/2/4
f 755/2/4 767/2/4 771/2/4
f 769/2/4 770/2/4 771/2/4
f 768/2/4 769/2/4 771/2/4
f 767/2/4 768/2/4 771/2/4
f 770/2/4 756/2/4 772/2/4
f 771/2/4 770/2/4 772/2/4
f 773/4/4 774/4/4 777/4/4
f 777/4/4 774/4/4 778/4/4
f 775/4/4 776/4/4 779/4/4
f 779/4/4 776/4/4 780/4/4
f 781/4/4 782/4/4 785/4/4
f 785/4/4 782/4/4 786/4/4
f 783/4/4 784/4/4 787/4/4
f 787/4/4 784/4/4 788/4/4
f 789/4/4 790/4/4 791/4/4
f 791/4/4 790/4/4 792/4/4
f 793/4/4 794/4/4 795/4/4
f 795/4/4 794/4/4 796/4/4
f 797/4/4 798/4/4 801/4/4
f 801/4/4 798/4/4 802/4/4
f 799/4/4 800/4/4 803/4/4
f 803/4/4 800/4/4 804/4/4
f 805/3/4 806/3/4 809/3/4
f 809/3/4 806/3/4 810/3/4
f 807/3/4 808/3/4 811/3/4
f 811/3/4 808/3/4 812/3/4
f 815/3/5 814/3/5 813/3/5
f 816/3/5 814/3/5 815/3/5
f 819/3/5 818/3/5 817/3/5
f 820/3/5 818/3/5 819/3/5
f 823/3/5 822/3/5 821/3/5
f 824/3/5 822/3/5 823/3/5
f 827/2/5 826/2/5 825/2/5
f 828/2/5 826/2/5 827/2/5
f 831/2/5 830/2/5 829/2/5
f 832/2/5 830/2/5 831/2/5
f 837/4/5 834/4/5 833/4/5
f 838/4/5 834/4/5 837/4/5
f 839/4/5 836/4/5 835/4/5
f 840/4/5 836/4/5 839/4/5
f 845/4/5 842/4/5 841/4/5
f 846/4/5 842/4/5 845/4/5
f 847/4/5 844/4/5 843/4/5
f 848/4/5 844/4/5 847/4/5
f 849/1/5 846/1/5 845/1/5
f 849/1/5 847/1/5 846/1/5
f 849/1/5 848/1/5 847/1/5
f 850/1/5 848/1/5 849/1/5
f 851/1/5 848/1/5 850/1/5
f 852/1/5 848/1/5 851/1/5
f 857/1/5 854/1/5 853/1/5
f 857/1/5 856/1/5 855/1/5
f 857/1/5 855/1/5 854/1/5
f 858/1/5 856/1/5 857/1/5
f 859/1/5 856/1/5 858/1/5
f 860/1/5 856/1/5 859/1/5
f 861/4/5 858/4/5 857/4/5
f 862/4/5 858/4/5 861/4/5
f 863/4/5 860/4/5 859/4/5
f 864/4/5 860/4/5 863/4/5
f 869/4/5 866/4/5 865/4/5
f 870/4/5 866/4/5 869/4/5
f 871/4/5 868/4/5 867/4/5
f 872/4/5 868/4/5 871/4/5
f 877/4/5 874/4/5 873/4/5
f 878/4/5 876/4/5 875/4/5
f 879/4/5 874/4/5 877/4/5
f 880/4/5 878/4/5 875/4/5
f 881/4/5 874/4/5 879/4/5
f 882/4/5 874/4/5 881/4/5
f 883/4/5 880/4/5 875/4/5
f 884/4/5 880/4/5 883/4/5
f 885/1/5 882/1/5 881/1/5
f 886/1/5 884/1/5 883/1/5
f 887/1/5 885/1/5 881/1/5
f 888/1/5 885/1/5 887/1/5
f 889/1/5 884/1/5 886/1/5
f 890/1/5 884/1/5 889/1/5
f 895/1/5 892/1/5 891/1/5
f 896/1/5 894/1/5 893/1/5
f 897/1/5 895/1/5 891/1/5
f 898/1/5 895/1/5 897/1/5
f 899/1/5 894/1/5 896/1/5
f 900/1/5 894/1/5 899/1/5
f 901/4/5 898/4/5 897/4/5
f 902/4/5 900/4/5 899/4/5
f 903/4/5 900/4/5 902/4/5
f 904/4/5 898/4/5 901/4/5
f 907/4/5 898/4/5 904/4/5
f 908/4/5 898/4/5 907/4/5
f 909/4/5 906/4/5 905/4/5
f 910/4/5 906/4/5 909/4/5
f 913/2/5 912/2/5 911/2/5
f 914/2/5 912/2/5 913/2/5
f 917/2/5 916/2/5 915/2/5
f 918/2/5 916/2/5 917/2/5
f 921/4/5 920/4/5 919/4/5
f 922/4/5 920/4/5 921/4/5
f 923/4/5 920/4/5 922/4/5
f 924/4/5 920/4/5 923/4/5
f 925/4/5 921/4/5 919/4/5
f 926/4/5 923/4/5 922/4/5
f 927/4/5 923/4/5 926/4/5
f 928/4/5 920/4/5 924/4/5
f 929/4/5 927/4/5 926/4/5
f 929/4/5 928/4/5 927/4/5
f 929/4/5 925/4/5 919/4/5
f 929/4/5 926/4/5 925/4/5
f 930/4/5 928/4/5 929/4/5
f 931/4/5 928/4/5 930/4/5
f 932/4/5 920/4/5 928/4/5
f 932/4/5 928/4/5 931/4/5
f 933/4/5 929/4/5 919/4/5
f 934/4/5 931/4/5 930/4/5
f 935/4/5 931/4/5 934/4/5
f 936/4/5 920/4/5 932/4/5
f 937/4/5 933/4/5 919/4/5
f 937/4/5 936/4/5 935/4/5
f 937/4/5 935/4/5 934/4/5
f 937/4/5 934/4/5 933/4/5
f 938/4/5 920/4/5 936/4/5
f 938/4/5 936/4/5 937/4/5
f 941/4/5 940/4/5 939/4/5
f 942/4/5 940/4/5 941/4/5
f 943/4/5 940/4/5 942/4/5
f 944/4/5 940/4/5 943/4/5
f 945/4/5 941/4/5 939/4/5
f 946/4/5 943/4/5 942/4/5
f 947/4/5 943/4/5 946/4/5
f 948/4/5 940/4/5 944/4/5
f 949/4/5 947/4/5 946/4/5
f 949/4/5 948/4/5 947/4/5
f 949/4/5 945/4/5 939/4/5
f 949/4/5 946/4/5 945/4/5
f 950/4/5 948/4/5 949/4/5
f 951/4/5 948/4/5 950/4/5
f 952/4/5 940/4/5 948/4/5
f 952/4/5 948/4/5 951/4/5
f 953/4/5 949/4/5 939/4/5
f 954/4/5 951/4/5 950/4/5
f 955/4/5 951/4/5 954/4/5
f 956/4/5 940/4/5 952/4/5
f 957/4/5 953/4/5 939/4/5
f 957/4/5 956/4/5 955/4/5
f 957/4/5 955/4/5 954/4/5
f 957/4/5 954/4/5 953/4/5
f 958/4/5 940/4/5 956/4/5
f 958/4/5 956/4/5 957/4/5
f 961/4/5 960/4/5 959/4/5
f 962/4/5 960/4/5 961/4/5
f 963/4/5 960/4/5 962/4/5
f 964/4/5 960/4/5 963/4/5
f 965/4/5 961/4/5 959/4/5
f 966/4/5 963/4/5 962/4/5
f 967/4/5 963/4/5 966/4/5
f 968/4/5 960/4/5 964/4/5
f 969/4/5 967/4/5 966/4/5
f 969/4/5 968/4/5 967/4/5
f 969/4/5 965/4/5 959/4/5
f 969/4/5 966/4/5 965/4/5
f 970/4/5 968/4/5 969/4/5
f 971/4/5 968/4/5 970/4/5
f 972/4/5 960/4/5 968/4/5
f 972/4/5 968/4/5 971/4/5
f 973/4/5 969/4/5 959/4/5
f 974/4/5 971/4/5 970/4/5
f 975/4/5 971/4/5 974/4/5
f 976/4/5 960/4/5 972/4/5
f 977/4/5 973/4/5 959/4/5
f 977/4/5 976/4/5 975/4/5
f 977/4/5 975/4/5 974/4/5
f 977/4/5 974/4/5 973/4/5
f 978/4/5 960/4/5 976/4/5
f 978/4/5 976/4/5 977/4/5
f 981/3/5 980/3/5 979/3/5
f 982/3/5 980/3/5 981/3/5
f 983/3/5 981/3/5 979/3/5
f 984/3/5 980/3/5 982/3/5
f 985/3/5 983/3/5 979/3/5
f 985/3/5 984/3/5 983/3/5
f 986/3/5 980/3/5 984/3/5
f 986/3/5 984/3/5 985/3/5
f 989/3/5 988/3/5 987/3/5
f 990/3/5 988/3/5 989/3/5
f 991/3/5 989/3/5 987/3/5
f 992/3/5 988/3/5 990/3/5
f 993/3/5 991/3/5 987/3/5
f 993/3/5 992/3/5 991/3/5
f 994/3/5 988/3/5 992/3/5
f 994/3/5 992/3/5 993/3/5
f 997/3/5 996/3/5 995/3/5
f 998/3/5 996/3/5 997/3/5
f 999/3/5 997/3/5 995/3/5
f 1000/3/5 996/3/5 998/3/5
f 1001/3/5 999/3/5 995/3/5
f 1001/3/5 1000/3/5 999/3/5
f 1002/3/5 996/3/5 1000/3/5
f 1002/3/5 1000/3/5 1001/3/5
f 1003/3/6 1004/3/6 1005/3/6
f 1005/3/6 1004/3/6 1006/3/6
f 1003/3/6 1005/3/6 1007/3/6
f 1006/3/6 1004/3/6 1008/3/6
f 1003/3/6 1007/3/6 1009/3/6
f 1007/3/6 1008/3/6 1009/3/6
f 1008/3/6 1004/3/6 1010/3/6
f 1009/3/6 1008/3/6 1010/3/6
f 1011/3/6 1012/3/6 1013/3/6
f 1013/3/6 1012/3/6 1014/3/6
f 1011/3/6 1013/3/6 1015/3/6
f 1014/3/6 1012/3/6 1016/3/6
f 1011/3/6 1015/3/6 1017/3/6
f 1015/3/6 1016/3/6 1017/3/6
f 1016/3/6 1012/3/6 1018/3/6
f 1017/3/6 1016/3/6 1018/3/6
f 1019/3/6 1020/3/6 1021/3/6
f 1021/3/6 1020/3/6 1022/3/6
f 1019/3/6 1021/3/6 1023/3/6
f 1022/3/6 1020/3/6 1024/3/6
f 1019/3/6 1023/3/6 1025/3/6
f 1023/3/6 1024/3/6 1025/3/6
f 1024/3/6 1020/3/6 1026/3/6
f 1025/3/6 1024/3/6 1026/3/6
f 1027/4/6 1028/4/6 1029/4/6
f 1029/4/6 1028/4/6 1030/4/6
f 1030/4/6 1028/4/6 1031/4/6
f 1031/4/6 1028/4/6 1032/4/6
f 1027/4/6 1029/4/6 1033/4/6
f 1030/4/6 1031/4/6 1034/4/6
f 1034/4/6 1031/4/6 1035/4/6
f 1032/4/6 1028/4/6 1036/4/6
f 1034/4/6 1035/4/6 1037/4/6
f 1035/4/6 1036/4/6 1037/4/6
f 1027/4/6 1033/4/6 1037/4/6
f 1033/4/6 1034/4/6 1037/4/6
f 1037/4/6 1036/4/6 1038/4/6
f 1038/4/6 1036/4/6 1039/4/6
f 1036/4/6 1028/4/6 1040/4/6
f 1039/4/6 1036/4/6 1040/4/6
f 1027/4/6 1037/4/6 1041/4/6
f 1038/4/6 1039/4/6 1042/4/6
f 1042/4/6 1039/4/6 1043/4/6
f 1040/4/6 1028/4/6 1044/4/6
f 1027/4/6 1041/4/6 1045/4/6
f 1043/4/6 1044/4/6 1045/4/6
f 1042/4/6 1043/4/6 1045/4/6
f 1041/4/6 1042/4/6 1045/4/6
f 1044/4/6 1028/4/6 1046/4/6
f 1045/4/6 1044/4/6 1046/4/6
f 1047/4/6 1048/4/6 1049/4/6
f 1049/4/6 1048/4/6 1050/4/6
f 1050/4/6 1048/4/6 1051/4/6
f 1051/4/6 1048/4/6 1052/4/6
f 1047/4/6 1049/4/6 1053/4/6
f 1050/4/6 1051/4/6 1054/4/6
f 1054/4/6 1051/4/6 1055/4/6
f 1052/4/6 1048/4/6 1056/4/6
f 1054/4/6 1055/4/6 1057/4/6
f 1055/4/6 1056/4/6 1057/4/6
f 1047/4/6 1053/4/6 1057/4/6
f 1053/4/6 1054/4/6 1057/4/6
f 1057/4/6 1056/4/6 1058/4/6
f 1058/4/6 1056/4/6 1059/4/6
f 1056/4/6 1048/4/6 1060/4/6
f 1059/4/6 1056/4/6 1060/4/6
f 1047/4/6 1057/4/6 1061/4/6
f 1058/4/6 1059/4/6 1062/4/6
f 1062/4/6 1059/4/6 1063/4/6
f 1060/4/6 1048/4/6 1064/4/6
f 1047/4/6 1061/4/6 1065/4/6
f 1063/4/6 1064/4/6 1065/4/6
f 1062/4/6 1063/4/6 1065/4/6
f 1061/4/6 1062/4/6 1065/4/6
f 1064/4/6 1048/4/6 1066/4/6
f 1065/4/6 1064/4/6 1066/4/6
f 1067/4/6 1068/4/6 1069/4/6
f 1069/4/6 1068/4/6 1070/4/6
f 1070/4/6 1068/4/6 1071/4/6
f 1071/4/6 1068/4/6 1072/4/6
f 1067/4/6 1069/4/6 1073/4/6
f 1070/4/6 1071/4/6 1074/4/6
f 1074/4/6 1071/4/6 1075/4/6
f 1072/4/6 1068/4/6 1076/4/6
f 1074/4/6 1075/4/6 1077/4/6
f 1075/4/6 1076/4/6 1077/4/6
f 1067/4/6 1073/4/6 1077/4/6
f 1073/4/6 1074/4/6 1077/4/6
f 1077/4/6 1076/4/6 1078/4/6
f 1078/4/6 1076/4/6 1079/4/6
f 1076/4/6 1068/4/6 1080/4/6
f 1079/4/6 1076/4/6 1080/4/6
f 1067/4/6 1077/4/6 1081/4/6
f 1078/4/6 1079/4/6 1082/4/6
f 1082/4/6 1079/4/6 1083/4/6
f 1080/4/6 1068/4/6 1084/4/6
f 1067/4/6 1081/4/6 1085/4/6
f 1083/4/6 1084/4/6 1085/4/6
f 1082/4/6 1083/4/6 1085/4/6
f 1081/4/6 1082/4/6 1085/4/6
f 1084/4/6 1068/4/6 1086/4/6
f 1085/4/6 1084/4/6 1086/4/6
f 1087/2/6 1088/2/6 1089/2/6
f 1089/2/6 1088/2/6 1090/2/6
f 1091/2/6 1092/2/6 1093/2/6
f 1093/2/6 1092/2/6 1094/2/6
f 1095/4/6 1096/4/6 1099/4/6
f 1097/4/6 1098/4/6 1100/4/6
f 1099/4/6 1096/4/6 1101/4/6
f 1097/4/6 1100/4/6 1102/4/6
f 1101/4/6 1096/4/6 1103/4/6
f 1103/4/6 1096/4/6 1104/4/6
f 1097/4/6 1102/4/6 1105/4/6
f 1105/4/6 1102/4/6 1106/4/6
f 1103/1/6 1104/1/6 1107/1/6
f 1105/1/6 1106/1/6 1108/1/6
f 1103/1/6 1107/1/6 1109/1/6
f 1109/1/6 1107/1/6 1110/1/6
f 1108/1/6 1106/1/6 1111/1/6
f 1111/1/6 1106/1/6 1112/1/6
f 1113/1/6 1114/1/6 1117/1/6
f 1115/1/6 1116/1/6 1118/1/6
f 1113/1/6 1117/1/6 1119/1/6
f 1119/1/6 1117/1/6 1120/1/6
f 1118/1/6 1116/1/6 1121/1/6
f 1121/1/6 1116/1/6 1122/1/6
f 1119/4/6 1120/4/6 1123/4/6
f 1121/4/6 1122/4/6 1124/4/6
f 1124/4/6 1122/4/6 1125/4/6
f 1123/4/6 1120/4/6 1126/4/6
f 1126/4/6 1120/4/6 1129/4/6
f 1129/4/6 1120/4/6 1130/4/6
f 1127/4/6 1128/4/6 1131/4/6
f 1131/4/6 1128/4/6 1132/4/6
f 1133/4/6 1134/4/6 1137/4/6
f 1137/4/6 1134/4/6 1138/4/6
f 1135/4/6 1136/4/6 1139/4/6
f 1139/4/6 1136/4/6 1140/4/6
f 1141/4/6 1142/4/6 1145/4/6
f 1145/4/6 1142/4/6 1146/4/6
f 1143/4/6 1144/4/6 1147/4/6
f 1147/4/6 1144/4/6 1148/4/6
f 1145/1/6 1146/1/6 1149/1/6
f 1146/1/6 1147/1/6 1149/1/6
f 1147/1/6 1148/1/6 1149/1/6
f 1149/1/6 1148/1/6 1150/1/6
f 1150/1/6 1148/1/6 1151/1/6
f 1151/1/6 1148/1/6 1152/1/6
f 1153/1/6 1154/1/6 1157/1/6
f 1155/1/6 1156/1/6 1157/1/6
f 1154/1/6 1155/1/6 1157/1/6
f 1157/1/6 1156/1/6 1158/1/6
f 1158/1/6 1156/1/6 1159/1/6
f 1159/1/6 1156/1/6 1160/1/6
f 1157/4/6 1158/4/6 1161/4/6
f 1161/4/6 1158/4/6 1162/4/6
f 1159/4/6 1160/4/6 1163/4/6
f 1163/4/6 1160/4/6 1164/4/6
f 1165/4/6 1166/4/6 1169/4/6
f 1169/4/6 1166/4/6 1170/4/6
f 1167/4/6 1168/4/6 1171/4/6
f 1171/4/6 1168/4/6 1172/4/6
f 1173/2/6 1174/2/6 1175/2/6
f 1175/2/6 1174/2/6 1176/2/6
f 1177/2/6 1178/2/6 1179/2/6
f 1179/2/6 1178/2/6 1180/2/6
f 1181/3/6 1182/3/6 1183/3/6
f 1183/3/6 1182/3/6 1184/3/6
f 1185/3/6 1186/3/6 1187/3/6
f 1187/3/6 1186/3/6 1188/3/6
f 1189/3/6 1190/3/6 1191/3/6
f 1191/3/6 1190/3/6 1192/3/6
