{
    "name": "Fala!",
    "short_name": "Fala!",
    "description": "As \u00faltimas not\u00edcias e fotos do Brasil e do mundo, faculdades, universidades, vestibular e muito mais. Not\u00edcias de alunos para alunos! Fala Universidades!",
    "icons": [
        {
            "src": "https:\/\/cdn.falauniversidades.com.br\/wp-content\/uploads\/2020\/01\/22131620\/Logo_Fala_pwa_192-1.png",
            "sizes": "192x192",
            "type": "image\/png"
        },
        {
            "src": "https:\/\/cdn.falauniversidades.com.br\/wp-content\/uploads\/2020\/01\/22131459\/Logo_Fala_pwa-1.png",
            "sizes": "512x512",
            "type": "image\/png"
        }
    ],
    "background_color": "#f16622",
    "theme_color": "#f16622",
    "display": "standalone",
    "orientation": "portrait",
    "start_url": "https:\/\/controle.falauniversidades.com.br\/",
    "scope": "https:\/\/controle.falauniversidades.com.br\/",
    "gcm_sender_id": "103953800507"
}