Design Route Status
                                               :      # nets :
   ------------------------------------------- : ----------- :
   # of logical nets.......................... :         787 :
       # of nets not needing routing.......... :         306 :
           # of internally routed nets........ :         306 :
       # of routable nets..................... :         481 :
           # of fully routed nets............. :         481 :
       # of nets with routing errors.......... :           0 :
   ------------------------------------------- : ----------- :

