Vivado Simulator 2019.2
Copyright 1986-1999, 2001-2019 Xilinx, Inc. All Rights Reserved.
Running: C:/Xilinx/Vivado/2019.2/bin/unwrapped/win64.o/xelab.exe -wto 9f404c401cb14dceb69ae0a1cb7d49e4 --incr --debug typical --relax --mt 2 -L xil_defaultlib -L secureip --snapshot CLOCK_DIVIDER_TB_behav xil_defaultlib.CLOCK_DIVIDER_TB -log elaborate.log 
Using 2 slave threads.
Starting static elaboration
Completed static elaboration
Starting simulation data flow analysis
Completed simulation data flow analysis
Time Resolution for simulation is 1ps
Compiling package std.standard
Compiling package std.textio
Compiling package ieee.std_logic_1164
Compiling architecture behavioral of entity xil_defaultlib.CLOCK_DIVIDER [clock_divider_default]
Compiling architecture behavioral of entity xil_defaultlib.clock_divider_tb
Built simulation snapshot CLOCK_DIVIDER_TB_behav
