<?xml version="1.0" encoding="UTF-8"?>
<svg width="12px" height="7px" viewBox="0 0 12 7" version="1.1" xmlns="http://www.w3.org/2000/svg" xmlns:xlink="http://www.w3.org/1999/xlink">
    <!-- Generator: Sketch 56.3 (81716) - https://sketch.com -->
    <title>Fill 1</title>
    <desc>Created with Sketch.</desc>
    <defs>
        <linearGradient x1="50%" y1="0%" x2="50%" y2="100%" id="linearGradient-1">
            <stop stop-color="#000000" offset="0%"></stop>
            <stop stop-color="#000000" stop-opacity="0.15" offset="73.0161529%"></stop>
            <stop stop-color="#000000" stop-opacity="0" offset="100%"></stop>
        </linearGradient>
    </defs>
    <g id="Symbols" stroke="none" stroke-width="1" fill="none" fill-rule="evenodd">
        <g id="header_blog" transform="translate(-1267.000000, -40.000000)" fill="#A0E9E8">
            <g id="header" transform="translate(130.000000, 30.000000)">
                <g id="Group-6" transform="translate(640.000000, 0.000000)">
                    <g id="Group-2-Copy" transform="translate(497.000000, 0.000000)">
                        <path d="M10.0078138,10.2872353 L5.64843877,14.5997353 L1.28906377,10.2872353 C0.945312075,9.91223328 0.601565475,9.90442128 0.257813775,10.2637983 C-0.085937925,10.6231743 -0.085937925,10.9747333 0.257813775,11.3184853 L5.13281377,16.1934853 C5.25781477,16.3497361 5.42968777,16.4278603 5.64843877,16.4278603 C5.86718977,16.4278603 6.03906277,16.3497361 6.16406377,16.1934853 L11.0390588,11.3184853 C11.3828188,10.9747333 11.3828188,10.6231743 11.0390588,10.2637983 C10.6953088,9.90442128 10.3515688,9.91223328 10.0078138,10.2872353 Z" id="Fill-1"></path>
                    </g>
                </g>
            </g>
        </g>
    </g>
</svg>