<?xml version="1.0" encoding="UTF-8"?>
<svg width="10px" height="10px" viewBox="0 0 10 10" version="1.1" xmlns="http://www.w3.org/2000/svg" xmlns:xlink="http://www.w3.org/1999/xlink">
    <!-- Generator: Sketch 56.3 (81716) - https://sketch.com -->
    <title>+</title>
    <desc>Created with Sketch.</desc>
    <g id="Page-1" stroke="none" stroke-width="1" fill="none" fill-rule="evenodd">
        <g id="010__home" transform="translate(-698.000000, -932.000000)" fill="#FFFFFF" fill-rule="nonzero">
            <g id="hero">
                <g id="paginator" transform="translate(657.000000, 931.000000)">
                    <path d="M50.0520143,4.96050033 C50.1170146,4.96050033 50.1722641,4.9832501 50.2177643,5.02875033 C50.2632645,5.07425056 50.2860143,5.12950001 50.2860143,5.19450034 L50.2860143,7.08600044 C50.2860143,7.15100077 50.2632645,7.20625022 50.2177643,7.25175045 C50.1722641,7.29725068 50.1170146,7.32000046 50.0520143,7.32000046 L47.3805142,7.32000046 C47.3155138,7.32000046 47.2830141,7.35250013 47.2830141,7.41750046 L47.2830141,10.0500006 C47.2830141,10.1150009 47.2602644,10.1702504 47.2147641,10.2157506 C47.1692639,10.2612508 47.1140145,10.2840006 47.0490141,10.2840006 L45.177014,10.2840006 C45.1120137,10.2840006 45.0567643,10.2612508 45.011264,10.2157506 C44.9657638,10.1702504 44.943014,10.1150009 44.943014,10.0500006 L44.943014,7.41750046 C44.943014,7.35250013 44.9105143,7.32000046 44.845514,7.32000046 L42.1740139,7.32000046 C42.1090135,7.32000046 42.0537641,7.29725068 42.0082639,7.25175045 C41.9627636,7.20625022 41.9400139,7.15100077 41.9400139,7.08600044 L41.9400139,5.19450034 C41.9400139,5.12950001 41.9627636,5.07425056 42.0082639,5.02875033 C42.0537641,4.9832501 42.1090135,4.96050033 42.1740139,4.96050033 L44.845514,4.96050033 C44.9105143,4.96050033 44.943014,4.92800065 44.943014,4.86300032 L44.943014,2.17200017 C44.943014,2.10699985 44.9657638,2.0517504 45.011264,2.00625017 C45.0567643,1.96074994 45.1120137,1.93800016 45.177014,1.93800016 L47.0490141,1.93800016 C47.1140145,1.93800016 47.1692639,1.96074994 47.2147641,2.00625017 C47.2602644,2.0517504 47.2830141,2.10699985 47.2830141,2.17200017 L47.2830141,4.86300032 C47.2830141,4.92800065 47.3155138,4.96050033 47.3805142,4.96050033 L50.0520143,4.96050033 Z" id="+"></path>
                </g>
            </g>
        </g>
    </g>
</svg>