<?xml version="1.0" encoding="UTF-8"?>
<svg width="569px" height="569px" viewBox="0 0 569 569" version="1.1" xmlns="http://www.w3.org/2000/svg" xmlns:xlink="http://www.w3.org/1999/xlink">
    <!-- Generator: Sketch 48.2 (47327) - http://www.bohemiancoding.com/sketch -->
    <title>img-hp__circle</title>
    <desc>Created with Sketch.</desc>
    <defs>
        <linearGradient x1="100%" y1="0%" x2="0%" y2="100%" id="linearGradient-1">
            <stop stop-color="#E00146" offset="0%"></stop>
            <stop stop-color="#2B0E82" offset="100%"></stop>
        </linearGradient>
    </defs>
    <g id="home-01" stroke="none" stroke-width="1" fill="none" fill-rule="evenodd" transform="translate(-436.000000, -174.000000)">
        <circle id="img-hp__circle" stroke="url(#linearGradient-1)" cx="720.5" cy="458.5" r="284"></circle>
    </g>
</svg>