<?xml version="1.0" encoding="UTF-8"?>
<svg width="22px" height="22px" viewBox="0 0 22 22" version="1.1" xmlns="http://www.w3.org/2000/svg" xmlns:xlink="http://www.w3.org/1999/xlink">
    <!-- Generator: Sketch 54.1 (76490) - https://sketchapp.com -->
    <title>icn-calendar</title>
    <desc>Created with Sketch.</desc>
    <g id="Page-1" stroke="none" stroke-width="1" fill="none" fill-rule="evenodd">
        <g id="Artboard" transform="translate(-446.000000, -110.000000)" fill="#FFFFFF" fill-rule="nonzero">
            <path d="M467.237667,111.285275 C467.605889,111.285275 467.904333,111.575049 467.904222,111.932333 L467.904222,126.552843 C467.904222,126.910127 467.605667,127.199902 467.237556,127.199902 L463.145778,127.199902 C462.490111,129.918951 459.973,131.950716 456.974556,131.950716 C453.976111,131.950716 451.459,129.919059 450.803333,127.199902 L446.711556,127.199902 C446.343444,127.199902 446.044889,126.910127 446.044889,126.552843 L446.044889,111.932333 C446.044889,111.575049 446.343444,111.285275 446.711556,111.285275 L451.245333,111.285275 L451.245333,110.647059 C451.245333,110.289775 451.543889,110 451.912,110 C452.280111,110 452.578667,110.289775 452.578667,110.647059 L452.578667,111.285275 L456.307889,111.285275 L456.307889,110.647059 C456.307889,110.289775 456.606444,110 456.974556,110 C457.342667,110 457.641222,110.289775 457.641222,110.647059 L457.641222,111.285275 L461.536,111.285275 L461.536,110.647059 C461.536,110.289775 461.834556,110 462.202667,110 C462.570778,110 462.869333,110.289775 462.869333,110.647059 L462.869333,111.285275 L467.237667,111.285275 Z M451.245333,112.579392 L447.378222,112.579392 L447.378222,115.225431 L466.571,115.225431 L466.571,112.579392 L462.869333,112.579392 L462.869333,113.164118 C462.869333,113.521402 462.570778,113.811176 462.202667,113.811176 C461.834556,113.811176 461.536,113.521402 461.536,113.164118 L461.536,112.579392 L457.641222,112.579392 L457.641222,113.164118 C457.641222,113.521402 457.342667,113.811176 456.974556,113.811176 C456.606444,113.811176 456.307889,113.521402 456.307889,113.164118 L456.307889,112.579392 L452.578667,112.579392 L452.578667,113.164118 C452.578667,113.521402 452.280111,113.811176 451.912,113.811176 C451.543889,113.811176 451.245333,113.521402 451.245333,113.164118 L451.245333,112.579392 Z M456.974556,130.656598 C459.734889,130.656598 461.980444,128.477088 461.980444,125.797941 C461.980444,123.118794 459.734778,120.939284 456.974556,120.939284 C454.214333,120.939284 451.968667,123.118902 451.968667,125.797941 C451.968667,128.47698 454.214333,130.656598 456.974556,130.656598 Z M463.311,125.905784 L466.570889,125.905784 L466.570889,116.519657 L447.378111,116.519657 L447.378111,125.905784 L450.638111,125.905784 C450.637556,125.869765 450.635333,125.834069 450.635333,125.797941 C450.635333,122.405304 453.479111,119.645167 456.974556,119.645167 C460.47,119.645167 463.313778,122.405304 463.313778,125.797941 C463.313778,125.834069 463.311667,125.869765 463.311,125.905784 Z M457.641222,125.961216 L458.978222,127.259108 C459.238556,127.511784 459.238556,127.92148 458.978222,128.174157 C458.848,128.300441 458.677333,128.363637 458.506778,128.363637 C458.336111,128.363637 458.165556,128.300441 458.035333,128.174157 L456.503111,126.686892 C456.378111,126.565461 456.307889,126.400892 456.307889,126.229314 L456.307889,122.830961 C456.307889,122.473676 456.606444,122.183902 456.974556,122.183902 C457.342667,122.183902 457.641222,122.473676 457.641222,122.830961 L457.641222,125.961216 Z" id="icn-calendar"></path>
        </g>
    </g>
</svg>