<?xml version="1.0" encoding="UTF-8"?>
<svg width="30px" height="28px" viewBox="0 0 30 28" version="1.1" xmlns="http://www.w3.org/2000/svg" xmlns:xlink="http://www.w3.org/1999/xlink">
    <!-- Generator: Sketch 54.1 (76490) - https://sketchapp.com -->
    <title>Group 3</title>
    <desc>Created with Sketch.</desc>
    <defs>
        <linearGradient x1="100%" y1="26.7070709%" x2="0%" y2="73.2929291%" id="linearGradient-1">
            <stop stop-color="#E00146" offset="0%"></stop>
            <stop stop-color="#2B0E82" offset="100%"></stop>
        </linearGradient>
    </defs>
    <g id="Page-1" stroke="none" stroke-width="1" fill="none" fill-rule="evenodd">
        <g id="login-copy" transform="translate(-581.000000, -444.000000)">
            <g id="Group-3" transform="translate(581.000000, 444.000000)">
                <g id="Group" transform="translate(0.504202, 0.000000)" fill="url(#linearGradient-1)">
                    <g id="logo/logo_icon" transform="translate(0.150741, 0.000000)">
                        <path d="M12.0145923,0 L2.08715337,2.99562972 L0,12.0112884 L7.24697234,19.7518394 L10.8121301,19.0408205 L12.1681992,16.0225861 L17.186552,15.7734212 L23.5525282,14.8019351 L27.8229052,11.2134471 L28.9387985,7.05213671 L23.5087159,2.41047756 L12.0145923,0 Z M6.07407027,7.39531637 L2.92592088,3.38710114 L11.7274371,1.11687515 L16.7056727,9.53248318 L16.6982827,9.53916182 L6.07407027,7.39531637 Z M12.8628612,1.19856013 L23.0320595,3.33110326 L23.0484231,3.34394681 L16.940042,9.30335424 L12.8628612,1.19856013 Z M20.0169305,6.95503946 L23.2458422,3.49139077 L28.234635,7.21910286 L26.9112932,10.6611744 L23.3350504,13.6665652 L20.0169305,6.95503946 Z M1.1264505,11.6788973 L2.64193289,3.68353028 L10.5297257,14.6118505 L1.1264505,11.6788973 Z M17.2509508,9.92138589 L19.3090719,7.71383643 L23.1027925,13.8607597 L17.1079011,14.7783029 L12.5107795,15.0058907 L17.2419772,9.93114698 L17.2572851,9.93371569 L17.2509508,9.92138589 Z M6.9355357,8.49215559 L16.4153504,9.81555503 L11.6366454,14.4782776 L6.9355357,8.49215559 Z M1.59782834,12.2907641 L11.1399304,15.819658 L10.0857965,18.167459 L7.41166426,19.165146 L1.59782834,12.2907641 Z" id="logo-icon"></path>
                    </g>
                </g>
                <path d="M2.05359815,26.5862862 C2.32880813,26.5862862 2.56510485,26.4886423 2.76213618,26.2935289 C2.95652633,26.0957999 3.05248886,25.8609314 3.05002377,25.5880516 C3.05002377,25.3155204 2.95159615,25.0816981 2.75456482,24.8865847 C2.5575335,24.6939123 2.32141285,24.5976633 2.0460268,24.5976633 L0.40920536,24.5976633 L0.40920536,26.5862862 L2.05359815,26.5862862 Z M0.40920536,22.2076542 L0.40920536,24.1924411 L1.92101139,24.1924411 C2.19886254,24.1898256 2.43375064,24.0923561 2.6256757,23.8996837 C2.82024193,23.7047446 2.91743701,23.4707479 2.91743701,23.1980424 C2.91497192,22.9255113 2.81636821,22.691689 2.62197806,22.4964012 C2.42494674,22.3039032 2.18865001,22.2076542 1.91344004,22.2076542 L0.40920536,22.2076542 Z M3.04632613,24.5976633 C3.3215361,24.8679277 3.45922913,25.1966041 3.45922913,25.5843899 C3.4618703,25.9721758 3.32540982,26.3022471 3.05002377,26.5751269 C2.77727889,26.8502735 2.41473421,26.9890674 1.96256581,26.9915085 L1.96256581,26.9953445 L-7.63833441e-14,26.9953445 L-7.63833441e-14,21.8022576 L2.01574138,21.8022576 C2.33902065,21.804873 2.63694469,21.9424463 2.90986565,22.2151518 C3.1852517,22.4828008 3.32417728,22.8092104 3.32664237,23.1943808 C3.32928354,23.5795512 3.19282306,23.9085763 2.91743701,24.1812818 C2.88715159,24.2137135 2.82270702,24.2712537 2.7242794,24.3537279 C2.86813516,24.4538129 2.97554276,24.5350666 3.04632613,24.5976633 Z M4.88665857,22.2076019 L4.88665857,24.9916739 L6.29228954,24.9916739 C6.68142201,24.9916739 7.01350519,24.8565417 7.28889124,24.5864517 C7.56163612,24.3111307 7.6980966,23.98228 7.6980966,23.5995507 C7.6980966,23.2169958 7.56163612,22.8891913 7.28889124,22.6164858 C7.01350519,22.3439546 6.68142201,22.2076019 6.29228954,22.2076019 L4.88665857,22.2076019 Z M7.01984399,25.257928 C7.39612276,25.5030839 7.66904372,25.7784049 7.83825471,26.0835421 C8.01010688,26.3937359 8.09603296,26.6974782 8.09603296,26.9952922 L7.68665152,26.9952922 C7.68665152,26.5923367 7.52131425,26.2247771 7.19028754,25.8920903 C6.85433064,25.5618447 6.45146409,25.3968962 5.98168788,25.3968962 L4.88665857,25.3968962 L4.88665857,26.9952922 L4.47745321,26.9952922 L4.47745321,21.8023796 L6.29228954,21.8023796 C6.79499234,21.8023796 7.22321413,21.9786618 7.57677883,22.3314004 C7.9329847,22.6815236 8.1109996,23.1043566 8.1109996,23.5995507 C8.1109996,23.9348529 8.0227845,24.2460929 7.84582607,24.5339681 C7.67414998,24.8089403 7.39876393,25.0504347 7.01984399,25.257928 Z M12.0584931,25.3442731 L11.0127657,22.7778075 L9.96703819,25.3442731 L12.0584931,25.3442731 Z M13.1762365,26.995327 L12.7367457,26.995327 L12.225239,25.7458337 L9.80029229,25.7458337 L9.28878559,26.995327 L8.84929481,26.995327 L11.0127657,21.7009346 L13.1762365,26.995327 Z M14.0390893,26.9952922 L14.0390893,21.8023796 L14.5390893,21.8023796 L14.5390893,26.9952922 L14.0390893,26.9952922 Z M19.982938,26.9688934 L16.084042,22.8641874 L16.084042,26.9952224 L15.6748367,26.9952224 L15.6748367,21.8397982 L19.5737327,25.9483402 L19.5737327,21.8023099 L19.982938,21.8023099 L19.982938,26.9688934 Z M25.4798831,21.7685356 L25.4798831,24.3222726 C25.4798831,24.9144132 25.2664765,25.4218128 24.8394873,25.8444715 C24.414787,26.2652121 23.9034564,26.4754953 23.3056715,26.4754953 C22.7055975,26.4754953 22.1932104,26.2652121 21.7685102,25.8444715 C21.34381,25.4218128 21.1314599,24.9144132 21.1314599,24.3222726 L21.1314599,21.7685356 L21.948462,21.7685356 L21.948462,24.3222726 C21.948462,24.692622 22.0812248,25.0090929 22.3467505,25.272034 C22.6098111,25.532534 22.9295688,25.662784 23.3056715,25.662784 C23.6796612,25.662784 23.9980103,25.532534 24.261247,25.272034 C24.5265966,25.0090929 24.6593594,24.692622 24.6593594,24.3222726 L24.6593594,21.7685356 L25.4798831,21.7685356 Z M28.1166693,24.6793355 C28.4098392,24.6793355 28.6589897,24.5775068 28.8644727,24.3741982 C29.0722448,24.1684486 29.1761309,23.9203284 29.1761309,23.6301865 C29.1761309,23.3398702 29.0722448,23.0919244 28.8644727,22.8861748 C28.6589897,22.6826918 28.4098392,22.5810375 28.1166693,22.5810375 L27.0536862,22.5810375 L27.0536862,24.6793355 L28.1166693,24.6793355 Z M28.1166693,21.7651878 C28.6336344,21.7651878 29.0768228,21.9479214 29.4460585,22.3137373 C29.8152941,22.6771122 30,23.1159867 30,23.6301865 C30,24.1421196 29.8152941,24.5809941 29.4460585,24.9466357 C29.0768228,25.3124516 28.6336344,25.4953596 28.1166693,25.4953596 L27.0536862,25.4953596 L27.0536862,26.382873 L26.2298171,26.382873 L26.2298171,21.7651878 L28.1166693,21.7651878 Z M21.1315127,27.2079401 L21.1315127,26.7079401 L27.0560104,26.7079401 L27.0560104,27.2079401 L21.1315127,27.2079401 Z" id="Combined-Shape" fill="#FEFEFE"></path>
            </g>
        </g>
    </g>
</svg>