<?xml version="1.0" encoding="UTF-8"?>
<svg width="22px" height="18px" viewBox="0 0 22 18" version="1.1" xmlns="http://www.w3.org/2000/svg" xmlns:xlink="http://www.w3.org/1999/xlink">
    <!-- Generator: Sketch 54.1 (76490) - https://sketchapp.com -->
    <title>icn-twitter</title>
    <desc>Created with Sketch.</desc>
    <g id="Page-1" stroke="none" stroke-width="1" fill="none" fill-rule="evenodd">
        <g id="Artboard" transform="translate(-485.000000, -112.000000)" fill="#FFFFFF" fill-rule="nonzero">
            <path d="M493.3547,129.987729 C489.690043,129.987729 486.793631,129.353921 485.40791,128.249152 L485.380939,128.227594 L485.356481,128.203383 C485.027306,127.877358 484.919423,127.449679 485.06081,127.030126 L485.073709,126.995301 C485.245249,126.570607 485.665555,126.284714 486.12104,126.282061 C487.05848,126.265975 487.878655,126.155366 488.622944,125.940614 C487.435733,125.394034 486.611035,124.447634 486.12037,123.077867 C485.955364,122.650685 486.097755,122.177071 486.478024,121.89466 C486.571835,121.824845 486.677875,121.772111 486.790113,121.736789 C486.130422,120.982919 485.643107,120.125074 485.370218,119.21781 L485.361675,119.189619 L485.355811,119.160764 C485.263173,118.701909 485.470395,118.230119 485.850161,118.026975 C486.009472,117.936431 486.18252,117.889501 486.356238,117.885521 C486.168951,117.486199 486.032758,117.076264 485.952013,116.663841 C485.727872,115.520932 485.912814,114.375203 486.501477,113.258494 L486.637671,112.988852 C486.746726,112.773106 486.95512,112.621536 487.195343,112.582897 C487.435566,112.544424 487.68182,112.623028 487.853862,112.793337 L488.101958,113.039265 C490.061937,115.073353 491.817541,116.038491 494.852827,116.698832 C494.98835,115.545475 495.492081,114.473375 496.304718,113.629625 C497.271808,112.625682 498.563216,112.062353 499.941064,112.043116 L499.95011,112.043116 C500.955394,112.043116 502.202409,112.611254 502.956582,113.011903 C503.603542,112.802292 504.38301,112.47776 505.191795,112.134655 C505.570221,111.958874 506.036763,112.039302 506.334278,112.333819 C506.625929,112.622531 506.706841,113.029647 506.552053,113.425321 C506.493254,113.587338 506.426581,113.74637 506.35237,113.90192 C506.4631,113.952167 506.564449,114.020324 506.650052,114.105063 C506.908869,114.361273 507.016752,114.762253 506.924784,115.12675 L506.9149,115.161409 C506.604989,116.150096 506.009625,116.955373 505.222283,117.460827 C505.09078,124.392744 499.817602,129.987729 493.3547,129.987729 L493.3547,129.987729 Z M486.642696,127.539228 C487.948511,128.270545 490.437013,128.712983 493.3547,128.712983 C496.159814,128.712983 498.806957,127.520821 500.808312,125.356058 C502.826084,123.173552 503.937241,120.275317 503.937241,117.195165 L503.937241,117.160506 C503.937241,116.881578 504.092364,116.627027 504.341968,116.49602 C504.84838,116.230524 505.258467,115.778302 505.525158,115.200048 C505.250091,115.242998 504.970501,115.133715 504.799129,114.905863 C504.599948,114.64103 504.59777,114.283332 504.793601,114.016178 C504.899306,113.871904 504.995127,113.721827 505.080562,113.566609 C504.382173,113.85698 503.718963,114.117335 503.143199,114.290297 C502.933967,114.352981 502.70078,114.328438 502.50964,114.222804 C501.484588,113.657485 500.529895,113.31952 499.954298,113.317862 C497.830318,113.350033 496.10336,115.150796 496.10336,117.334132 C496.10336,117.559828 496.002178,117.771429 495.826115,117.914873 C495.649884,118.058152 495.420718,118.115529 495.196912,118.07175 C491.697094,117.389188 489.623203,116.365677 487.466557,114.220316 C487.157484,114.953457 487.073054,115.691904 487.215948,116.421064 C487.360852,117.159677 487.746315,117.899783 488.33079,118.561284 C488.552921,118.812353 488.582404,119.171543 488.404164,119.454949 C488.226593,119.73736 487.889041,119.869362 487.564556,119.783295 C487.310931,119.715968 487.077744,119.62758 486.856619,119.513985 C487.307078,120.482606 488.081856,121.378427 489.055814,122.039099 C489.338085,122.230635 489.456019,122.58767 489.342775,122.907392 C489.229365,123.227613 488.912585,123.433741 488.570175,123.408535 C488.19711,123.381173 487.866594,123.311026 487.562378,123.192788 C488.108492,124.293743 488.981101,124.899525 490.325445,125.131025 C490.645574,125.186247 490.894843,125.436487 490.945769,125.753722 C490.996863,126.070957 490.838222,126.385374 490.551261,126.536114 C489.405428,127.137419 488.153052,127.460127 486.642696,127.539228 Z" id="icn-twitter"></path>
        </g>
    </g>
</svg>