<?xml version="1.0" encoding="UTF-8"?>
<svg width="24px" height="18px" viewBox="0 0 24 18" version="1.1" xmlns="http://www.w3.org/2000/svg" xmlns:xlink="http://www.w3.org/1999/xlink">
    <!-- Generator: Sketch 54.1 (76490) - https://sketchapp.com -->
    <title>Fill 1</title>
    <desc>Created with Sketch.</desc>
    <g id="Page-1" stroke="none" stroke-width="1" fill="none" fill-rule="evenodd">
        <g id="020_page-copy" transform="translate(-819.000000, -3149.000000)" fill="#FFFFFF">
            <path d="M828,3149 L828,3152 C826.339992,3152 824.925006,3152.58499 823.755,3153.755 C822.584994,3154.92501 822,3156.33999 822,3158 L828,3158 L828,3167 L819,3167 L819,3158 C819,3155.51999 819.879991,3153.40001 821.64,3151.64 C823.400009,3149.87999 825.519988,3149 828,3149 Z M843,3149 L843,3152 C841.33999,3152 839.92501,3152.58499 838.755,3153.755 C837.58499,3154.92501 837,3156.33999 837,3158 L843,3158 L843,3167 L834,3167 L834,3158 C834,3155.51999 834.87999,3153.40001 836.64,3151.64 C838.40001,3149.87999 840.51999,3149 843,3149 Z" id="Fill-1"></path>
        </g>
    </g>
</svg>