<?xml version="1.0" encoding="UTF-8"?>
<svg width="17px" height="17px" viewBox="0 0 17 17" version="1.1" xmlns="http://www.w3.org/2000/svg" xmlns:xlink="http://www.w3.org/1999/xlink">
    <!-- Generator: Sketch 47.1 (45422) - http://www.bohemiancoding.com/sketch -->
    <title>icn__instagram--white</title>
    <desc>Created with Sketch.</desc>
    <defs></defs>
    <g id="Symbols" stroke="none" stroke-width="1" fill="none" fill-rule="evenodd">
        <g id="elements/footer" transform="translate(-158.000000, -119.000000)" fill-rule="nonzero" fill="#FFFFFF">
            <g id="icn__instagram--white">
                <g transform="translate(158.000000, 119.000000)">
                    <path d="M12.4066465,0 L4.59335352,0 C2.06058594,0 0,2.06058594 0,4.59335352 L0,12.4066465 C0,14.9394141 2.06058594,17 4.59335352,17 L12.4066465,17 C14.9394141,17 17,14.9394141 17,12.4066465 L17,4.59335352 C17,2.06058594 14.9394141,0 12.4066465,0 Z M15.6265859,12.4066465 C15.6265859,14.1821172 14.1821504,15.6265859 12.4066465,15.6265859 L4.59335352,15.6265859 C2.81788281,15.6265859 1.37341406,14.1821504 1.37341406,12.4066465 L1.37341406,4.59335352 C1.37341406,2.81788281 2.81784961,1.37341406 4.59335352,1.37341406 L12.4066465,1.37341406 C14.1821172,1.37341406 15.6265859,2.81784961 15.6265859,4.59335352 L15.6265859,12.4066465 L15.6265859,12.4066465 Z" id="Shape"></path>
                    <path d="M12.3046133,7.90702539 C12.1837539,7.09198828 11.8119121,6.35328516 11.2292969,5.77066992 C10.6466816,5.18808789 9.90797852,4.81621289 9.09297461,4.69538672 C8.72189648,4.64036914 8.34567188,4.64036914 7.97462695,4.69538672 C6.96737695,4.84476758 6.07862891,5.37741211 5.47204102,6.19523828 C4.86545313,7.01306445 4.61360742,8.01818945 4.76298828,9.02537305 C4.91236914,10.0325898 5.44501367,10.9213379 6.26283984,11.527959 C6.92676953,12.0203945 7.71401563,12.2789805 8.52573242,12.2789805 C8.71389453,12.2789805 8.90341797,12.2651016 9.09294141,12.2369785 C10.1001914,12.0875977 10.9889395,11.5549531 11.5955273,10.737127 C12.2021484,9.91933398 12.4539941,8.91424219 12.3046133,7.90702539 Z M8.89149805,10.8784063 C8.24719141,10.9740977 7.60421289,10.8128965 7.08103125,10.4248516 C6.55784961,10.0368066 6.21711914,9.46823633 6.12159375,8.82392969 C6.02603516,8.17962305 6.18710352,7.53664453 6.57514844,7.01346289 C6.96322656,6.49028125 7.53176367,6.14955078 8.17610352,6.05399219 C8.29477148,6.03639453 8.41426953,6.0275957 8.53376758,6.0275957 C8.65326563,6.0275957 8.77279688,6.03639453 8.89146484,6.05402539 C9.96163477,6.21270313 10.7872969,7.03833203 10.9460078,8.10853516 C11.1432344,9.43858594 10.2216152,10.6811797 8.89149805,10.8784063 Z" id="Shape"></path>
                    <path d="M13.282877,3.71712305 C13.1549785,3.58925781 12.9779727,3.51597852 12.7972812,3.51597852 C12.6165898,3.51597852 12.439584,3.58922461 12.3116855,3.71712305 C12.1838203,3.84502148 12.110541,4.02172852 12.110541,4.20271875 C12.110541,4.38370898 12.1838203,4.56041602 12.3116855,4.68831445 C12.439584,4.81617969 12.6165898,4.88945898 12.7972812,4.88945898 C12.9779727,4.88945898 13.1549785,4.81621289 13.282877,4.68831445 C13.4107422,4.56041602 13.4840215,4.38341016 13.4840215,4.20271875 C13.4840215,4.02199414 13.4107422,3.84498828 13.282877,3.71712305 Z" id="Shape"></path>
                </g>
            </g>
        </g>
    </g>
</svg>