<?xml version="1.0" encoding="UTF-8"?>
<svg width="139px" height="30px" viewBox="0 0 139 30" version="1.1" xmlns="http://www.w3.org/2000/svg" xmlns:xlink="http://www.w3.org/1999/xlink">
    <!-- Generator: Sketch 60 (88103) - https://sketch.com -->
    <title>brainup-web-design</title>
    <desc>Created with Sketch.</desc>
    <defs>
        <linearGradient x1="100%" y1="-486.885536%" x2="0%" y2="586.885536%" id="linearGradient-1">
            <stop stop-color="#E00146" offset="0%"></stop>
            <stop stop-color="#2B0E82" offset="100%"></stop>
        </linearGradient>
        <linearGradient x1="100%" y1="26.6305711%" x2="0%" y2="73.3694289%" id="linearGradient-2">
            <stop stop-color="#E00146" offset="0%"></stop>
            <stop stop-color="#2B0E82" offset="100%"></stop>
        </linearGradient>
    </defs>
    <g id="Symbols" stroke="none" stroke-width="1" fill="none" fill-rule="evenodd">
        <g id="footer" transform="translate(-1180.000000, -166.000000)" fill-rule="nonzero">
            <g id="brainup-web-design">
                <g transform="translate(1180.000000, 166.628000)">
                    <path d="M37.332,6.372 C37.392,6.372 37.422,6.342 37.422,6.282 L37.422,6.282 L37.422,3.6 C37.422,3.576 37.434,3.564 37.458,3.564 L37.458,3.564 L39.213,3.564 C39.747,3.564 40.1775,3.405 40.5045,3.087 C40.8315,2.769 40.995,2.349 40.995,1.827 C40.995,1.299 40.8345,0.873 40.5135,0.549 C40.1925,0.225 39.768,0.063 39.24,0.063 L39.24,0.063 L36.873,0.063 C36.813,0.063 36.783,0.093 36.783,0.153 L36.783,0.153 L36.783,6.282 C36.783,6.342 36.813,6.372 36.873,6.372 L36.873,6.372 L37.332,6.372 Z M39.168,3.033 L37.458,3.033 C37.434,3.033 37.422,3.021 37.422,2.997 L37.422,2.997 L37.422,0.657 C37.422,0.633 37.434,0.621 37.458,0.621 L37.458,0.621 L39.168,0.621 C39.522,0.621 39.81,0.732 40.032,0.954 C40.254,1.176 40.365,1.47 40.365,1.836 C40.365,2.196 40.254,2.4855 40.032,2.7045 C39.81,2.9235 39.522,3.033 39.168,3.033 L39.168,3.033 Z M44.118,6.444 C44.544,6.444 44.9205,6.357 45.2475,6.183 C45.5745,6.009 45.8265,5.7645 46.0035,5.4495 C46.1805,5.1345 46.269,4.77 46.269,4.356 L46.269,4.356 L46.269,2.088 C46.269,1.674 46.1805,1.3095 46.0035,0.9945 C45.8265,0.6795 45.5745,0.435 45.2475,0.261 C44.9205,0.087 44.544,2.84217094e-14 44.118,2.84217094e-14 C43.692,2.84217094e-14 43.317,0.087 42.993,0.261 C42.669,0.435 42.4185,0.6795 42.2415,0.9945 C42.0645,1.3095 41.976,1.674 41.976,2.088 L41.976,2.088 L41.976,4.356 C41.976,4.77 42.0645,5.1345 42.2415,5.4495 C42.4185,5.7645 42.669,6.009 42.993,6.183 C43.317,6.357 43.692,6.444 44.118,6.444 Z M44.118,5.895 C43.668,5.895 43.305,5.757 43.029,5.481 C42.753,5.205 42.615,4.839 42.615,4.383 L42.615,4.383 L42.615,2.079 C42.615,1.623 42.753,1.2555 43.029,0.9765 C43.305,0.6975 43.668,0.558 44.118,0.558 C44.574,0.558 44.94,0.6975 45.216,0.9765 C45.492,1.2555 45.63,1.623 45.63,2.079 L45.63,2.079 L45.63,4.383 C45.63,4.839 45.492,5.205 45.216,5.481 C44.94,5.757 44.574,5.895 44.118,5.895 Z M49.392,6.372 C49.452,6.372 49.485,6.345 49.491,6.291 L49.491,6.291 L50.778,1.251 C50.784,1.239 50.7915,1.233 50.8005,1.233 C50.8095,1.233 50.817,1.239 50.823,1.251 L50.823,1.251 L52.137,6.291 C52.149,6.345 52.182,6.372 52.236,6.372 L52.236,6.372 L52.713,6.372 C52.767,6.372 52.8,6.348 52.812,6.3 L52.812,6.3 L54.513,0.171 C54.519,0.141 54.5145,0.117 54.4995,0.099 C54.4845,0.081 54.462,0.072 54.432,0.072 L54.432,0.072 L53.973,0.072 C53.919,0.072 53.886,0.096 53.874,0.144 L53.874,0.144 L52.506,5.076 C52.5,5.088 52.4925,5.094 52.4835,5.094 C52.4745,5.094 52.467,5.088 52.461,5.076 L52.461,5.076 L51.138,0.153 C51.126,0.099 51.093,0.072 51.039,0.072 L51.039,0.072 L50.553,0.072 C50.499,0.072 50.466,0.099 50.454,0.153 L50.454,0.153 L49.185,5.076 C49.179,5.088 49.1715,5.094 49.1625,5.094 C49.1535,5.094 49.146,5.088 49.14,5.076 L49.14,5.076 L47.772,0.144 C47.76,0.096 47.727,0.072 47.673,0.072 L47.673,0.072 L47.196,0.072 C47.136,0.072 47.106,0.096 47.106,0.144 L47.106,0.144 L47.115,0.171 L48.843,6.3 C48.861,6.348 48.894,6.372 48.942,6.372 L48.942,6.372 L49.392,6.372 Z M59.472,6.372 C59.532,6.372 59.562,6.342 59.562,6.282 L59.562,6.282 L59.562,5.904 C59.562,5.844 59.532,5.814 59.472,5.814 L59.472,5.814 L56.16,5.814 C56.136,5.814 56.124,5.802 56.124,5.778 L56.124,5.778 L56.124,3.519 C56.124,3.495 56.136,3.483 56.16,3.483 L56.16,3.483 L58.482,3.483 C58.542,3.483 58.572,3.453 58.572,3.393 L58.572,3.393 L58.572,3.015 C58.572,2.955 58.542,2.925 58.482,2.925 L58.482,2.925 L56.16,2.925 C56.136,2.925 56.124,2.913 56.124,2.889 L56.124,2.889 L56.124,0.666 C56.124,0.642 56.136,0.63 56.16,0.63 L56.16,0.63 L59.472,0.63 C59.532,0.63 59.562,0.6 59.562,0.54 L59.562,0.54 L59.562,0.162 C59.562,0.102 59.532,0.072 59.472,0.072 L59.472,0.072 L55.575,0.072 C55.515,0.072 55.485,0.102 55.485,0.162 L55.485,0.162 L55.485,6.282 C55.485,6.342 55.515,6.372 55.575,6.372 L55.575,6.372 L59.472,6.372 Z M61.479,6.372 C61.539,6.372 61.569,6.342 61.569,6.282 L61.569,6.282 L61.569,3.528 C61.569,3.504 61.581,3.492 61.605,3.492 L61.605,3.492 L63.135,3.492 C63.153,3.492 63.165,3.501 63.171,3.519 L63.171,3.519 L64.494,6.309 C64.512,6.351 64.548,6.372 64.602,6.372 L64.602,6.372 L65.079,6.372 C65.127,6.372 65.151,6.351 65.151,6.309 C65.151,6.291 65.148,6.276 65.142,6.264 L65.142,6.264 L63.792,3.492 C63.78,3.474 63.786,3.459 63.81,3.447 C64.2,3.363 64.509,3.174 64.737,2.88 C64.965,2.586 65.079,2.229 65.079,1.809 C65.079,1.293 64.92,0.8745 64.602,0.5535 C64.284,0.2325 63.867,0.072 63.351,0.072 L63.351,0.072 L61.02,0.072 C60.96,0.072 60.93,0.102 60.93,0.162 L60.93,0.162 L60.93,6.282 C60.93,6.342 60.96,6.372 61.02,6.372 L61.02,6.372 L61.479,6.372 Z M63.279,2.979 L61.605,2.979 C61.581,2.979 61.569,2.967 61.569,2.943 L61.569,2.943 L61.569,0.666 C61.569,0.642 61.581,0.63 61.605,0.63 L61.605,0.63 L63.279,0.63 C63.627,0.63 63.909,0.7395 64.125,0.9585 C64.341,1.1775 64.449,1.461 64.449,1.809 C64.449,2.157 64.341,2.439 64.125,2.655 C63.909,2.871 63.627,2.979 63.279,2.979 L63.279,2.979 Z M70.425,6.372 C70.485,6.372 70.515,6.342 70.515,6.282 L70.515,6.282 L70.515,5.904 C70.515,5.844 70.485,5.814 70.425,5.814 L70.425,5.814 L67.113,5.814 C67.089,5.814 67.077,5.802 67.077,5.778 L67.077,5.778 L67.077,3.519 C67.077,3.495 67.089,3.483 67.113,3.483 L67.113,3.483 L69.435,3.483 C69.495,3.483 69.525,3.453 69.525,3.393 L69.525,3.393 L69.525,3.015 C69.525,2.955 69.495,2.925 69.435,2.925 L69.435,2.925 L67.113,2.925 C67.089,2.925 67.077,2.913 67.077,2.889 L67.077,2.889 L67.077,0.666 C67.077,0.642 67.089,0.63 67.113,0.63 L67.113,0.63 L70.425,0.63 C70.485,0.63 70.515,0.6 70.515,0.54 L70.515,0.54 L70.515,0.162 C70.515,0.102 70.485,0.072 70.425,0.072 L70.425,0.072 L66.528,0.072 C66.468,0.072 66.438,0.102 66.438,0.162 L66.438,0.162 L66.438,6.282 C66.438,6.342 66.468,6.372 66.528,6.372 L66.528,6.372 L70.425,6.372 Z M74.097,6.372 C74.691,6.372 75.1635,6.216 75.5145,5.904 C75.8655,5.592 76.041,5.169 76.041,4.635 L76.041,4.635 L76.041,1.809 C76.041,1.275 75.8655,0.852 75.5145,0.54 C75.1635,0.228 74.691,0.072 74.097,0.072 L74.097,0.072 L71.973,0.072 C71.913,0.072 71.883,0.102 71.883,0.162 L71.883,0.162 L71.883,6.282 C71.883,6.342 71.913,6.372 71.973,6.372 L71.973,6.372 L74.097,6.372 Z M74.124,5.814 L72.558,5.814 C72.534,5.814 72.522,5.802 72.522,5.778 L72.522,5.778 L72.522,0.666 C72.522,0.642 72.534,0.63 72.558,0.63 L72.558,0.63 L74.124,0.63 C74.52,0.63 74.832,0.744 75.06,0.972 C75.288,1.2 75.402,1.509 75.402,1.899 L75.402,1.899 L75.402,4.554 C75.402,4.938 75.2865,5.244 75.0555,5.472 C74.8245,5.7 74.514,5.814 74.124,5.814 L74.124,5.814 Z M81.513,6.372 C82.077,6.372 82.5315,6.222 82.8765,5.922 C83.2215,5.622 83.394,5.202 83.394,4.662 C83.394,4.296 83.31,3.984 83.142,3.726 C82.974,3.468 82.728,3.273 82.404,3.141 C82.374,3.123 82.374,3.105 82.404,3.087 C82.698,2.967 82.9245,2.7915 83.0835,2.5605 C83.2425,2.3295 83.322,2.049 83.322,1.719 C83.322,1.197 83.1555,0.792 82.8225,0.504 C82.4895,0.216 82.032,0.072 81.45,0.072 L81.45,0.072 L79.335,0.072 C79.275,0.072 79.245,0.102 79.245,0.162 L79.245,0.162 L79.245,6.282 C79.245,6.342 79.275,6.372 79.335,6.372 L79.335,6.372 L81.513,6.372 Z M81.45,2.862 L79.92,2.862 C79.896,2.862 79.884,2.85 79.884,2.826 L79.884,2.826 L79.884,0.666 C79.884,0.642 79.896,0.63 79.92,0.63 L79.92,0.63 L81.45,0.63 C81.828,0.63 82.1295,0.7335 82.3545,0.9405 C82.5795,1.1475 82.692,1.425 82.692,1.773 C82.692,2.103 82.5795,2.367 82.3545,2.565 C82.1295,2.763 81.828,2.862 81.45,2.862 L81.45,2.862 Z M81.513,5.805 L79.92,5.805 C79.896,5.805 79.884,5.793 79.884,5.769 L79.884,5.769 L79.884,3.438 C79.884,3.414 79.896,3.402 79.92,3.402 L79.92,3.402 L81.477,3.402 C81.867,3.402 82.1775,3.5115 82.4085,3.7305 C82.6395,3.9495 82.755,4.242 82.755,4.608 C82.755,4.974 82.6425,5.265 82.4175,5.481 C82.1925,5.697 81.891,5.805 81.513,5.805 L81.513,5.805 Z M86.67,6.363 C86.73,6.363 86.76,6.333 86.76,6.273 L86.76,6.273 L86.76,3.609 C86.76,3.585 86.763,3.57 86.769,3.564 L86.769,3.564 L88.641,0.18 C88.659,0.15 88.662,0.1245 88.65,0.1035 C88.638,0.0825 88.614,0.072 88.578,0.072 L88.578,0.072 L88.092,0.072 C88.044,0.072 88.008,0.093 87.984,0.135 L87.984,0.135 L86.463,2.88 C86.457,2.886 86.448,2.889 86.436,2.889 C86.424,2.889 86.415,2.886 86.409,2.88 L86.409,2.88 L84.897,0.135 C84.879,0.093 84.843,0.072 84.789,0.072 L84.789,0.072 L84.303,0.072 C84.249,0.072 84.222,0.09 84.222,0.126 C84.222,0.138 84.228,0.156 84.24,0.18 L84.24,0.18 L86.112,3.564 C86.118,3.57 86.121,3.585 86.121,3.609 L86.121,3.609 L86.121,6.273 C86.121,6.333 86.151,6.363 86.211,6.363 L86.211,6.363 L86.67,6.363 Z" id="POWEREDBY" fill="#333333"></path>
                    <g id="brainup-logo-dark" transform="translate(0.000000, 9.372000)">
                        <g id="Group-16" transform="translate(36.304473, 1.065740)" fill="#000000">
                            <path d="M7.05979596,16.94878 C8.00030245,16.94878 8.80782626,16.61278 9.48116392,15.94138 C10.1454756,15.26098 10.4734193,14.45278 10.4649951,13.51378 C10.4649951,12.57598 10.1286271,11.77138 9.45528947,11.09998 C8.7819518,10.43698 7.97502973,10.10578 7.0339215,10.10578 L1.44022453,10.10578 L1.44022453,16.94878 L7.05979596,16.94878 Z M1.44022453,1.88158 L1.44022453,8.71138 L6.60669206,8.71138 C7.55622453,8.70238 8.35893449,8.36698 9.01482193,7.70398 C9.67973535,7.03318 10.0118912,6.22798 10.0118912,5.28958 C10.003467,4.35178 9.66649726,3.54718 9.00218557,2.87518 C8.32884791,2.21278 7.5213241,1.88158 6.5808176,1.88158 L1.44022453,1.88158 Z M10.4523587,10.10578 C11.3928652,11.03578 11.8634193,12.16678 11.8634193,13.50118 C11.8724453,14.83558 11.4061033,15.97138 10.4649951,16.91038 C9.53291284,17.85718 8.29394747,18.33478 6.74870072,18.34318 L6.74870072,18.35638 L0.0418002886,18.35638 L0.0418002886,0.48658 L6.93042367,0.48658 C8.03520289,0.49558 9.05333276,0.96898 9.98601674,1.90738 C10.927125,2.82838 11.4018912,3.95158 11.4103154,5.27698 C11.4193414,6.60238 10.9529994,7.73458 10.0118912,8.67298 C9.90839336,8.78458 9.6881596,8.98258 9.35179163,9.26638 C9.84340635,9.61078 10.2104626,9.89038 10.4523587,10.10578 Z M16.7415371,1.8814 L16.7415371,11.4616 L21.5451605,11.4616 C22.8749873,11.4616 24.0098531,10.9966 24.9509613,10.0672 C25.8830436,9.1198 26.3493856,7.9882 26.3493856,6.6712 C26.3493856,5.3548 25.8830436,4.2268 24.9509613,3.2884 C24.0098531,2.3506 22.8749873,1.8814 21.5451605,1.8814 L16.7415371,1.8814 Z M24.0315154,12.3778 C25.3174159,13.2214 26.2500999,14.1688 26.8283639,15.2188 C27.415654,16.2862 27.709299,17.3314 27.709299,18.3562 L26.310273,18.3562 C26.310273,16.9696 25.745247,15.7048 24.6139916,14.56 C23.4658877,13.4236 22.0891258,12.856 20.4837059,12.856 L16.7415371,12.856 L16.7415371,18.3562 L15.3431128,18.3562 L15.3431128,0.487 L21.5451605,0.487 C23.2631042,0.487 24.7265154,1.0936 25.9347925,2.3074 C27.1520955,3.5122 27.7604462,4.9672 27.7604462,6.6712 C27.7604462,7.825 27.4589786,8.896 26.8542384,9.8866 C26.2675501,10.8328 25.3264418,11.6638 24.0315154,12.3778 Z M41.250667,12.67492 L37.676983,3.84352 L34.103299,12.67492 L41.250667,12.67492 Z M45.0704592,18.35632 L43.5685371,18.35632 L41.8205068,14.05672 L33.5334592,14.05672 L31.7854289,18.35632 L30.2835068,18.35632 L37.676983,0.13792 L45.0704592,18.35632 Z M48.0191847,18.3562 L48.0191847,0.487 L49.4176089,0.487 L49.4176089,18.3562 L48.0191847,18.3562 Z M68.3317782,18.26536 L55.0076354,4.14076 L55.0076354,18.35596 L53.6092111,18.35596 L53.6092111,0.61576 L66.933354,14.75356 L66.933354,0.48676 L68.3317782,0.48676 L68.3317782,18.26536 Z M87.1171167,0.37054 L87.1171167,9.15814 C87.1171167,11.19574 86.387818,12.94174 84.9286189,14.39614 C83.4772423,15.84394 81.7298137,16.56754 79.6869349,16.56754 C77.6362336,16.56754 75.8851947,15.84394 74.433818,14.39614 C72.9824414,12.94174 72.2567531,11.19574 72.2567531,9.15814 L72.2567531,0.37054 L75.0487877,0.37054 L75.0487877,9.15814 C75.0487877,10.43254 75.5024934,11.52154 76.4099046,12.42634 C77.3088916,13.32274 78.4016362,13.77094 79.6869349,13.77094 C80.9650128,13.77094 82.0529436,13.32274 82.9525323,12.42634 C83.8593418,11.52154 84.3130475,10.43254 84.3130475,9.15814 L84.3130475,0.37054 L87.1171167,0.37054 Z M96.1281076,10.38682 C97.1299908,10.38682 97.981441,10.03642 98.6836618,9.33682 C99.3937051,8.62882 99.7487267,7.77502 99.7487267,6.77662 C99.7487267,5.77762 99.3937051,4.92442 98.6836618,4.21642 C97.981441,3.51622 97.1299908,3.16642 96.1281076,3.16642 L92.495454,3.16642 L92.495454,10.38682 L96.1281076,10.38682 Z M96.1281076,0.35902 C97.8947916,0.35902 99.4093501,0.98782 100.671181,2.24662 C101.933012,3.49702 102.564229,5.00722 102.564229,6.77662 C102.564229,8.53822 101.933012,10.04842 100.671181,11.30662 C99.4093501,12.56542 97.8947916,13.19482 96.1281076,13.19482 L92.495454,13.19482 L92.495454,16.24882 L89.6799518,16.24882 L89.6799518,0.35902 L96.1281076,0.35902 Z M72.2569336,18.3724 L72.2569336,17.3674 L92.5033968,17.3674 L92.5033968,18.3724 L72.2569336,18.3724 Z" id="Combined-Shape"></path>
                        </g>
                        <g id="logo/logo_icon" fill="url(#linearGradient-2)">
                            <path d="M12.0400025,0 L2.09156759,3.00689061 L0,12.0564402 L7.26229932,19.8260887 L10.8349972,19.112397 L12.1939343,16.0828167 L17.2229007,15.8327152 L23.6023405,14.8575771 L27.8817492,11.2555996 L29,7.07864645 L23.5584356,2.4195388 L12.0400025,0 Z M6.08691662,7.42311617 L2.93210905,3.39983361 L11.7522401,1.12107361 L16.7410044,9.56831681 L16.7335987,9.57502056 L6.08691662,7.42311617 Z M12.8900655,1.20306565 L23.0807711,3.34362523 L23.0971693,3.35651706 L16.9758693,9.33832655 L12.8900655,1.20306565 Z M20.0592652,6.98118421 L23.295006,3.50451528 L28.2943498,7.24624025 L26.9682092,10.7012509 L23.3844028,13.7179393 L20.0592652,6.98118421 Z M1.12883289,11.7227996 L2.64752044,3.69737707 L10.5519955,14.666778 L1.12883289,11.7227996 Z M17.2874357,9.95868145 L19.3499096,7.74283357 L23.1516537,13.9128638 L17.1440834,14.8338562 L12.5372391,15.0622994 L17.2784431,9.96847924 L17.2937834,9.9710576 L17.2874357,9.95868145 Z M6.950204,8.52407852 L16.450068,9.85245276 L11.6612564,14.532703 L6.950204,8.52407852 Z M1.60120767,12.3369664 L11.1634908,15.8791258 L10.1071275,18.2357525 L7.42733955,19.2371899 L1.60120767,12.3369664 Z" id="logo-icon"></path>
                        </g>
                    </g>
                </g>
            </g>
        </g>
    </g>
</svg>