<?xml version="1.0" encoding="UTF-8"?>
<svg width="15px" height="21px" viewBox="0 0 15 21" version="1.1" xmlns="http://www.w3.org/2000/svg" xmlns:xlink="http://www.w3.org/1999/xlink">
    <!-- Generator: Sketch 60 (88103) - https://sketch.com -->
    <title>icn-scroll</title>
    <desc>Created with Sketch.</desc>
    <g id="Page-1" stroke="none" stroke-width="1" fill="none" fill-rule="evenodd">
        <g id="020__Refine_DS_about" transform="translate(-120.000000, -699.000000)" fill="#FFFFFF" fill-rule="nonzero">
            <g id="header">
                <g id="partner_group_picture">
                    <g id="scroll-down" transform="translate(120.000000, 699.000000)">
                        <path d="M7.5,0 C6.46320316,0 5.48913498,0.192849187 4.57775914,0.578547561 C3.66638329,0.964245936 2.87207685,1.489447 2.19481602,2.15416305 C1.51755518,2.8188791 0.982443567,3.59847213 0.589464887,4.49296672 C0.196486333,5.38746131 0,6.33528395 0,7.33645924 L0,13.6389212 C0,14.6565136 0.196486333,15.6125393 0.589464887,16.5070339 C0.982443567,17.4015285 1.51755518,18.1811221 2.19481602,18.8458382 C2.87207685,19.5105542 3.66638329,20.0357541 4.57775914,20.4214537 C5.48913498,20.8071531 6.46320316,21 7.5,21 C8.53679684,21 9.51086439,20.8071531 10.4222402,20.4214537 C11.3336161,20.0357541 12.1279219,19.5105542 12.8051827,18.8458382 C13.4824436,18.1811221 14.0175564,17.4015285 14.4105339,16.5070339 C14.8035113,15.6125393 15,14.6565136 15,13.6389212 L15,7.33645924 C15,6.33528395 14.8035113,5.38746131 14.4105339,4.49296672 C14.0175564,3.59847213 13.4824436,2.8188791 12.8051827,2.15416305 C12.1279219,1.489447 11.3336161,0.964245936 10.4222402,0.578547561 C9.51086439,0.192849187 8.53679684,0 7.5,0 Z M12.842809,13.6389212 C12.842809,14.361085 12.7048522,15.0422009 12.4289323,15.6822974 C12.1530061,16.3223945 11.772577,16.8804194 11.2876263,17.3563893 C10.8026756,17.8323586 10.234115,18.209846 9.58193837,18.488863 C8.92976174,18.7678795 8.23578646,18.9073859 7.5,18.9073859 C6.76420728,18.9073859 6.07023701,18.7678795 5.41806037,18.488863 C4.76588311,18.209846 4.19732694,17.8323586 3.71237433,17.3563893 C3.22742234,16.8804194 2.8469914,16.3223945 2.57107023,15.6822974 C2.29514905,15.0422009 2.15719034,14.361085 2.15719034,13.6389212 L2.15719034,7.33645924 C2.15719034,6.61430163 2.29514905,5.93728194 2.57107023,5.30539403 C2.8469914,4.67349997 3.22742234,4.11957813 3.71237433,3.64361005 C4.19732694,3.16764197 4.76588311,2.79015217 5.41806037,2.5111345 C6.07023701,2.23212297 6.76420728,2.09261413 7.5,2.09261413 C8.23578646,2.09261413 8.92976174,2.23212297 9.58193837,2.5111345 C10.234115,2.79015217 10.8026756,3.16764197 11.2876263,3.64361005 C11.772577,4.11957813 12.1530061,4.67349997 12.4289323,5.30539403 C12.7048522,5.93728194 12.842809,6.61430163 12.842809,7.33645924 L12.842809,13.6389212 Z M6.42140451,9.45369294 L8.57859549,9.45369294 L8.57859549,6.30246196 L6.42140451,6.30246196 L6.42140451,9.45369294 Z" id="icn-scroll"></path>
                    </g>
                </g>
            </g>
        </g>
    </g>
</svg>