{
  "books": [
    {
      "id": 1,
      "name": "teste1",
      "author": "teste2",
      "price": "20.50"
    },
    {
      "name": "teste2",
      "author": "teste2",
      "price": "500.50",
      "id": 2
    }
  ]
}