14,28,42,56,70,84,0,0,0,0,0,0,0,0,0,0,0,0,0,0,0,0,0,0,0
12,23,34,45,56,67,0,0,0,0,0,0,0,0,0,0,0,0,0,0,0,0,0,0,0
3,6,9,12,14,17,0,0,0,0,0,0,0,0,0,0,0,0,0,0,0,0,0,0,0
17,34,50,67,84,100,0,0,0,0,0,0,0,0,0,0,0,0,0,0,0,0,0,0,0
