1,2,3,4,5,6,0,0,0,0,0,0,0,0,0,0,0,0,0,0,0,0,0,0,0
2,4,6,8,10,12,0,0,0,0,0,0,0,0,0,0,0,0,0,0,0,0,0,0,0
5,10,15,20,25,30,0,0,0,0,0,0,0,0,0,0,0,0,0,0,0,0,0,0,0
10,20,30,40,50,60,0,0,0,0,0,0,0,0,0,0,0,0,0,0,0,0,0,0,0
