O[v¼,ASYID,ASY¼,lbg[Ngp¦,¢gplbg[N,pXÑægp¦,¸sñ,ÀsÔ
random,0,Random Algorithm,0.261735714,0.738264286,1,0,3807439.96
path_priority,1,Z£¬eÊ,0.221342857,0.778657143,1,0,2485405.28
path_priority,2,Z£eÊ,0.222142857,0.777857143,1,0,2456679.86
path_priority,3,Z£åeÊ,0.220728571,0.779271429,1,0,2483514.18
path_priority,4,£¬eÊ,0.222285714,0.777714286,1,0,2440883.12
path_priority,5,£eÊ,0.222135714,0.777864286,1,0,2460181.49
path_priority,6,£åeÊ,0.221207143,0.778792857,1,0,2506318.26
path_priority,7,·£¬eÊ,0.223714286,0.776285714,1,0,2503026.52
path_priority,8,·£eÊ,0.224571429,0.775428571,1,0,2530958.1
path_priority,9,·£åeÊ,0.22315,0.77685,1,0,2479884.25
additional_hop_count,1,Z£¬eÊ,0.21215,0.78785,1,0,2598886.12
additional_hop_count,2,Z£eÊ,0.249742857,0.750257143,1,0,3741234.93
additional_hop_count,3,Z£åeÊ,0.255928571,0.744071429,1,0,3892586.19
additional_hop_count,4,£¬eÊ,0.20525,0.79475,1,0,2521756.65
additional_hop_count,5,£eÊ,0.227835714,0.772164286,1,0,3152406.58
additional_hop_count,6,£åeÊ,0.229864286,0.770135714,1,0,3237163.14
additional_hop_count,7,·£¬eÊ,0.204914286,0.795085714,1,0,2557156.87
additional_hop_count,8,·£eÊ,0.234814286,0.765185714,1,0,3538986.87
additional_hop_count,9,·£åeÊ,0.247785714,0.752214286,1,0,3595254.8
link_usage,1,Z£¬eÊ,0.23125,0.76875,1,0,2478613.49
link_usage,2,Z£eÊ,0.217928571,0.782071429,1,0,2508711.89
link_usage,3,Z£åeÊ,0.203028571,0.796971429,1,0,2522931.72
link_usage,4,£¬eÊ,0.230185714,0.769814286,1,0,2501620.43
link_usage,5,£eÊ,0.217292857,0.782707143,1,0,2496406.6
link_usage,6,£åeÊ,0.211728571,0.788271429,1,0,2562890.29
link_usage,7,·£¬eÊ,0.238914286,0.761085714,1,0,2481606.45
link_usage,8,·£eÊ,0.221892857,0.778107143,1,0,2491973
link_usage,9,·£åeÊ,0.2091,0.7909,1,0,2572624.66
placed_position,1,Z£¬eÊ,0.194371429,0.805628571,1,0,2583571.89
placed_position,2,Z£eÊ,0.202478571,0.797521429,1,0,2498699.65
placed_position,3,Z£åeÊ,0.206557143,0.793442857,1,0,2528736.05
placed_position,4,£¬eÊ,0.18265,0.81735,1,0,2501842
placed_position,5,£eÊ,0.200457143,0.799542857,1,0,2540248.85
placed_position,6,£åeÊ,0.201021429,0.798978571,1,0,2552167.79
placed_position,7,·£¬eÊ,0.186,0.814,1,0,2558254.31
placed_position,8,·£eÊ,0.206021429,0.793978571,1,0,2541637.12
placed_position,9,·£åeÊ,0.207428571,0.792571429,1,0,2587470.97
,,,,,,,
,,100,,,,,
