100,75,50,25,50,75,0,0,0,0,0,0,0,0,0,0,0,0,0,0,0,0,0,0,0
90,68,45,23,45,68,0,0,0,0,0,0,0,0,0,0,0,0,0,0,0,0,0,0,0
60,45,30,15,30,45,0,0,0,0,0,0,0,0,0,0,0,0,0,0,0,0,0,0,0
10,8,5,3,5,8,0,0,0,0,0,0,0,0,0,0,0,0,0,0,0,0,0,0,0
