12,24,35,47,59,70,0,0,0,0,0,0,0,0,0,0,0,0,0,0,0,0,0,0,0
11,21,32,42,53,64,0,0,0,0,0,0,0,0,0,0,0,0,0,0,0,0,0,0,0
7,14,21,28,35,42,0,0,0,0,0,0,0,0,0,0,0,0,0,0,0,0,0,0,0
2,3,4,5,6,7,0,0,0,0,0,0,0,0,0,0,0,0,0,0,0,0,0,0,0
