40,30,20,10,20,30,0,0,0,0,0,0,0,0,0,0,0,0,0,0,0,0,0,0,0
36,27,18,9,18,27,0,0,0,0,0,0,0,0,0,0,0,0,0,0,0,0,0,0,0
24,18,12,6,12,18,0,0,0,0,0,0,0,0,0,0,0,0,0,0,0,0,0,0,0
4,3,2,1,2,3,0,0,0,0,0,0,0,0,0,0,0,0,0,0,0,0,0,0,0
