5,10,15,20,25,30,0,0,0,0,0,0,0,0,0,0,0,0,0,0,0,0,0,0,0
4,8,12,16,20,24,0,0,0,0,0,0,0,0,0,0,0,0,0,0,0,0,0,0,0
1,2,3,4,5,6,0,0,0,0,0,0,0,0,0,0,0,0,0,0,0,0,0,0,0
6,12,18,24,30,36,0,0,0,0,0,0,0,0,0,0,0,0,0,0,0,0,0,0,0
