70,59,47,35,24,12,0,0,0,0,0,0,0,0,0,0,0,0,0,0,0,0,0,0,0
64,53,42,32,21,11,0,0,0,0,0,0,0,0,0,0,0,0,0,0,0,0,0,0,0
42,35,28,21,14,7,0,0,0,0,0,0,0,0,0,0,0,0,0,0,0,0,0,0,0
7,6,5,4,3,2,0,0,0,0,0,0,0,0,0,0,0,0,0,0,0,0,0,0,0
