17,34,50,67,84,100,0,0,0,0,0,0,0,0,0,0,0,0,0,0,0,0,0,0,0
15,30,45,60,75,90,0,0,0,0,0,0,0,0,0,0,0,0,0,0,0,0,0,0,0
10,20,30,40,50,60,0,0,0,0,0,0,0,0,0,0,0,0,0,0,0,0,0,0,0
2,4,5,7,9,10,0,0,0,0,0,0,0,0,0,0,0,0,0,0,0,0,0,0,0
