10,20,30,40,50,60,0,0,0,0,0,0,0,0,0,0,0,0,0,0,0,0,0,0,0
9,18,27,36,45,54,0,0,0,0,0,0,0,0,0,0,0,0,0,0,0,0,0,0,0
6,12,18,24,30,36,0,0,0,0,0,0,0,0,0,0,0,0,0,0,0,0,0,0,0
1,2,3,4,5,6,0,0,0,0,0,0,0,0,0,0,0,0,0,0,0,0,0,0,0
