%YAML 1.1
%TAG !u! tag:unity3d.com,2011:
--- !u!29 &1
OcclusionCullingSettings:
  m_ObjectHideFlags: 0
  serializedVersion: 2
  m_OcclusionBakeSettings:
    smallestOccluder: 5
    smallestHole: 0.25
    backfaceThreshold: 100
  m_SceneGUID: 00000000000000000000000000000000
  m_OcclusionCullingData: {fileID: 0}
--- !u!196 &4
NavMeshSettings:
  serializedVersion: 2
  m_ObjectHideFlags: 0
  m_BuildSettings:
    serializedVersion: 2
    agentTypeID: 0
    agentRadius: 0.5
    agentHeight: 2
    agentSlope: 45
    agentClimb: 0.4
    ledgeDropHeight: 0
    maxJumpAcrossDistance: 0
    minRegionArea: 2
    manualCellSize: 0
    cellSize: 0.16666667
    manualTileSize: 0
    tileSize: 256
    accuratePlacement: 0
    debug:
      m_Flags: 0
  m_NavMeshData: {fileID: 0}
--- !u!1 &55
GameObject:
  m_ObjectHideFlags: 0
  m_CorrespondingSourceObject: {fileID: 0}
  m_PrefabInternal: {fileID: 0}
  serializedVersion: 6
  m_Component:
  - component: {fileID: 371}
  - component: {fileID: 316}
  - component: {fileID: 537}
  - component: {fileID: 536}
  m_Layer: 5
  m_Name: Canvas
  m_TagString: Untagged
  m_Icon: {fileID: 0}
  m_NavMeshLayer: 0
  m_StaticEditorFlags: 0
  m_IsActive: 1
--- !u!1 &63
GameObject:
  m_ObjectHideFlags: 0
  m_CorrespondingSourceObject: {fileID: 0}
  m_PrefabInternal: {fileID: 0}
  serializedVersion: 6
  m_Component:
  - component: {fileID: 379}
  - component: {fileID: 226}
  - component: {fileID: 544}
  m_Layer: 5
  m_Name: Text
  m_TagString: Untagged
  m_Icon: {fileID: 0}
  m_NavMeshLayer: 0
  m_StaticEditorFlags: 0
  m_IsActive: 1
--- !u!1 &80
GameObject:
  m_ObjectHideFlags: 0
  m_CorrespondingSourceObject: {fileID: 0}
  m_PrefabInternal: {fileID: 0}
  serializedVersion: 6
  m_Component:
  - component: {fileID: 396}
  - component: {fileID: 242}
  - component: {fileID: 562}
  m_Layer: 5
  m_Name: Text (1)
  m_TagString: Untagged
  m_Icon: {fileID: 0}
  m_NavMeshLayer: 0
  m_StaticEditorFlags: 0
  m_IsActive: 1
--- !u!1 &82
GameObject:
  m_ObjectHideFlags: 0
  m_CorrespondingSourceObject: {fileID: 0}
  m_PrefabInternal: {fileID: 0}
  serializedVersion: 6
  m_Component:
  - component: {fileID: 175}
  - component: {fileID: 489}
  - component: {fileID: 566}
  - component: {fileID: 565}
  m_Layer: 0
  m_Name: EventSystem
  m_TagString: Untagged
  m_Icon: {fileID: 0}
  m_NavMeshLayer: 0
  m_StaticEditorFlags: 0
  m_IsActive: 1
--- !u!1 &141
GameObject:
  m_ObjectHideFlags: 0
  m_CorrespondingSourceObject: {fileID: 0}
  m_PrefabInternal: {fileID: 0}
  serializedVersion: 6
  m_Component:
  - component: {fileID: 176}
  - component: {fileID: 177}
  - component: {fileID: 179}
  - component: {fileID: 181}
  - component: {fileID: 178}
  m_Layer: 0
  m_Name: Main Camera
  m_TagString: MainCamera
  m_Icon: {fileID: 0}
  m_NavMeshLayer: 0
  m_StaticEditorFlags: 0
  m_IsActive: 1
--- !u!1 &168
GameObject:
  m_ObjectHideFlags: 0
  m_CorrespondingSourceObject: {fileID: 0}
  m_PrefabInternal: {fileID: 0}
  serializedVersion: 6
  m_Component:
  - component: {fileID: 482}
  - component: {fileID: 310}
  - component: {fileID: 664}
  m_Layer: 5
  m_Name: Header
  m_TagString: Untagged
  m_Icon: {fileID: 0}
  m_NavMeshLayer: 0
  m_StaticEditorFlags: 0
  m_IsActive: 1
--- !u!4 &175
Transform:
  m_ObjectHideFlags: 0
  m_CorrespondingSourceObject: {fileID: 0}
  m_PrefabInternal: {fileID: 0}
  m_GameObject: {fileID: 82}
  m_LocalRotation: {x: 0, y: 0, z: 0, w: 1}
  m_LocalPosition: {x: 0, y: 0, z: 0}
  m_LocalScale: {x: 1, y: 1, z: 1}
  m_Children: []
  m_Father: {fileID: 0}
  m_RootOrder: 2
  m_LocalEulerAnglesHint: {x: 0, y: 0, z: 0}
--- !u!4 &176
Transform:
  m_ObjectHideFlags: 0
  m_CorrespondingSourceObject: {fileID: 0}
  m_PrefabInternal: {fileID: 0}
  m_GameObject: {fileID: 141}
  m_LocalRotation: {x: 0, y: 0, z: 0, w: 1}
  m_LocalPosition: {x: 0, y: 0, z: -10}
  m_LocalScale: {x: 1, y: 1, z: 1}
  m_Children: []
  m_Father: {fileID: 0}
  m_RootOrder: 0
  m_LocalEulerAnglesHint: {x: 0, y: 0, z: 0}
--- !u!20 &177
Camera:
  m_ObjectHideFlags: 0
  m_CorrespondingSourceObject: {fileID: 0}
  m_PrefabInternal: {fileID: 0}
  m_GameObject: {fileID: 141}
  m_Enabled: 1
  serializedVersion: 2
  m_ClearFlags: 2
  m_BackGroundColor: {r: 0.6447059, g: 0.6801994, b: 0.78431374, a: 1}
  m_projectionMatrixMode: 1
  m_SensorSize: {x: 36, y: 24}
  m_LensShift: {x: 0, y: 0}
  m_FocalLength: 50
  m_NormalizedViewPortRect:
    serializedVersion: 2
    x: 0
    y: 0
    width: 1
    height: 1
  near clip plane: 0.3
  far clip plane: 1000
  field of view: 60
  orthographic: 1
  orthographic size: 5
  m_Depth: -1
  m_CullingMask:
    serializedVersion: 2
    m_Bits: 4294967295
  m_RenderingPath: -1
  m_TargetTexture: {fileID: 0}
  m_TargetDisplay: 0
  m_TargetEye: 3
  m_HDR: 0
  m_AllowMSAA: 1
  m_AllowDynamicResolution: 0
  m_ForceIntoRT: 0
  m_OcclusionCulling: 1
  m_StereoConvergence: 10
  m_StereoSeparation: 0.022
--- !u!81 &178
AudioListener:
  m_ObjectHideFlags: 0
  m_CorrespondingSourceObject: {fileID: 0}
  m_PrefabInternal: {fileID: 0}
  m_GameObject: {fileID: 141}
  m_Enabled: 1
--- !u!92 &179
Behaviour:
  m_ObjectHideFlags: 0
  m_CorrespondingSourceObject: {fileID: 0}
  m_PrefabInternal: {fileID: 0}
  m_GameObject: {fileID: 141}
  m_Enabled: 1
--- !u!104 &180
RenderSettings:
  m_ObjectHideFlags: 0
  serializedVersion: 9
  m_Fog: 0
  m_FogColor: {r: 0.5, g: 0.5, b: 0.5, a: 1}
  m_FogMode: 3
  m_FogDensity: 0.01
  m_LinearFogStart: 0
  m_LinearFogEnd: 300
  m_AmbientSkyColor: {r: 0.212, g: 0.227, b: 0.259, a: 1}
  m_AmbientEquatorColor: {r: 0.114, g: 0.125, b: 0.133, a: 1}
  m_AmbientGroundColor: {r: 0.047, g: 0.043, b: 0.035, a: 1}
  m_AmbientIntensity: 1
  m_AmbientMode: 3
  m_SubtractiveShadowColor: {r: 0.42, g: 0.478, b: 0.627, a: 1}
  m_SkyboxMaterial: {fileID: 0}
  m_HaloStrength: 0.5
  m_FlareStrength: 1
  m_FlareFadeSpeed: 3
  m_HaloTexture: {fileID: 0}
  m_SpotCookie: {fileID: 10001, guid: 0000000000000000e000000000000000, type: 0}
  m_DefaultReflectionMode: 0
  m_DefaultReflectionResolution: 128
  m_ReflectionBounces: 1
  m_ReflectionIntensity: 1
  m_CustomReflection: {fileID: 0}
  m_Sun: {fileID: 0}
  m_IndirectSpecularColor: {r: 0, g: 0, b: 0, a: 1}
  m_UseRadianceAmbientProbe: 0
--- !u!124 &181
Behaviour:
  m_ObjectHideFlags: 0
  m_CorrespondingSourceObject: {fileID: 0}
  m_PrefabInternal: {fileID: 0}
  m_GameObject: {fileID: 141}
  m_Enabled: 1
--- !u!157 &182
LightmapSettings:
  m_ObjectHideFlags: 0
  serializedVersion: 11
  m_GIWorkflowMode: 1
  m_GISettings:
    serializedVersion: 2
    m_BounceScale: 1
    m_IndirectOutputScale: 1
    m_AlbedoBoost: 1
    m_TemporalCoherenceThreshold: 1
    m_EnvironmentLightingMode: 0
    m_EnableBakedLightmaps: 0
    m_EnableRealtimeLightmaps: 0
  m_LightmapEditorSettings:
    serializedVersion: 10
    m_Resolution: 2
    m_BakeResolution: 40
    m_AtlasSize: 1024
    m_AO: 0
    m_AOMaxDistance: 1
    m_CompAOExponent: 0
    m_CompAOExponentDirect: 0
    m_Padding: 2
    m_LightmapParameters: {fileID: 0}
    m_LightmapsBakeMode: 1
    m_TextureCompression: 1
    m_FinalGather: 0
    m_FinalGatherFiltering: 1
    m_FinalGatherRayCount: 1024
    m_ReflectionCompression: 2
    m_MixedBakeMode: 1
    m_BakeBackend: 0
    m_PVRSampling: 1
    m_PVRDirectSampleCount: 32
    m_PVRSampleCount: 500
    m_PVRBounces: 2
    m_PVRFilterTypeDirect: 0
    m_PVRFilterTypeIndirect: 0
    m_PVRFilterTypeAO: 0
    m_PVRFilteringMode: 1
    m_PVRCulling: 1
    m_PVRFilteringGaussRadiusDirect: 1
    m_PVRFilteringGaussRadiusIndirect: 5
    m_PVRFilteringGaussRadiusAO: 2
    m_PVRFilteringAtrousPositionSigmaDirect: 0.5
    m_PVRFilteringAtrousPositionSigmaIndirect: 2
    m_PVRFilteringAtrousPositionSigmaAO: 1
    m_ShowResolutionOverlay: 1
  m_LightingDataAsset: {fileID: 0}
  m_UseShadowmask: 0
--- !u!222 &226
CanvasRenderer:
  m_ObjectHideFlags: 0
  m_CorrespondingSourceObject: {fileID: 0}
  m_PrefabInternal: {fileID: 0}
  m_GameObject: {fileID: 63}
  m_CullTransparentMesh: 0
--- !u!222 &242
CanvasRenderer:
  m_ObjectHideFlags: 0
  m_CorrespondingSourceObject: {fileID: 0}
  m_PrefabInternal: {fileID: 0}
  m_GameObject: {fileID: 80}
  m_CullTransparentMesh: 0
--- !u!222 &310
CanvasRenderer:
  m_ObjectHideFlags: 0
  m_CorrespondingSourceObject: {fileID: 0}
  m_PrefabInternal: {fileID: 0}
  m_GameObject: {fileID: 168}
  m_CullTransparentMesh: 0
--- !u!223 &316
Canvas:
  m_ObjectHideFlags: 0
  m_CorrespondingSourceObject: {fileID: 22338216, guid: 539582a3237330b46a77a01f909a16db,
    type: 2}
  m_PrefabInternal: {fileID: 0}
  m_GameObject: {fileID: 55}
  m_Enabled: 1
  serializedVersion: 3
  m_RenderMode: 0
  m_Camera: {fileID: 0}
  m_PlaneDistance: 100
  m_PixelPerfect: 0
  m_ReceivesEvents: 1
  m_OverrideSorting: 0
  m_OverridePixelPerfect: 0
  m_SortingBucketNormalizedSize: 0
  m_AdditionalShaderChannelsFlag: 25
  m_SortingLayerID: 0
  m_SortingOrder: 0
  m_TargetDisplay: 0
--- !u!224 &371
RectTransform:
  m_ObjectHideFlags: 0
  m_CorrespondingSourceObject: {fileID: 22415832, guid: 539582a3237330b46a77a01f909a16db,
    type: 2}
  m_PrefabInternal: {fileID: 0}
  m_GameObject: {fileID: 55}
  m_LocalRotation: {x: 0, y: 0, z: 0, w: 1}
  m_LocalPosition: {x: 0, y: 0, z: 0}
  m_LocalScale: {x: 0, y: 0, z: 0}
  m_Children:
  - {fileID: 482}
  - {fileID: 858465947}
  - {fileID: 922617329}
  m_Father: {fileID: 0}
  m_RootOrder: 1
  m_LocalEulerAnglesHint: {x: 0, y: 0, z: 0}
  m_AnchorMin: {x: 0, y: 0}
  m_AnchorMax: {x: 0, y: 0}
  m_AnchoredPosition: {x: 0, y: 0}
  m_SizeDelta: {x: 0, y: 0}
  m_Pivot: {x: 0, y: 0}
--- !u!224 &379
RectTransform:
  m_ObjectHideFlags: 0
  m_CorrespondingSourceObject: {fileID: 0}
  m_PrefabInternal: {fileID: 0}
  m_GameObject: {fileID: 63}
  m_LocalRotation: {x: 0, y: 0, z: 0, w: 1}
  m_LocalPosition: {x: 0, y: 0, z: 0}
  m_LocalScale: {x: 1, y: 1, z: 1}
  m_Children: []
  m_Father: {fileID: 482}
  m_RootOrder: 0
  m_LocalEulerAnglesHint: {x: 0, y: 0, z: 0}
  m_AnchorMin: {x: 0.38318756, y: 0.5}
  m_AnchorMax: {x: 0.614125, y: 0.9294141}
  m_AnchoredPosition: {x: -15.5, y: 10.9}
  m_SizeDelta: {x: -45.9, y: -16.8}
  m_Pivot: {x: 0.5, y: 0.5}
--- !u!224 &396
RectTransform:
  m_ObjectHideFlags: 0
  m_CorrespondingSourceObject: {fileID: 0}
  m_PrefabInternal: {fileID: 0}
  m_GameObject: {fileID: 80}
  m_LocalRotation: {x: 0, y: 0, z: 0, w: 1}
  m_LocalPosition: {x: 0, y: 0, z: 0}
  m_LocalScale: {x: 1, y: 1, z: 1}
  m_Children: []
  m_Father: {fileID: 482}
  m_RootOrder: 1
  m_LocalEulerAnglesHint: {x: 0, y: 0, z: 0}
  m_AnchorMin: {x: 0.0076562506, y: 0}
  m_AnchorMax: {x: 0.99112505, y: 0.5}
  m_AnchoredPosition: {x: 0, y: 1.9999847}
  m_SizeDelta: {x: -1, y: -4}
  m_Pivot: {x: 0.5, y: 0.5}
--- !u!224 &482
RectTransform:
  m_ObjectHideFlags: 0
  m_CorrespondingSourceObject: {fileID: 0}
  m_PrefabInternal: {fileID: 0}
  m_GameObject: {fileID: 168}
  m_LocalRotation: {x: 0, y: 0, z: 0, w: 1}
  m_LocalPosition: {x: 0, y: 0, z: 0}
  m_LocalScale: {x: 1, y: 1, z: 1}
  m_Children:
  - {fileID: 379}
  - {fileID: 396}
  m_Father: {fileID: 371}
  m_RootOrder: 0
  m_LocalEulerAnglesHint: {x: 0, y: 0, z: 0}
  m_AnchorMin: {x: 0, y: 0.8154284}
  m_AnchorMax: {x: 1, y: 1}
  m_AnchoredPosition: {x: 0.000030517578, y: 5.800049}
  m_SizeDelta: {x: 0, y: -11.6}
  m_Pivot: {x: 0.5, y: 0.5}
--- !u!114 &489
MonoBehaviour:
  m_ObjectHideFlags: 0
  m_CorrespondingSourceObject: {fileID: 0}
  m_PrefabInternal: {fileID: 0}
  m_GameObject: {fileID: 82}
  m_Enabled: 1
  m_EditorHideFlags: 0
  m_Script: {fileID: -619905303, guid: f5f67c52d1564df4a8936ccd202a3bd8, type: 3}
  m_Name: 
  m_EditorClassIdentifier: 
  m_FirstSelected: {fileID: 0}
  m_sendNavigationEvents: 1
  m_DragThreshold: 5
--- !u!114 &536
MonoBehaviour:
  m_ObjectHideFlags: 0
  m_CorrespondingSourceObject: {fileID: 11403574, guid: 539582a3237330b46a77a01f909a16db,
    type: 2}
  m_PrefabInternal: {fileID: 0}
  m_GameObject: {fileID: 55}
  m_Enabled: 1
  m_EditorHideFlags: 0
  m_Script: {fileID: 1301386320, guid: f5f67c52d1564df4a8936ccd202a3bd8, type: 3}
  m_Name: 
  m_EditorClassIdentifier: 
  m_IgnoreReversedGraphics: 1
  m_BlockingObjects: 0
  m_BlockingMask:
    serializedVersion: 2
    m_Bits: 4294967295
--- !u!114 &537
MonoBehaviour:
  m_ObjectHideFlags: 0
  m_CorrespondingSourceObject: {fileID: 11448984, guid: 539582a3237330b46a77a01f909a16db,
    type: 2}
  m_PrefabInternal: {fileID: 0}
  m_GameObject: {fileID: 55}
  m_Enabled: 1
  m_EditorHideFlags: 0
  m_Script: {fileID: 1980459831, guid: f5f67c52d1564df4a8936ccd202a3bd8, type: 3}
  m_Name: 
  m_EditorClassIdentifier: 
  m_UiScaleMode: 1
  m_ReferencePixelsPerUnit: 100
  m_ScaleFactor: 1
  m_ReferenceResolution: {x: 960, y: 640}
  m_ScreenMatchMode: 0
  m_MatchWidthOrHeight: 0
  m_PhysicalUnit: 3
  m_FallbackScreenDPI: 96
  m_DefaultSpriteDPI: 96
  m_DynamicPixelsPerUnit: 1
--- !u!114 &544
MonoBehaviour:
  m_ObjectHideFlags: 0
  m_CorrespondingSourceObject: {fileID: 0}
  m_PrefabInternal: {fileID: 0}
  m_GameObject: {fileID: 63}
  m_Enabled: 1
  m_EditorHideFlags: 0
  m_Script: {fileID: 708705254, guid: f5f67c52d1564df4a8936ccd202a3bd8, type: 3}
  m_Name: 
  m_EditorClassIdentifier: 
  m_Material: {fileID: 0}
  m_Color: {r: 0.19607843, g: 0.19607843, b: 0.19607843, a: 1}
  m_RaycastTarget: 1
  m_OnCullStateChanged:
    m_PersistentCalls:
      m_Calls: []
    m_TypeName: UnityEngine.UI.MaskableGraphic+CullStateChangedEvent, UnityEngine.UI,
      Version=1.0.0.0, Culture=neutral, PublicKeyToken=null
  m_FontData:
    m_Font: {fileID: 10102, guid: 0000000000000000e000000000000000, type: 0}
    m_FontSize: 14
    m_FontStyle: 0
    m_BestFit: 1
    m_MinSize: 10
    m_MaxSize: 40
    m_Alignment: 0
    m_AlignByGeometry: 0
    m_RichText: 1
    m_HorizontalOverflow: 0
    m_VerticalOverflow: 0
    m_LineSpacing: 1
  m_Text: Call App example
--- !u!114 &562
MonoBehaviour:
  m_ObjectHideFlags: 0
  m_CorrespondingSourceObject: {fileID: 0}
  m_PrefabInternal: {fileID: 0}
  m_GameObject: {fileID: 80}
  m_Enabled: 1
  m_EditorHideFlags: 0
  m_Script: {fileID: 708705254, guid: f5f67c52d1564df4a8936ccd202a3bd8, type: 3}
  m_Name: 
  m_EditorClassIdentifier: 
  m_Material: {fileID: 0}
  m_Color: {r: 0.19607843, g: 0.19607843, b: 0.19607843, a: 1}
  m_RaycastTarget: 1
  m_OnCullStateChanged:
    m_PersistentCalls:
      m_Calls: []
    m_TypeName: UnityEngine.UI.MaskableGraphic+CullStateChangedEvent, UnityEngine.UI,
      Version=1.0.0.0, Culture=neutral, PublicKeyToken=null
  m_FontData:
    m_Font: {fileID: 10102, guid: 0000000000000000e000000000000000, type: 0}
    m_FontSize: 14
    m_FontStyle: 0
    m_BestFit: 1
    m_MinSize: 10
    m_MaxSize: 40
    m_Alignment: 0
    m_AlignByGeometry: 0
    m_RichText: 1
    m_HorizontalOverflow: 0
    m_VerticalOverflow: 0
    m_LineSpacing: 1
  m_Text: Simply enter the same text in two instances of this app to connect them.
    Connections between two different platforms are supported as well!
--- !u!114 &565
MonoBehaviour:
  m_ObjectHideFlags: 0
  m_CorrespondingSourceObject: {fileID: 0}
  m_PrefabInternal: {fileID: 0}
  m_GameObject: {fileID: 82}
  m_Enabled: 1
  m_EditorHideFlags: 0
  m_Script: {fileID: 1997211142, guid: f5f67c52d1564df4a8936ccd202a3bd8, type: 3}
  m_Name: 
  m_EditorClassIdentifier: 
  m_ForceModuleActive: 0
--- !u!114 &566
MonoBehaviour:
  m_ObjectHideFlags: 0
  m_CorrespondingSourceObject: {fileID: 0}
  m_PrefabInternal: {fileID: 0}
  m_GameObject: {fileID: 82}
  m_Enabled: 1
  m_EditorHideFlags: 0
  m_Script: {fileID: 1077351063, guid: f5f67c52d1564df4a8936ccd202a3bd8, type: 3}
  m_Name: 
  m_EditorClassIdentifier: 
  m_HorizontalAxis: Horizontal
  m_VerticalAxis: Vertical
  m_SubmitButton: Submit
  m_CancelButton: Cancel
  m_InputActionsPerSecond: 10
  m_RepeatDelay: 0.5
  m_ForceModuleActive: 0
--- !u!114 &664
MonoBehaviour:
  m_ObjectHideFlags: 0
  m_CorrespondingSourceObject: {fileID: 0}
  m_PrefabInternal: {fileID: 0}
  m_GameObject: {fileID: 168}
  m_Enabled: 1
  m_EditorHideFlags: 0
  m_Script: {fileID: -765806418, guid: f5f67c52d1564df4a8936ccd202a3bd8, type: 3}
  m_Name: 
  m_EditorClassIdentifier: 
  m_Material: {fileID: 0}
  m_Color: {r: 1, g: 1, b: 1, a: 0.934}
  m_RaycastTarget: 1
  m_OnCullStateChanged:
    m_PersistentCalls:
      m_Calls: []
    m_TypeName: UnityEngine.UI.MaskableGraphic+CullStateChangedEvent, UnityEngine.UI,
      Version=1.0.0.0, Culture=neutral, PublicKeyToken=null
  m_Sprite: {fileID: 10907, guid: 0000000000000000f000000000000000, type: 0}
  m_Type: 1
  m_PreserveAspect: 0
  m_FillCenter: 1
  m_FillMethod: 4
  m_FillAmount: 1
  m_FillClockwise: 1
  m_FillOrigin: 0
--- !u!1001 &858465946
Prefab:
  m_ObjectHideFlags: 0
  serializedVersion: 2
  m_Modification:
    m_TransformParent: {fileID: 371}
    m_Modifications:
    - target: {fileID: 224245837003075970, guid: f40071bb3b9da854d85ad3c363192151,
        type: 2}
      propertyPath: m_LocalPosition.x
      value: 0
      objectReference: {fileID: 0}
    - target: {fileID: 224245837003075970, guid: f40071bb3b9da854d85ad3c363192151,
        type: 2}
      propertyPath: m_LocalPosition.y
      value: 0
      objectReference: {fileID: 0}
    - target: {fileID: 224245837003075970, guid: f40071bb3b9da854d85ad3c363192151,
        type: 2}
      propertyPath: m_LocalPosition.z
      value: 0
      objectReference: {fileID: 0}
    - target: {fileID: 224245837003075970, guid: f40071bb3b9da854d85ad3c363192151,
        type: 2}
      propertyPath: m_LocalRotation.x
      value: -0
      objectReference: {fileID: 0}
    - target: {fileID: 224245837003075970, guid: f40071bb3b9da854d85ad3c363192151,
        type: 2}
      propertyPath: m_LocalRotation.y
      value: -0
      objectReference: {fileID: 0}
    - target: {fileID: 224245837003075970, guid: f40071bb3b9da854d85ad3c363192151,
        type: 2}
      propertyPath: m_LocalRotation.z
      value: -0
      objectReference: {fileID: 0}
    - target: {fileID: 224245837003075970, guid: f40071bb3b9da854d85ad3c363192151,
        type: 2}
      propertyPath: m_LocalRotation.w
      value: 1
      objectReference: {fileID: 0}
    - target: {fileID: 224245837003075970, guid: f40071bb3b9da854d85ad3c363192151,
        type: 2}
      propertyPath: m_RootOrder
      value: 1
      objectReference: {fileID: 0}
    - target: {fileID: 224245837003075970, guid: f40071bb3b9da854d85ad3c363192151,
        type: 2}
      propertyPath: m_AnchoredPosition.x
      value: 0
      objectReference: {fileID: 0}
    - target: {fileID: 224245837003075970, guid: f40071bb3b9da854d85ad3c363192151,
        type: 2}
      propertyPath: m_AnchoredPosition.y
      value: 0
      objectReference: {fileID: 0}
    - target: {fileID: 224245837003075970, guid: f40071bb3b9da854d85ad3c363192151,
        type: 2}
      propertyPath: m_SizeDelta.x
      value: 0
      objectReference: {fileID: 0}
    - target: {fileID: 224245837003075970, guid: f40071bb3b9da854d85ad3c363192151,
        type: 2}
      propertyPath: m_SizeDelta.y
      value: 0
      objectReference: {fileID: 0}
    - target: {fileID: 224245837003075970, guid: f40071bb3b9da854d85ad3c363192151,
        type: 2}
      propertyPath: m_AnchorMin.x
      value: 0
      objectReference: {fileID: 0}
    - target: {fileID: 224245837003075970, guid: f40071bb3b9da854d85ad3c363192151,
        type: 2}
      propertyPath: m_AnchorMin.y
      value: 0
      objectReference: {fileID: 0}
    - target: {fileID: 224245837003075970, guid: f40071bb3b9da854d85ad3c363192151,
        type: 2}
      propertyPath: m_AnchorMax.x
      value: 1
      objectReference: {fileID: 0}
    - target: {fileID: 224245837003075970, guid: f40071bb3b9da854d85ad3c363192151,
        type: 2}
      propertyPath: m_AnchorMax.y
      value: 1
      objectReference: {fileID: 0}
    - target: {fileID: 224245837003075970, guid: f40071bb3b9da854d85ad3c363192151,
        type: 2}
      propertyPath: m_Pivot.x
      value: 0.5
      objectReference: {fileID: 0}
    - target: {fileID: 224245837003075970, guid: f40071bb3b9da854d85ad3c363192151,
        type: 2}
      propertyPath: m_Pivot.y
      value: 0
      objectReference: {fileID: 0}
    - target: {fileID: 224381116697831258, guid: f40071bb3b9da854d85ad3c363192151,
        type: 2}
      propertyPath: m_AnchorMax.x
      value: 1
      objectReference: {fileID: 0}
    - target: {fileID: 224381116697831258, guid: f40071bb3b9da854d85ad3c363192151,
        type: 2}
      propertyPath: m_AnchorMax.y
      value: 1
      objectReference: {fileID: 0}
    - target: {fileID: 224661790658075176, guid: f40071bb3b9da854d85ad3c363192151,
        type: 2}
      propertyPath: m_AnchorMax.x
      value: 1
      objectReference: {fileID: 0}
    - target: {fileID: 224661790658075176, guid: f40071bb3b9da854d85ad3c363192151,
        type: 2}
      propertyPath: m_AnchorMax.y
      value: 1
      objectReference: {fileID: 0}
    - target: {fileID: 224457950382648268, guid: f40071bb3b9da854d85ad3c363192151,
        type: 2}
      propertyPath: m_AnchorMin.y
      value: 1
      objectReference: {fileID: 0}
    - target: {fileID: 224457950382648268, guid: f40071bb3b9da854d85ad3c363192151,
        type: 2}
      propertyPath: m_AnchorMax.x
      value: 1
      objectReference: {fileID: 0}
    - target: {fileID: 224457950382648268, guid: f40071bb3b9da854d85ad3c363192151,
        type: 2}
      propertyPath: m_AnchorMax.y
      value: 1
      objectReference: {fileID: 0}
    - target: {fileID: 224167448078349154, guid: f40071bb3b9da854d85ad3c363192151,
        type: 2}
      propertyPath: m_AnchorMax.x
      value: 1
      objectReference: {fileID: 0}
    - target: {fileID: 224167448078349154, guid: f40071bb3b9da854d85ad3c363192151,
        type: 2}
      propertyPath: m_AnchorMax.y
      value: 1
      objectReference: {fileID: 0}
    - target: {fileID: 224635042965996640, guid: f40071bb3b9da854d85ad3c363192151,
        type: 2}
      propertyPath: m_AnchorMin.y
      value: 1
      objectReference: {fileID: 0}
    - target: {fileID: 224635042965996640, guid: f40071bb3b9da854d85ad3c363192151,
        type: 2}
      propertyPath: m_AnchorMax.y
      value: 1
      objectReference: {fileID: 0}
    - target: {fileID: 224635042965996640, guid: f40071bb3b9da854d85ad3c363192151,
        type: 2}
      propertyPath: m_AnchoredPosition.x
      value: 6.9277105
      objectReference: {fileID: 0}
    - target: {fileID: 224635042965996640, guid: f40071bb3b9da854d85ad3c363192151,
        type: 2}
      propertyPath: m_AnchoredPosition.y
      value: -5
      objectReference: {fileID: 0}
    - target: {fileID: 224635042965996640, guid: f40071bb3b9da854d85ad3c363192151,
        type: 2}
      propertyPath: m_SizeDelta.x
      value: 3.8554215
      objectReference: {fileID: 0}
    - target: {fileID: 224381745088955326, guid: f40071bb3b9da854d85ad3c363192151,
        type: 2}
      propertyPath: m_AnchorMin.y
      value: 1
      objectReference: {fileID: 0}
    - target: {fileID: 224381745088955326, guid: f40071bb3b9da854d85ad3c363192151,
        type: 2}
      propertyPath: m_AnchorMax.y
      value: 1
      objectReference: {fileID: 0}
    - target: {fileID: 224381745088955326, guid: f40071bb3b9da854d85ad3c363192151,
        type: 2}
      propertyPath: m_AnchoredPosition.x
      value: 6.9277105
      objectReference: {fileID: 0}
    - target: {fileID: 224381745088955326, guid: f40071bb3b9da854d85ad3c363192151,
        type: 2}
      propertyPath: m_AnchoredPosition.y
      value: -5
      objectReference: {fileID: 0}
    - target: {fileID: 224381745088955326, guid: f40071bb3b9da854d85ad3c363192151,
        type: 2}
      propertyPath: m_SizeDelta.x
      value: 3.8554215
      objectReference: {fileID: 0}
    - target: {fileID: 224947520190371002, guid: f40071bb3b9da854d85ad3c363192151,
        type: 2}
      propertyPath: m_AnchorMin.y
      value: 1
      objectReference: {fileID: 0}
    - target: {fileID: 224947520190371002, guid: f40071bb3b9da854d85ad3c363192151,
        type: 2}
      propertyPath: m_AnchorMax.y
      value: 1
      objectReference: {fileID: 0}
    - target: {fileID: 224947520190371002, guid: f40071bb3b9da854d85ad3c363192151,
        type: 2}
      propertyPath: m_AnchoredPosition.x
      value: 6.9277105
      objectReference: {fileID: 0}
    - target: {fileID: 224947520190371002, guid: f40071bb3b9da854d85ad3c363192151,
        type: 2}
      propertyPath: m_AnchoredPosition.y
      value: -5
      objectReference: {fileID: 0}
    - target: {fileID: 224947520190371002, guid: f40071bb3b9da854d85ad3c363192151,
        type: 2}
      propertyPath: m_SizeDelta.x
      value: 3.8554215
      objectReference: {fileID: 0}
    - target: {fileID: 224547042570866814, guid: f40071bb3b9da854d85ad3c363192151,
        type: 2}
      propertyPath: m_AnchorMin.y
      value: 1
      objectReference: {fileID: 0}
    - target: {fileID: 224547042570866814, guid: f40071bb3b9da854d85ad3c363192151,
        type: 2}
      propertyPath: m_AnchorMax.y
      value: 1
      objectReference: {fileID: 0}
    - target: {fileID: 224547042570866814, guid: f40071bb3b9da854d85ad3c363192151,
        type: 2}
      propertyPath: m_AnchoredPosition.x
      value: 6.9277105
      objectReference: {fileID: 0}
    - target: {fileID: 224547042570866814, guid: f40071bb3b9da854d85ad3c363192151,
        type: 2}
      propertyPath: m_AnchoredPosition.y
      value: -5
      objectReference: {fileID: 0}
    - target: {fileID: 224547042570866814, guid: f40071bb3b9da854d85ad3c363192151,
        type: 2}
      propertyPath: m_SizeDelta.x
      value: 3.8554215
      objectReference: {fileID: 0}
    - target: {fileID: 224148476883448436, guid: f40071bb3b9da854d85ad3c363192151,
        type: 2}
      propertyPath: m_AnchorMin.y
      value: 1
      objectReference: {fileID: 0}
    - target: {fileID: 224148476883448436, guid: f40071bb3b9da854d85ad3c363192151,
        type: 2}
      propertyPath: m_AnchorMax.y
      value: 1
      objectReference: {fileID: 0}
    - target: {fileID: 224148476883448436, guid: f40071bb3b9da854d85ad3c363192151,
        type: 2}
      propertyPath: m_AnchoredPosition.x
      value: 6.9277105
      objectReference: {fileID: 0}
    - target: {fileID: 224148476883448436, guid: f40071bb3b9da854d85ad3c363192151,
        type: 2}
      propertyPath: m_AnchoredPosition.y
      value: -5
      objectReference: {fileID: 0}
    - target: {fileID: 224148476883448436, guid: f40071bb3b9da854d85ad3c363192151,
        type: 2}
      propertyPath: m_SizeDelta.x
      value: 3.8554215
      objectReference: {fileID: 0}
    - target: {fileID: 224241524877394856, guid: f40071bb3b9da854d85ad3c363192151,
        type: 2}
      propertyPath: m_AnchorMin.y
      value: 1
      objectReference: {fileID: 0}
    - target: {fileID: 224241524877394856, guid: f40071bb3b9da854d85ad3c363192151,
        type: 2}
      propertyPath: m_AnchorMax.y
      value: 1
      objectReference: {fileID: 0}
    - target: {fileID: 224241524877394856, guid: f40071bb3b9da854d85ad3c363192151,
        type: 2}
      propertyPath: m_AnchoredPosition.x
      value: 6.9277105
      objectReference: {fileID: 0}
    - target: {fileID: 224241524877394856, guid: f40071bb3b9da854d85ad3c363192151,
        type: 2}
      propertyPath: m_AnchoredPosition.y
      value: -5
      objectReference: {fileID: 0}
    - target: {fileID: 224241524877394856, guid: f40071bb3b9da854d85ad3c363192151,
        type: 2}
      propertyPath: m_SizeDelta.x
      value: 3.8554215
      objectReference: {fileID: 0}
    - target: {fileID: 224195190146944386, guid: f40071bb3b9da854d85ad3c363192151,
        type: 2}
      propertyPath: m_AnchorMin.y
      value: 1
      objectReference: {fileID: 0}
    - target: {fileID: 224195190146944386, guid: f40071bb3b9da854d85ad3c363192151,
        type: 2}
      propertyPath: m_AnchorMax.y
      value: 1
      objectReference: {fileID: 0}
    - target: {fileID: 224195190146944386, guid: f40071bb3b9da854d85ad3c363192151,
        type: 2}
      propertyPath: m_AnchoredPosition.x
      value: 6.9277105
      objectReference: {fileID: 0}
    - target: {fileID: 224195190146944386, guid: f40071bb3b9da854d85ad3c363192151,
        type: 2}
      propertyPath: m_AnchoredPosition.y
      value: -5
      objectReference: {fileID: 0}
    - target: {fileID: 224195190146944386, guid: f40071bb3b9da854d85ad3c363192151,
        type: 2}
      propertyPath: m_SizeDelta.x
      value: 3.8554215
      objectReference: {fileID: 0}
    - target: {fileID: 224692314708432762, guid: f40071bb3b9da854d85ad3c363192151,
        type: 2}
      propertyPath: m_AnchorMin.y
      value: 1
      objectReference: {fileID: 0}
    - target: {fileID: 224692314708432762, guid: f40071bb3b9da854d85ad3c363192151,
        type: 2}
      propertyPath: m_AnchorMax.y
      value: 1
      objectReference: {fileID: 0}
    - target: {fileID: 224692314708432762, guid: f40071bb3b9da854d85ad3c363192151,
        type: 2}
      propertyPath: m_AnchoredPosition.x
      value: 6.9277105
      objectReference: {fileID: 0}
    - target: {fileID: 224692314708432762, guid: f40071bb3b9da854d85ad3c363192151,
        type: 2}
      propertyPath: m_AnchoredPosition.y
      value: -5
      objectReference: {fileID: 0}
    - target: {fileID: 224692314708432762, guid: f40071bb3b9da854d85ad3c363192151,
        type: 2}
      propertyPath: m_SizeDelta.x
      value: 3.8554215
      objectReference: {fileID: 0}
    - target: {fileID: 224804388978026974, guid: f40071bb3b9da854d85ad3c363192151,
        type: 2}
      propertyPath: m_AnchorMin.y
      value: 1
      objectReference: {fileID: 0}
    - target: {fileID: 224804388978026974, guid: f40071bb3b9da854d85ad3c363192151,
        type: 2}
      propertyPath: m_AnchorMax.y
      value: 1
      objectReference: {fileID: 0}
    - target: {fileID: 224804388978026974, guid: f40071bb3b9da854d85ad3c363192151,
        type: 2}
      propertyPath: m_AnchoredPosition.x
      value: 6.9277105
      objectReference: {fileID: 0}
    - target: {fileID: 224804388978026974, guid: f40071bb3b9da854d85ad3c363192151,
        type: 2}
      propertyPath: m_AnchoredPosition.y
      value: -5
      objectReference: {fileID: 0}
    - target: {fileID: 224804388978026974, guid: f40071bb3b9da854d85ad3c363192151,
        type: 2}
      propertyPath: m_SizeDelta.x
      value: 3.8554215
      objectReference: {fileID: 0}
    - target: {fileID: 224679311464355560, guid: f40071bb3b9da854d85ad3c363192151,
        type: 2}
      propertyPath: m_AnchorMin.y
      value: 1
      objectReference: {fileID: 0}
    - target: {fileID: 224679311464355560, guid: f40071bb3b9da854d85ad3c363192151,
        type: 2}
      propertyPath: m_AnchorMax.y
      value: 1
      objectReference: {fileID: 0}
    - target: {fileID: 224679311464355560, guid: f40071bb3b9da854d85ad3c363192151,
        type: 2}
      propertyPath: m_AnchoredPosition.x
      value: 6.9277105
      objectReference: {fileID: 0}
    - target: {fileID: 224679311464355560, guid: f40071bb3b9da854d85ad3c363192151,
        type: 2}
      propertyPath: m_AnchoredPosition.y
      value: -5
      objectReference: {fileID: 0}
    - target: {fileID: 224679311464355560, guid: f40071bb3b9da854d85ad3c363192151,
        type: 2}
      propertyPath: m_SizeDelta.x
      value: 3.8554215
      objectReference: {fileID: 0}
    - target: {fileID: 224861355938014928, guid: f40071bb3b9da854d85ad3c363192151,
        type: 2}
      propertyPath: m_AnchorMin.y
      value: 1
      objectReference: {fileID: 0}
    - target: {fileID: 224861355938014928, guid: f40071bb3b9da854d85ad3c363192151,
        type: 2}
      propertyPath: m_AnchorMax.y
      value: 1
      objectReference: {fileID: 0}
    - target: {fileID: 224861355938014928, guid: f40071bb3b9da854d85ad3c363192151,
        type: 2}
      propertyPath: m_AnchoredPosition.x
      value: 6.9277105
      objectReference: {fileID: 0}
    - target: {fileID: 224861355938014928, guid: f40071bb3b9da854d85ad3c363192151,
        type: 2}
      propertyPath: m_AnchoredPosition.y
      value: -5
      objectReference: {fileID: 0}
    - target: {fileID: 224861355938014928, guid: f40071bb3b9da854d85ad3c363192151,
        type: 2}
      propertyPath: m_SizeDelta.x
      value: 3.8554215
      objectReference: {fileID: 0}
    - target: {fileID: 224424781061750724, guid: f40071bb3b9da854d85ad3c363192151,
        type: 2}
      propertyPath: m_AnchorMin.y
      value: 1
      objectReference: {fileID: 0}
    - target: {fileID: 224424781061750724, guid: f40071bb3b9da854d85ad3c363192151,
        type: 2}
      propertyPath: m_AnchorMax.y
      value: 1
      objectReference: {fileID: 0}
    - target: {fileID: 224424781061750724, guid: f40071bb3b9da854d85ad3c363192151,
        type: 2}
      propertyPath: m_AnchoredPosition.x
      value: 6.9277105
      objectReference: {fileID: 0}
    - target: {fileID: 224424781061750724, guid: f40071bb3b9da854d85ad3c363192151,
        type: 2}
      propertyPath: m_AnchoredPosition.y
      value: -5
      objectReference: {fileID: 0}
    - target: {fileID: 224424781061750724, guid: f40071bb3b9da854d85ad3c363192151,
        type: 2}
      propertyPath: m_SizeDelta.x
      value: 3.8554215
      objectReference: {fileID: 0}
    - target: {fileID: 224829387371093548, guid: f40071bb3b9da854d85ad3c363192151,
        type: 2}
      propertyPath: m_AnchorMin.y
      value: 1
      objectReference: {fileID: 0}
    - target: {fileID: 224829387371093548, guid: f40071bb3b9da854d85ad3c363192151,
        type: 2}
      propertyPath: m_AnchorMax.y
      value: 1
      objectReference: {fileID: 0}
    - target: {fileID: 224829387371093548, guid: f40071bb3b9da854d85ad3c363192151,
        type: 2}
      propertyPath: m_AnchoredPosition.x
      value: 6.9277105
      objectReference: {fileID: 0}
    - target: {fileID: 224829387371093548, guid: f40071bb3b9da854d85ad3c363192151,
        type: 2}
      propertyPath: m_AnchoredPosition.y
      value: -5
      objectReference: {fileID: 0}
    - target: {fileID: 224829387371093548, guid: f40071bb3b9da854d85ad3c363192151,
        type: 2}
      propertyPath: m_SizeDelta.x
      value: 3.8554215
      objectReference: {fileID: 0}
    - target: {fileID: 224994818970349382, guid: f40071bb3b9da854d85ad3c363192151,
        type: 2}
      propertyPath: m_AnchorMin.y
      value: 1
      objectReference: {fileID: 0}
    - target: {fileID: 224994818970349382, guid: f40071bb3b9da854d85ad3c363192151,
        type: 2}
      propertyPath: m_AnchorMax.y
      value: 1
      objectReference: {fileID: 0}
    - target: {fileID: 224994818970349382, guid: f40071bb3b9da854d85ad3c363192151,
        type: 2}
      propertyPath: m_AnchoredPosition.x
      value: 6.9277105
      objectReference: {fileID: 0}
    - target: {fileID: 224994818970349382, guid: f40071bb3b9da854d85ad3c363192151,
        type: 2}
      propertyPath: m_AnchoredPosition.y
      value: -5
      objectReference: {fileID: 0}
    - target: {fileID: 224994818970349382, guid: f40071bb3b9da854d85ad3c363192151,
        type: 2}
      propertyPath: m_SizeDelta.x
      value: 3.8554215
      objectReference: {fileID: 0}
    - target: {fileID: 224394487332348834, guid: f40071bb3b9da854d85ad3c363192151,
        type: 2}
      propertyPath: m_AnchorMin.y
      value: 1
      objectReference: {fileID: 0}
    - target: {fileID: 224394487332348834, guid: f40071bb3b9da854d85ad3c363192151,
        type: 2}
      propertyPath: m_AnchorMax.y
      value: 1
      objectReference: {fileID: 0}
    - target: {fileID: 224394487332348834, guid: f40071bb3b9da854d85ad3c363192151,
        type: 2}
      propertyPath: m_AnchoredPosition.x
      value: 6.9277105
      objectReference: {fileID: 0}
    - target: {fileID: 224394487332348834, guid: f40071bb3b9da854d85ad3c363192151,
        type: 2}
      propertyPath: m_AnchoredPosition.y
      value: -5
      objectReference: {fileID: 0}
    - target: {fileID: 224394487332348834, guid: f40071bb3b9da854d85ad3c363192151,
        type: 2}
      propertyPath: m_SizeDelta.x
      value: 3.8554215
      objectReference: {fileID: 0}
    - target: {fileID: 224781456090150090, guid: f40071bb3b9da854d85ad3c363192151,
        type: 2}
      propertyPath: m_AnchorMin.y
      value: 1
      objectReference: {fileID: 0}
    - target: {fileID: 224781456090150090, guid: f40071bb3b9da854d85ad3c363192151,
        type: 2}
      propertyPath: m_AnchorMax.y
      value: 1
      objectReference: {fileID: 0}
    - target: {fileID: 224781456090150090, guid: f40071bb3b9da854d85ad3c363192151,
        type: 2}
      propertyPath: m_AnchoredPosition.x
      value: 6.9277105
      objectReference: {fileID: 0}
    - target: {fileID: 224781456090150090, guid: f40071bb3b9da854d85ad3c363192151,
        type: 2}
      propertyPath: m_AnchoredPosition.y
      value: -5
      objectReference: {fileID: 0}
    - target: {fileID: 224781456090150090, guid: f40071bb3b9da854d85ad3c363192151,
        type: 2}
      propertyPath: m_SizeDelta.x
      value: 3.8554215
      objectReference: {fileID: 0}
    - target: {fileID: 224799050041281046, guid: f40071bb3b9da854d85ad3c363192151,
        type: 2}
      propertyPath: m_AnchorMin.y
      value: 1
      objectReference: {fileID: 0}
    - target: {fileID: 224799050041281046, guid: f40071bb3b9da854d85ad3c363192151,
        type: 2}
      propertyPath: m_AnchorMax.y
      value: 1
      objectReference: {fileID: 0}
    - target: {fileID: 224799050041281046, guid: f40071bb3b9da854d85ad3c363192151,
        type: 2}
      propertyPath: m_AnchoredPosition.x
      value: 6.9277105
      objectReference: {fileID: 0}
    - target: {fileID: 224799050041281046, guid: f40071bb3b9da854d85ad3c363192151,
        type: 2}
      propertyPath: m_AnchoredPosition.y
      value: -5
      objectReference: {fileID: 0}
    - target: {fileID: 224799050041281046, guid: f40071bb3b9da854d85ad3c363192151,
        type: 2}
      propertyPath: m_SizeDelta.x
      value: 3.8554215
      objectReference: {fileID: 0}
    - target: {fileID: 224940367335133146, guid: f40071bb3b9da854d85ad3c363192151,
        type: 2}
      propertyPath: m_AnchorMin.y
      value: 1
      objectReference: {fileID: 0}
    - target: {fileID: 224940367335133146, guid: f40071bb3b9da854d85ad3c363192151,
        type: 2}
      propertyPath: m_AnchorMax.y
      value: 1
      objectReference: {fileID: 0}
    - target: {fileID: 224940367335133146, guid: f40071bb3b9da854d85ad3c363192151,
        type: 2}
      propertyPath: m_AnchoredPosition.x
      value: 53.674698
      objectReference: {fileID: 0}
    - target: {fileID: 224940367335133146, guid: f40071bb3b9da854d85ad3c363192151,
        type: 2}
      propertyPath: m_AnchoredPosition.y
      value: -5
      objectReference: {fileID: 0}
    - target: {fileID: 224940367335133146, guid: f40071bb3b9da854d85ad3c363192151,
        type: 2}
      propertyPath: m_SizeDelta.x
      value: 97.349396
      objectReference: {fileID: 0}
    - target: {fileID: 224940367335133146, guid: f40071bb3b9da854d85ad3c363192151,
        type: 2}
      propertyPath: m_SizeDelta.y
      value: 15.421686
      objectReference: {fileID: 0}
    - target: {fileID: 224469193533178148, guid: f40071bb3b9da854d85ad3c363192151,
        type: 2}
      propertyPath: m_SizeDelta.y
      value: -118.87832
      objectReference: {fileID: 0}
    - target: {fileID: 1936971158399020, guid: f40071bb3b9da854d85ad3c363192151, type: 2}
      propertyPath: m_Name
      value: CallApp (1)
      objectReference: {fileID: 0}
    - target: {fileID: 224381116697831258, guid: f40071bb3b9da854d85ad3c363192151,
        type: 2}
      propertyPath: m_AnchorMin.y
      value: 0.00000011920929
      objectReference: {fileID: 0}
    - target: {fileID: 224669637824790466, guid: f40071bb3b9da854d85ad3c363192151,
        type: 2}
      propertyPath: m_SizeDelta.x
      value: 90.71408
      objectReference: {fileID: 0}
    - target: {fileID: 224669637824790466, guid: f40071bb3b9da854d85ad3c363192151,
        type: 2}
      propertyPath: m_SizeDelta.y
      value: 68.03556
      objectReference: {fileID: 0}
    - target: {fileID: 224291844198096202, guid: f40071bb3b9da854d85ad3c363192151,
        type: 2}
      propertyPath: m_SizeDelta.x
      value: 249.89996
      objectReference: {fileID: 0}
    - target: {fileID: 224291844198096202, guid: f40071bb3b9da854d85ad3c363192151,
        type: 2}
      propertyPath: m_SizeDelta.y
      value: 187.42497
      objectReference: {fileID: 0}
    - target: {fileID: 224044590805200910, guid: f40071bb3b9da854d85ad3c363192151,
        type: 2}
      propertyPath: m_AnchorMax.x
      value: 1
      objectReference: {fileID: 0}
    - target: {fileID: 224044590805200910, guid: f40071bb3b9da854d85ad3c363192151,
        type: 2}
      propertyPath: m_AnchorMax.y
      value: 1
      objectReference: {fileID: 0}
    - target: {fileID: 224044590805200910, guid: f40071bb3b9da854d85ad3c363192151,
        type: 2}
      propertyPath: m_SizeDelta.x
      value: -17
      objectReference: {fileID: 0}
    - target: {fileID: 224044590805200910, guid: f40071bb3b9da854d85ad3c363192151,
        type: 2}
      propertyPath: m_SizeDelta.y
      value: -17
      objectReference: {fileID: 0}
    - target: {fileID: 224040229336280632, guid: f40071bb3b9da854d85ad3c363192151,
        type: 2}
      propertyPath: m_AnchorMax.x
      value: 1
      objectReference: {fileID: 0}
    - target: {fileID: 224040229336280632, guid: f40071bb3b9da854d85ad3c363192151,
        type: 2}
      propertyPath: m_SizeDelta.x
      value: -17
      objectReference: {fileID: 0}
    - target: {fileID: 224971784413052594, guid: f40071bb3b9da854d85ad3c363192151,
        type: 2}
      propertyPath: m_AnchorMax.y
      value: 1
      objectReference: {fileID: 0}
    - target: {fileID: 224971784413052594, guid: f40071bb3b9da854d85ad3c363192151,
        type: 2}
      propertyPath: m_SizeDelta.y
      value: -17
      objectReference: {fileID: 0}
    - target: {fileID: 224469193533178148, guid: f40071bb3b9da854d85ad3c363192151,
        type: 2}
      propertyPath: m_AnchoredPosition.y
      value: -0.000045776367
      objectReference: {fileID: 0}
    - target: {fileID: 224636678546897036, guid: f40071bb3b9da854d85ad3c363192151,
        type: 2}
      propertyPath: m_AnchoredPosition.x
      value: -0.000030517578
      objectReference: {fileID: 0}
    - target: {fileID: 224636678546897036, guid: f40071bb3b9da854d85ad3c363192151,
        type: 2}
      propertyPath: m_AnchoredPosition.y
      value: 342
      objectReference: {fileID: 0}
    - target: {fileID: 224167448078349154, guid: f40071bb3b9da854d85ad3c363192151,
        type: 2}
      propertyPath: m_AnchorMin.x
      value: 0
      objectReference: {fileID: 0}
    - target: {fileID: 224469193533178148, guid: f40071bb3b9da854d85ad3c363192151,
        type: 2}
      propertyPath: m_AnchoredPosition.x
      value: 0
      objectReference: {fileID: 0}
    - target: {fileID: 224167448078349154, guid: f40071bb3b9da854d85ad3c363192151,
        type: 2}
      propertyPath: m_LocalPosition.x
      value: 0
      objectReference: {fileID: 0}
    - target: {fileID: 224381116697831258, guid: f40071bb3b9da854d85ad3c363192151,
        type: 2}
      propertyPath: m_LocalPosition.y
      value: 0
      objectReference: {fileID: 0}
    - target: {fileID: 224044590805200910, guid: f40071bb3b9da854d85ad3c363192151,
        type: 2}
      propertyPath: m_LocalPosition.x
      value: 0
      objectReference: {fileID: 0}
    - target: {fileID: 224469193533178148, guid: f40071bb3b9da854d85ad3c363192151,
        type: 2}
      propertyPath: m_LocalPosition.y
      value: 0
      objectReference: {fileID: 0}
    - target: {fileID: 224635042965996640, guid: f40071bb3b9da854d85ad3c363192151,
        type: 2}
      propertyPath: m_LocalPosition.y
      value: 0
      objectReference: {fileID: 0}
    - target: {fileID: 224381745088955326, guid: f40071bb3b9da854d85ad3c363192151,
        type: 2}
      propertyPath: m_LocalPosition.y
      value: 0
      objectReference: {fileID: 0}
    - target: {fileID: 224947520190371002, guid: f40071bb3b9da854d85ad3c363192151,
        type: 2}
      propertyPath: m_LocalPosition.y
      value: 0
      objectReference: {fileID: 0}
    - target: {fileID: 224547042570866814, guid: f40071bb3b9da854d85ad3c363192151,
        type: 2}
      propertyPath: m_LocalPosition.y
      value: 0
      objectReference: {fileID: 0}
    - target: {fileID: 224148476883448436, guid: f40071bb3b9da854d85ad3c363192151,
        type: 2}
      propertyPath: m_LocalPosition.y
      value: 0
      objectReference: {fileID: 0}
    - target: {fileID: 224241524877394856, guid: f40071bb3b9da854d85ad3c363192151,
        type: 2}
      propertyPath: m_LocalPosition.y
      value: 0
      objectReference: {fileID: 0}
    - target: {fileID: 224195190146944386, guid: f40071bb3b9da854d85ad3c363192151,
        type: 2}
      propertyPath: m_LocalPosition.y
      value: 0
      objectReference: {fileID: 0}
    - target: {fileID: 224692314708432762, guid: f40071bb3b9da854d85ad3c363192151,
        type: 2}
      propertyPath: m_LocalPosition.y
      value: 0
      objectReference: {fileID: 0}
    - target: {fileID: 224804388978026974, guid: f40071bb3b9da854d85ad3c363192151,
        type: 2}
      propertyPath: m_LocalPosition.y
      value: 0
      objectReference: {fileID: 0}
    - target: {fileID: 224679311464355560, guid: f40071bb3b9da854d85ad3c363192151,
        type: 2}
      propertyPath: m_LocalPosition.y
      value: 0
      objectReference: {fileID: 0}
    - target: {fileID: 224861355938014928, guid: f40071bb3b9da854d85ad3c363192151,
        type: 2}
      propertyPath: m_LocalPosition.y
      value: 0
      objectReference: {fileID: 0}
    - target: {fileID: 224424781061750724, guid: f40071bb3b9da854d85ad3c363192151,
        type: 2}
      propertyPath: m_LocalPosition.y
      value: 0
      objectReference: {fileID: 0}
    - target: {fileID: 224829387371093548, guid: f40071bb3b9da854d85ad3c363192151,
        type: 2}
      propertyPath: m_LocalPosition.y
      value: 0
      objectReference: {fileID: 0}
    - target: {fileID: 224994818970349382, guid: f40071bb3b9da854d85ad3c363192151,
        type: 2}
      propertyPath: m_LocalPosition.y
      value: 0
      objectReference: {fileID: 0}
    - target: {fileID: 224394487332348834, guid: f40071bb3b9da854d85ad3c363192151,
        type: 2}
      propertyPath: m_LocalPosition.y
      value: 0
      objectReference: {fileID: 0}
    - target: {fileID: 224781456090150090, guid: f40071bb3b9da854d85ad3c363192151,
        type: 2}
      propertyPath: m_LocalPosition.y
      value: 0
      objectReference: {fileID: 0}
    - target: {fileID: 224799050041281046, guid: f40071bb3b9da854d85ad3c363192151,
        type: 2}
      propertyPath: m_LocalPosition.y
      value: 0
      objectReference: {fileID: 0}
    - target: {fileID: 224940367335133146, guid: f40071bb3b9da854d85ad3c363192151,
        type: 2}
      propertyPath: m_LocalPosition.y
      value: 0
      objectReference: {fileID: 0}
    - target: {fileID: 224635042965996640, guid: f40071bb3b9da854d85ad3c363192151,
        type: 2}
      propertyPath: m_LocalPosition.x
      value: 0
      objectReference: {fileID: 0}
    - target: {fileID: 224381745088955326, guid: f40071bb3b9da854d85ad3c363192151,
        type: 2}
      propertyPath: m_LocalPosition.x
      value: 0
      objectReference: {fileID: 0}
    - target: {fileID: 224947520190371002, guid: f40071bb3b9da854d85ad3c363192151,
        type: 2}
      propertyPath: m_LocalPosition.x
      value: 0
      objectReference: {fileID: 0}
    - target: {fileID: 224547042570866814, guid: f40071bb3b9da854d85ad3c363192151,
        type: 2}
      propertyPath: m_LocalPosition.x
      value: 0
      objectReference: {fileID: 0}
    - target: {fileID: 224148476883448436, guid: f40071bb3b9da854d85ad3c363192151,
        type: 2}
      propertyPath: m_LocalPosition.x
      value: 0
      objectReference: {fileID: 0}
    - target: {fileID: 224241524877394856, guid: f40071bb3b9da854d85ad3c363192151,
        type: 2}
      propertyPath: m_LocalPosition.x
      value: 0
      objectReference: {fileID: 0}
    - target: {fileID: 224195190146944386, guid: f40071bb3b9da854d85ad3c363192151,
        type: 2}
      propertyPath: m_LocalPosition.x
      value: 0
      objectReference: {fileID: 0}
    - target: {fileID: 224692314708432762, guid: f40071bb3b9da854d85ad3c363192151,
        type: 2}
      propertyPath: m_LocalPosition.x
      value: 0
      objectReference: {fileID: 0}
    - target: {fileID: 224804388978026974, guid: f40071bb3b9da854d85ad3c363192151,
        type: 2}
      propertyPath: m_LocalPosition.x
      value: 0
      objectReference: {fileID: 0}
    - target: {fileID: 224679311464355560, guid: f40071bb3b9da854d85ad3c363192151,
        type: 2}
      propertyPath: m_LocalPosition.x
      value: 0
      objectReference: {fileID: 0}
    - target: {fileID: 224861355938014928, guid: f40071bb3b9da854d85ad3c363192151,
        type: 2}
      propertyPath: m_LocalPosition.x
      value: 0
      objectReference: {fileID: 0}
    - target: {fileID: 224424781061750724, guid: f40071bb3b9da854d85ad3c363192151,
        type: 2}
      propertyPath: m_LocalPosition.x
      value: 0
      objectReference: {fileID: 0}
    - target: {fileID: 224829387371093548, guid: f40071bb3b9da854d85ad3c363192151,
        type: 2}
      propertyPath: m_LocalPosition.x
      value: 0
      objectReference: {fileID: 0}
    - target: {fileID: 224994818970349382, guid: f40071bb3b9da854d85ad3c363192151,
        type: 2}
      propertyPath: m_LocalPosition.x
      value: 0
      objectReference: {fileID: 0}
    - target: {fileID: 224394487332348834, guid: f40071bb3b9da854d85ad3c363192151,
        type: 2}
      propertyPath: m_LocalPosition.x
      value: 0
      objectReference: {fileID: 0}
    - target: {fileID: 224781456090150090, guid: f40071bb3b9da854d85ad3c363192151,
        type: 2}
      propertyPath: m_LocalPosition.x
      value: 0
      objectReference: {fileID: 0}
    - target: {fileID: 224799050041281046, guid: f40071bb3b9da854d85ad3c363192151,
        type: 2}
      propertyPath: m_LocalPosition.x
      value: 0
      objectReference: {fileID: 0}
    - target: {fileID: 224940367335133146, guid: f40071bb3b9da854d85ad3c363192151,
        type: 2}
      propertyPath: m_LocalPosition.x
      value: 0
      objectReference: {fileID: 0}
    - target: {fileID: 224040229336280632, guid: f40071bb3b9da854d85ad3c363192151,
        type: 2}
      propertyPath: m_LocalPosition.x
      value: 0
      objectReference: {fileID: 0}
    - target: {fileID: 224971784413052594, guid: f40071bb3b9da854d85ad3c363192151,
        type: 2}
      propertyPath: m_LocalPosition.x
      value: 0
      objectReference: {fileID: 0}
    - target: {fileID: 224669637824790466, guid: f40071bb3b9da854d85ad3c363192151,
        type: 2}
      propertyPath: m_LocalPosition.x
      value: 0
      objectReference: {fileID: 0}
    - target: {fileID: 224987427035464524, guid: f40071bb3b9da854d85ad3c363192151,
        type: 2}
      propertyPath: m_LocalPosition.x
      value: 0
      objectReference: {fileID: 0}
    - target: {fileID: 224264048750145468, guid: f40071bb3b9da854d85ad3c363192151,
        type: 2}
      propertyPath: m_LocalPosition.x
      value: 0
      objectReference: {fileID: 0}
    - target: {fileID: 224396134141231896, guid: f40071bb3b9da854d85ad3c363192151,
        type: 2}
      propertyPath: m_LocalPosition.x
      value: 0
      objectReference: {fileID: 0}
    - target: {fileID: 224265823851960350, guid: f40071bb3b9da854d85ad3c363192151,
        type: 2}
      propertyPath: m_LocalPosition.x
      value: 0
      objectReference: {fileID: 0}
    - target: {fileID: 224504580426616422, guid: f40071bb3b9da854d85ad3c363192151,
        type: 2}
      propertyPath: m_LocalPosition.x
      value: 0
      objectReference: {fileID: 0}
    - target: {fileID: 224517335846443408, guid: f40071bb3b9da854d85ad3c363192151,
        type: 2}
      propertyPath: m_LocalPosition.x
      value: 0
      objectReference: {fileID: 0}
    - target: {fileID: 224622295406923844, guid: f40071bb3b9da854d85ad3c363192151,
        type: 2}
      propertyPath: m_LocalPosition.y
      value: 0
      objectReference: {fileID: 0}
    - target: {fileID: 224300993786537482, guid: f40071bb3b9da854d85ad3c363192151,
        type: 2}
      propertyPath: m_LocalPosition.x
      value: 0
      objectReference: {fileID: 0}
    - target: {fileID: 224035332696446438, guid: f40071bb3b9da854d85ad3c363192151,
        type: 2}
      propertyPath: m_LocalPosition.y
      value: 0
      objectReference: {fileID: 0}
    - target: {fileID: 0}
      propertyPath: m_LocalPosition.x
      value: -375
      objectReference: {fileID: 0}
    - target: {fileID: 224628344375347302, guid: f40071bb3b9da854d85ad3c363192151,
        type: 2}
      propertyPath: m_LocalPosition.x
      value: 0
      objectReference: {fileID: 0}
    - target: {fileID: 224652192081380214, guid: f40071bb3b9da854d85ad3c363192151,
        type: 2}
      propertyPath: m_LocalPosition.x
      value: 0
      objectReference: {fileID: 0}
    - target: {fileID: 224636678546897036, guid: f40071bb3b9da854d85ad3c363192151,
        type: 2}
      propertyPath: m_LocalPosition.x
      value: 0
      objectReference: {fileID: 0}
    - target: {fileID: 224636678546897036, guid: f40071bb3b9da854d85ad3c363192151,
        type: 2}
      propertyPath: m_LocalPosition.y
      value: 0
      objectReference: {fileID: 0}
    - target: {fileID: 224457950382648268, guid: f40071bb3b9da854d85ad3c363192151,
        type: 2}
      propertyPath: m_LocalPosition.y
      value: 0
      objectReference: {fileID: 0}
    - target: {fileID: 224467633911557854, guid: f40071bb3b9da854d85ad3c363192151,
        type: 2}
      propertyPath: m_LocalPosition.x
      value: 0
      objectReference: {fileID: 0}
    - target: {fileID: 224333032239705522, guid: f40071bb3b9da854d85ad3c363192151,
        type: 2}
      propertyPath: m_LocalPosition.x
      value: 0
      objectReference: {fileID: 0}
    - target: {fileID: 224106654770964938, guid: f40071bb3b9da854d85ad3c363192151,
        type: 2}
      propertyPath: m_LocalPosition.x
      value: 0
      objectReference: {fileID: 0}
    - target: {fileID: 224292022182336560, guid: f40071bb3b9da854d85ad3c363192151,
        type: 2}
      propertyPath: m_LocalPosition.x
      value: 0
      objectReference: {fileID: 0}
    - target: {fileID: 224182156145897334, guid: f40071bb3b9da854d85ad3c363192151,
        type: 2}
      propertyPath: m_LocalPosition.x
      value: 0
      objectReference: {fileID: 0}
    - target: {fileID: 224564266263835078, guid: f40071bb3b9da854d85ad3c363192151,
        type: 2}
      propertyPath: m_LocalPosition.x
      value: 0
      objectReference: {fileID: 0}
    - target: {fileID: 224245580793076984, guid: f40071bb3b9da854d85ad3c363192151,
        type: 2}
      propertyPath: m_LocalPosition.x
      value: 0
      objectReference: {fileID: 0}
    - target: {fileID: 224103329934486170, guid: f40071bb3b9da854d85ad3c363192151,
        type: 2}
      propertyPath: m_LocalPosition.x
      value: 0
      objectReference: {fileID: 0}
    - target: {fileID: 224951596842814244, guid: f40071bb3b9da854d85ad3c363192151,
        type: 2}
      propertyPath: m_LocalPosition.x
      value: 0
      objectReference: {fileID: 0}
    - target: {fileID: 224106746886353676, guid: f40071bb3b9da854d85ad3c363192151,
        type: 2}
      propertyPath: m_LocalPosition.x
      value: 0
      objectReference: {fileID: 0}
    - target: {fileID: 224185866256225978, guid: f40071bb3b9da854d85ad3c363192151,
        type: 2}
      propertyPath: m_LocalPosition.x
      value: 0
      objectReference: {fileID: 0}
    - target: {fileID: 114269414159358770, guid: f40071bb3b9da854d85ad3c363192151,
        type: 2}
      propertyPath: uLog
      value: 0
      objectReference: {fileID: 0}
    - target: {fileID: 224652192081380214, guid: f40071bb3b9da854d85ad3c363192151,
        type: 2}
      propertyPath: m_AnchoredPosition.x
      value: 14.150024
      objectReference: {fileID: 0}
    - target: {fileID: 224300993786537482, guid: f40071bb3b9da854d85ad3c363192151,
        type: 2}
      propertyPath: m_AnchoredPosition.x
      value: 0
      objectReference: {fileID: 0}
    - target: {fileID: 224517335846443408, guid: f40071bb3b9da854d85ad3c363192151,
        type: 2}
      propertyPath: m_AnchoredPosition.x
      value: -2
      objectReference: {fileID: 0}
    - target: {fileID: 224182156145897334, guid: f40071bb3b9da854d85ad3c363192151,
        type: 2}
      propertyPath: m_AnchoredPosition.x
      value: 0
      objectReference: {fileID: 0}
    - target: {fileID: 224329974975961464, guid: f40071bb3b9da854d85ad3c363192151,
        type: 2}
      propertyPath: m_AnchoredPosition.x
      value: -0.00006484985
      objectReference: {fileID: 0}
    - target: {fileID: 224517335846443408, guid: f40071bb3b9da854d85ad3c363192151,
        type: 2}
      propertyPath: m_AnchoredPosition.y
      value: 2.7500153
      objectReference: {fileID: 0}
    - target: {fileID: 224396134141231896, guid: f40071bb3b9da854d85ad3c363192151,
        type: 2}
      propertyPath: m_AnchoredPosition.x
      value: 0
      objectReference: {fileID: 0}
    - target: {fileID: 224619303588153584, guid: f40071bb3b9da854d85ad3c363192151,
        type: 2}
      propertyPath: m_AnchoredPosition.x
      value: -0.25
      objectReference: {fileID: 0}
    - target: {fileID: 224619303588153584, guid: f40071bb3b9da854d85ad3c363192151,
        type: 2}
      propertyPath: m_AnchoredPosition.y
      value: -0.25
      objectReference: {fileID: 0}
    - target: {fileID: 114896463224864588, guid: f40071bb3b9da854d85ad3c363192151,
        type: 2}
      propertyPath: m_Value
      value: 0
      objectReference: {fileID: 0}
    m_RemovedComponents: []
  m_SourcePrefab: {fileID: 100100000, guid: f40071bb3b9da854d85ad3c363192151, type: 2}
  m_IsPrefabAsset: 0
--- !u!224 &858465947 stripped
RectTransform:
  m_CorrespondingSourceObject: {fileID: 224245837003075970, guid: f40071bb3b9da854d85ad3c363192151,
    type: 2}
  m_PrefabInternal: {fileID: 858465946}
--- !u!224 &922617329 stripped
RectTransform:
  m_CorrespondingSourceObject: {fileID: 224245837003075970, guid: f40071bb3b9da854d85ad3c363192151,
    type: 2}
  m_PrefabInternal: {fileID: 1796093997}
--- !u!1001 &1796093997
Prefab:
  m_ObjectHideFlags: 0
  serializedVersion: 2
  m_Modification:
    m_TransformParent: {fileID: 371}
    m_Modifications:
    - target: {fileID: 224245837003075970, guid: f40071bb3b9da854d85ad3c363192151,
        type: 2}
      propertyPath: m_LocalPosition.x
      value: 0
      objectReference: {fileID: 0}
    - target: {fileID: 224245837003075970, guid: f40071bb3b9da854d85ad3c363192151,
        type: 2}
      propertyPath: m_LocalPosition.y
      value: 0
      objectReference: {fileID: 0}
    - target: {fileID: 224245837003075970, guid: f40071bb3b9da854d85ad3c363192151,
        type: 2}
      propertyPath: m_LocalPosition.z
      value: 0
      objectReference: {fileID: 0}
    - target: {fileID: 224245837003075970, guid: f40071bb3b9da854d85ad3c363192151,
        type: 2}
      propertyPath: m_LocalRotation.x
      value: 0
      objectReference: {fileID: 0}
    - target: {fileID: 224245837003075970, guid: f40071bb3b9da854d85ad3c363192151,
        type: 2}
      propertyPath: m_LocalRotation.y
      value: 0
      objectReference: {fileID: 0}
    - target: {fileID: 224245837003075970, guid: f40071bb3b9da854d85ad3c363192151,
        type: 2}
      propertyPath: m_LocalRotation.z
      value: 0
      objectReference: {fileID: 0}
    - target: {fileID: 224245837003075970, guid: f40071bb3b9da854d85ad3c363192151,
        type: 2}
      propertyPath: m_LocalRotation.w
      value: 1
      objectReference: {fileID: 0}
    - target: {fileID: 224245837003075970, guid: f40071bb3b9da854d85ad3c363192151,
        type: 2}
      propertyPath: m_RootOrder
      value: 2
      objectReference: {fileID: 0}
    - target: {fileID: 224245837003075970, guid: f40071bb3b9da854d85ad3c363192151,
        type: 2}
      propertyPath: m_AnchoredPosition.x
      value: 0
      objectReference: {fileID: 0}
    - target: {fileID: 224245837003075970, guid: f40071bb3b9da854d85ad3c363192151,
        type: 2}
      propertyPath: m_AnchoredPosition.y
      value: 0
      objectReference: {fileID: 0}
    - target: {fileID: 224245837003075970, guid: f40071bb3b9da854d85ad3c363192151,
        type: 2}
      propertyPath: m_SizeDelta.x
      value: 0
      objectReference: {fileID: 0}
    - target: {fileID: 224245837003075970, guid: f40071bb3b9da854d85ad3c363192151,
        type: 2}
      propertyPath: m_SizeDelta.y
      value: 0
      objectReference: {fileID: 0}
    - target: {fileID: 224245837003075970, guid: f40071bb3b9da854d85ad3c363192151,
        type: 2}
      propertyPath: m_AnchorMin.x
      value: 0
      objectReference: {fileID: 0}
    - target: {fileID: 224245837003075970, guid: f40071bb3b9da854d85ad3c363192151,
        type: 2}
      propertyPath: m_AnchorMin.y
      value: 0
      objectReference: {fileID: 0}
    - target: {fileID: 224245837003075970, guid: f40071bb3b9da854d85ad3c363192151,
        type: 2}
      propertyPath: m_AnchorMax.x
      value: 1
      objectReference: {fileID: 0}
    - target: {fileID: 224245837003075970, guid: f40071bb3b9da854d85ad3c363192151,
        type: 2}
      propertyPath: m_AnchorMax.y
      value: 1
      objectReference: {fileID: 0}
    - target: {fileID: 224245837003075970, guid: f40071bb3b9da854d85ad3c363192151,
        type: 2}
      propertyPath: m_Pivot.x
      value: 0.5
      objectReference: {fileID: 0}
    - target: {fileID: 224245837003075970, guid: f40071bb3b9da854d85ad3c363192151,
        type: 2}
      propertyPath: m_Pivot.y
      value: 0
      objectReference: {fileID: 0}
    - target: {fileID: 224661790658075176, guid: f40071bb3b9da854d85ad3c363192151,
        type: 2}
      propertyPath: m_AnchorMax.x
      value: 1
      objectReference: {fileID: 0}
    - target: {fileID: 224661790658075176, guid: f40071bb3b9da854d85ad3c363192151,
        type: 2}
      propertyPath: m_AnchorMax.y
      value: 1
      objectReference: {fileID: 0}
    - target: {fileID: 224457950382648268, guid: f40071bb3b9da854d85ad3c363192151,
        type: 2}
      propertyPath: m_AnchorMin.y
      value: 1
      objectReference: {fileID: 0}
    - target: {fileID: 224457950382648268, guid: f40071bb3b9da854d85ad3c363192151,
        type: 2}
      propertyPath: m_AnchorMax.x
      value: 1
      objectReference: {fileID: 0}
    - target: {fileID: 224457950382648268, guid: f40071bb3b9da854d85ad3c363192151,
        type: 2}
      propertyPath: m_AnchorMax.y
      value: 1
      objectReference: {fileID: 0}
    - target: {fileID: 224381116697831258, guid: f40071bb3b9da854d85ad3c363192151,
        type: 2}
      propertyPath: m_AnchorMax.x
      value: 1
      objectReference: {fileID: 0}
    - target: {fileID: 224381116697831258, guid: f40071bb3b9da854d85ad3c363192151,
        type: 2}
      propertyPath: m_AnchorMax.y
      value: 1
      objectReference: {fileID: 0}
    - target: {fileID: 224167448078349154, guid: f40071bb3b9da854d85ad3c363192151,
        type: 2}
      propertyPath: m_AnchorMax.x
      value: 1
      objectReference: {fileID: 0}
    - target: {fileID: 224167448078349154, guid: f40071bb3b9da854d85ad3c363192151,
        type: 2}
      propertyPath: m_AnchorMax.y
      value: 1
      objectReference: {fileID: 0}
    - target: {fileID: 224635042965996640, guid: f40071bb3b9da854d85ad3c363192151,
        type: 2}
      propertyPath: m_AnchorMin.y
      value: 1
      objectReference: {fileID: 0}
    - target: {fileID: 224635042965996640, guid: f40071bb3b9da854d85ad3c363192151,
        type: 2}
      propertyPath: m_AnchorMax.y
      value: 1
      objectReference: {fileID: 0}
    - target: {fileID: 224635042965996640, guid: f40071bb3b9da854d85ad3c363192151,
        type: 2}
      propertyPath: m_AnchoredPosition.x
      value: 6.9277105
      objectReference: {fileID: 0}
    - target: {fileID: 224635042965996640, guid: f40071bb3b9da854d85ad3c363192151,
        type: 2}
      propertyPath: m_AnchoredPosition.y
      value: -5
      objectReference: {fileID: 0}
    - target: {fileID: 224635042965996640, guid: f40071bb3b9da854d85ad3c363192151,
        type: 2}
      propertyPath: m_SizeDelta.x
      value: 3.8554215
      objectReference: {fileID: 0}
    - target: {fileID: 224381745088955326, guid: f40071bb3b9da854d85ad3c363192151,
        type: 2}
      propertyPath: m_AnchorMin.y
      value: 1
      objectReference: {fileID: 0}
    - target: {fileID: 224381745088955326, guid: f40071bb3b9da854d85ad3c363192151,
        type: 2}
      propertyPath: m_AnchorMax.y
      value: 1
      objectReference: {fileID: 0}
    - target: {fileID: 224381745088955326, guid: f40071bb3b9da854d85ad3c363192151,
        type: 2}
      propertyPath: m_AnchoredPosition.x
      value: 6.9277105
      objectReference: {fileID: 0}
    - target: {fileID: 224381745088955326, guid: f40071bb3b9da854d85ad3c363192151,
        type: 2}
      propertyPath: m_AnchoredPosition.y
      value: -5
      objectReference: {fileID: 0}
    - target: {fileID: 224381745088955326, guid: f40071bb3b9da854d85ad3c363192151,
        type: 2}
      propertyPath: m_SizeDelta.x
      value: 3.8554215
      objectReference: {fileID: 0}
    - target: {fileID: 224947520190371002, guid: f40071bb3b9da854d85ad3c363192151,
        type: 2}
      propertyPath: m_AnchorMin.y
      value: 1
      objectReference: {fileID: 0}
    - target: {fileID: 224947520190371002, guid: f40071bb3b9da854d85ad3c363192151,
        type: 2}
      propertyPath: m_AnchorMax.y
      value: 1
      objectReference: {fileID: 0}
    - target: {fileID: 224947520190371002, guid: f40071bb3b9da854d85ad3c363192151,
        type: 2}
      propertyPath: m_AnchoredPosition.x
      value: 6.9277105
      objectReference: {fileID: 0}
    - target: {fileID: 224947520190371002, guid: f40071bb3b9da854d85ad3c363192151,
        type: 2}
      propertyPath: m_AnchoredPosition.y
      value: -5
      objectReference: {fileID: 0}
    - target: {fileID: 224947520190371002, guid: f40071bb3b9da854d85ad3c363192151,
        type: 2}
      propertyPath: m_SizeDelta.x
      value: 3.8554215
      objectReference: {fileID: 0}
    - target: {fileID: 224547042570866814, guid: f40071bb3b9da854d85ad3c363192151,
        type: 2}
      propertyPath: m_AnchorMin.y
      value: 1
      objectReference: {fileID: 0}
    - target: {fileID: 224547042570866814, guid: f40071bb3b9da854d85ad3c363192151,
        type: 2}
      propertyPath: m_AnchorMax.y
      value: 1
      objectReference: {fileID: 0}
    - target: {fileID: 224547042570866814, guid: f40071bb3b9da854d85ad3c363192151,
        type: 2}
      propertyPath: m_AnchoredPosition.x
      value: 6.9277105
      objectReference: {fileID: 0}
    - target: {fileID: 224547042570866814, guid: f40071bb3b9da854d85ad3c363192151,
        type: 2}
      propertyPath: m_AnchoredPosition.y
      value: -5
      objectReference: {fileID: 0}
    - target: {fileID: 224547042570866814, guid: f40071bb3b9da854d85ad3c363192151,
        type: 2}
      propertyPath: m_SizeDelta.x
      value: 3.8554215
      objectReference: {fileID: 0}
    - target: {fileID: 224148476883448436, guid: f40071bb3b9da854d85ad3c363192151,
        type: 2}
      propertyPath: m_AnchorMin.y
      value: 1
      objectReference: {fileID: 0}
    - target: {fileID: 224148476883448436, guid: f40071bb3b9da854d85ad3c363192151,
        type: 2}
      propertyPath: m_AnchorMax.y
      value: 1
      objectReference: {fileID: 0}
    - target: {fileID: 224148476883448436, guid: f40071bb3b9da854d85ad3c363192151,
        type: 2}
      propertyPath: m_AnchoredPosition.x
      value: 6.9277105
      objectReference: {fileID: 0}
    - target: {fileID: 224148476883448436, guid: f40071bb3b9da854d85ad3c363192151,
        type: 2}
      propertyPath: m_AnchoredPosition.y
      value: -5
      objectReference: {fileID: 0}
    - target: {fileID: 224148476883448436, guid: f40071bb3b9da854d85ad3c363192151,
        type: 2}
      propertyPath: m_SizeDelta.x
      value: 3.8554215
      objectReference: {fileID: 0}
    - target: {fileID: 224241524877394856, guid: f40071bb3b9da854d85ad3c363192151,
        type: 2}
      propertyPath: m_AnchorMin.y
      value: 1
      objectReference: {fileID: 0}
    - target: {fileID: 224241524877394856, guid: f40071bb3b9da854d85ad3c363192151,
        type: 2}
      propertyPath: m_AnchorMax.y
      value: 1
      objectReference: {fileID: 0}
    - target: {fileID: 224241524877394856, guid: f40071bb3b9da854d85ad3c363192151,
        type: 2}
      propertyPath: m_AnchoredPosition.x
      value: 6.9277105
      objectReference: {fileID: 0}
    - target: {fileID: 224241524877394856, guid: f40071bb3b9da854d85ad3c363192151,
        type: 2}
      propertyPath: m_AnchoredPosition.y
      value: -5
      objectReference: {fileID: 0}
    - target: {fileID: 224241524877394856, guid: f40071bb3b9da854d85ad3c363192151,
        type: 2}
      propertyPath: m_SizeDelta.x
      value: 3.8554215
      objectReference: {fileID: 0}
    - target: {fileID: 224195190146944386, guid: f40071bb3b9da854d85ad3c363192151,
        type: 2}
      propertyPath: m_AnchorMin.y
      value: 1
      objectReference: {fileID: 0}
    - target: {fileID: 224195190146944386, guid: f40071bb3b9da854d85ad3c363192151,
        type: 2}
      propertyPath: m_AnchorMax.y
      value: 1
      objectReference: {fileID: 0}
    - target: {fileID: 224195190146944386, guid: f40071bb3b9da854d85ad3c363192151,
        type: 2}
      propertyPath: m_AnchoredPosition.x
      value: 6.9277105
      objectReference: {fileID: 0}
    - target: {fileID: 224195190146944386, guid: f40071bb3b9da854d85ad3c363192151,
        type: 2}
      propertyPath: m_AnchoredPosition.y
      value: -5
      objectReference: {fileID: 0}
    - target: {fileID: 224195190146944386, guid: f40071bb3b9da854d85ad3c363192151,
        type: 2}
      propertyPath: m_SizeDelta.x
      value: 3.8554215
      objectReference: {fileID: 0}
    - target: {fileID: 224692314708432762, guid: f40071bb3b9da854d85ad3c363192151,
        type: 2}
      propertyPath: m_AnchorMin.y
      value: 1
      objectReference: {fileID: 0}
    - target: {fileID: 224692314708432762, guid: f40071bb3b9da854d85ad3c363192151,
        type: 2}
      propertyPath: m_AnchorMax.y
      value: 1
      objectReference: {fileID: 0}
    - target: {fileID: 224692314708432762, guid: f40071bb3b9da854d85ad3c363192151,
        type: 2}
      propertyPath: m_AnchoredPosition.x
      value: 6.9277105
      objectReference: {fileID: 0}
    - target: {fileID: 224692314708432762, guid: f40071bb3b9da854d85ad3c363192151,
        type: 2}
      propertyPath: m_AnchoredPosition.y
      value: -5
      objectReference: {fileID: 0}
    - target: {fileID: 224692314708432762, guid: f40071bb3b9da854d85ad3c363192151,
        type: 2}
      propertyPath: m_SizeDelta.x
      value: 3.8554215
      objectReference: {fileID: 0}
    - target: {fileID: 224804388978026974, guid: f40071bb3b9da854d85ad3c363192151,
        type: 2}
      propertyPath: m_AnchorMin.y
      value: 1
      objectReference: {fileID: 0}
    - target: {fileID: 224804388978026974, guid: f40071bb3b9da854d85ad3c363192151,
        type: 2}
      propertyPath: m_AnchorMax.y
      value: 1
      objectReference: {fileID: 0}
    - target: {fileID: 224804388978026974, guid: f40071bb3b9da854d85ad3c363192151,
        type: 2}
      propertyPath: m_AnchoredPosition.x
      value: 6.9277105
      objectReference: {fileID: 0}
    - target: {fileID: 224804388978026974, guid: f40071bb3b9da854d85ad3c363192151,
        type: 2}
      propertyPath: m_AnchoredPosition.y
      value: -5
      objectReference: {fileID: 0}
    - target: {fileID: 224804388978026974, guid: f40071bb3b9da854d85ad3c363192151,
        type: 2}
      propertyPath: m_SizeDelta.x
      value: 3.8554215
      objectReference: {fileID: 0}
    - target: {fileID: 224679311464355560, guid: f40071bb3b9da854d85ad3c363192151,
        type: 2}
      propertyPath: m_AnchorMin.y
      value: 1
      objectReference: {fileID: 0}
    - target: {fileID: 224679311464355560, guid: f40071bb3b9da854d85ad3c363192151,
        type: 2}
      propertyPath: m_AnchorMax.y
      value: 1
      objectReference: {fileID: 0}
    - target: {fileID: 224679311464355560, guid: f40071bb3b9da854d85ad3c363192151,
        type: 2}
      propertyPath: m_AnchoredPosition.x
      value: 6.9277105
      objectReference: {fileID: 0}
    - target: {fileID: 224679311464355560, guid: f40071bb3b9da854d85ad3c363192151,
        type: 2}
      propertyPath: m_AnchoredPosition.y
      value: -5
      objectReference: {fileID: 0}
    - target: {fileID: 224679311464355560, guid: f40071bb3b9da854d85ad3c363192151,
        type: 2}
      propertyPath: m_SizeDelta.x
      value: 3.8554215
      objectReference: {fileID: 0}
    - target: {fileID: 224861355938014928, guid: f40071bb3b9da854d85ad3c363192151,
        type: 2}
      propertyPath: m_AnchorMin.y
      value: 1
      objectReference: {fileID: 0}
    - target: {fileID: 224861355938014928, guid: f40071bb3b9da854d85ad3c363192151,
        type: 2}
      propertyPath: m_AnchorMax.y
      value: 1
      objectReference: {fileID: 0}
    - target: {fileID: 224861355938014928, guid: f40071bb3b9da854d85ad3c363192151,
        type: 2}
      propertyPath: m_AnchoredPosition.x
      value: 6.9277105
      objectReference: {fileID: 0}
    - target: {fileID: 224861355938014928, guid: f40071bb3b9da854d85ad3c363192151,
        type: 2}
      propertyPath: m_AnchoredPosition.y
      value: -5
      objectReference: {fileID: 0}
    - target: {fileID: 224861355938014928, guid: f40071bb3b9da854d85ad3c363192151,
        type: 2}
      propertyPath: m_SizeDelta.x
      value: 3.8554215
      objectReference: {fileID: 0}
    - target: {fileID: 224424781061750724, guid: f40071bb3b9da854d85ad3c363192151,
        type: 2}
      propertyPath: m_AnchorMin.y
      value: 1
      objectReference: {fileID: 0}
    - target: {fileID: 224424781061750724, guid: f40071bb3b9da854d85ad3c363192151,
        type: 2}
      propertyPath: m_AnchorMax.y
      value: 1
      objectReference: {fileID: 0}
    - target: {fileID: 224424781061750724, guid: f40071bb3b9da854d85ad3c363192151,
        type: 2}
      propertyPath: m_AnchoredPosition.x
      value: 6.9277105
      objectReference: {fileID: 0}
    - target: {fileID: 224424781061750724, guid: f40071bb3b9da854d85ad3c363192151,
        type: 2}
      propertyPath: m_AnchoredPosition.y
      value: -5
      objectReference: {fileID: 0}
    - target: {fileID: 224424781061750724, guid: f40071bb3b9da854d85ad3c363192151,
        type: 2}
      propertyPath: m_SizeDelta.x
      value: 3.8554215
      objectReference: {fileID: 0}
    - target: {fileID: 224829387371093548, guid: f40071bb3b9da854d85ad3c363192151,
        type: 2}
      propertyPath: m_AnchorMin.y
      value: 1
      objectReference: {fileID: 0}
    - target: {fileID: 224829387371093548, guid: f40071bb3b9da854d85ad3c363192151,
        type: 2}
      propertyPath: m_AnchorMax.y
      value: 1
      objectReference: {fileID: 0}
    - target: {fileID: 224829387371093548, guid: f40071bb3b9da854d85ad3c363192151,
        type: 2}
      propertyPath: m_AnchoredPosition.x
      value: 6.9277105
      objectReference: {fileID: 0}
    - target: {fileID: 224829387371093548, guid: f40071bb3b9da854d85ad3c363192151,
        type: 2}
      propertyPath: m_AnchoredPosition.y
      value: -5
      objectReference: {fileID: 0}
    - target: {fileID: 224829387371093548, guid: f40071bb3b9da854d85ad3c363192151,
        type: 2}
      propertyPath: m_SizeDelta.x
      value: 3.8554215
      objectReference: {fileID: 0}
    - target: {fileID: 224994818970349382, guid: f40071bb3b9da854d85ad3c363192151,
        type: 2}
      propertyPath: m_AnchorMin.y
      value: 1
      objectReference: {fileID: 0}
    - target: {fileID: 224994818970349382, guid: f40071bb3b9da854d85ad3c363192151,
        type: 2}
      propertyPath: m_AnchorMax.y
      value: 1
      objectReference: {fileID: 0}
    - target: {fileID: 224994818970349382, guid: f40071bb3b9da854d85ad3c363192151,
        type: 2}
      propertyPath: m_AnchoredPosition.x
      value: 6.9277105
      objectReference: {fileID: 0}
    - target: {fileID: 224994818970349382, guid: f40071bb3b9da854d85ad3c363192151,
        type: 2}
      propertyPath: m_AnchoredPosition.y
      value: -5
      objectReference: {fileID: 0}
    - target: {fileID: 224994818970349382, guid: f40071bb3b9da854d85ad3c363192151,
        type: 2}
      propertyPath: m_SizeDelta.x
      value: 3.8554215
      objectReference: {fileID: 0}
    - target: {fileID: 224394487332348834, guid: f40071bb3b9da854d85ad3c363192151,
        type: 2}
      propertyPath: m_AnchorMin.y
      value: 1
      objectReference: {fileID: 0}
    - target: {fileID: 224394487332348834, guid: f40071bb3b9da854d85ad3c363192151,
        type: 2}
      propertyPath: m_AnchorMax.y
      value: 1
      objectReference: {fileID: 0}
    - target: {fileID: 224394487332348834, guid: f40071bb3b9da854d85ad3c363192151,
        type: 2}
      propertyPath: m_AnchoredPosition.x
      value: 6.9277105
      objectReference: {fileID: 0}
    - target: {fileID: 224394487332348834, guid: f40071bb3b9da854d85ad3c363192151,
        type: 2}
      propertyPath: m_AnchoredPosition.y
      value: -5
      objectReference: {fileID: 0}
    - target: {fileID: 224394487332348834, guid: f40071bb3b9da854d85ad3c363192151,
        type: 2}
      propertyPath: m_SizeDelta.x
      value: 3.8554215
      objectReference: {fileID: 0}
    - target: {fileID: 224781456090150090, guid: f40071bb3b9da854d85ad3c363192151,
        type: 2}
      propertyPath: m_AnchorMin.y
      value: 1
      objectReference: {fileID: 0}
    - target: {fileID: 224781456090150090, guid: f40071bb3b9da854d85ad3c363192151,
        type: 2}
      propertyPath: m_AnchorMax.y
      value: 1
      objectReference: {fileID: 0}
    - target: {fileID: 224781456090150090, guid: f40071bb3b9da854d85ad3c363192151,
        type: 2}
      propertyPath: m_AnchoredPosition.x
      value: 6.9277105
      objectReference: {fileID: 0}
    - target: {fileID: 224781456090150090, guid: f40071bb3b9da854d85ad3c363192151,
        type: 2}
      propertyPath: m_AnchoredPosition.y
      value: -5
      objectReference: {fileID: 0}
    - target: {fileID: 224781456090150090, guid: f40071bb3b9da854d85ad3c363192151,
        type: 2}
      propertyPath: m_SizeDelta.x
      value: 3.8554215
      objectReference: {fileID: 0}
    - target: {fileID: 224799050041281046, guid: f40071bb3b9da854d85ad3c363192151,
        type: 2}
      propertyPath: m_AnchorMin.y
      value: 1
      objectReference: {fileID: 0}
    - target: {fileID: 224799050041281046, guid: f40071bb3b9da854d85ad3c363192151,
        type: 2}
      propertyPath: m_AnchorMax.y
      value: 1
      objectReference: {fileID: 0}
    - target: {fileID: 224799050041281046, guid: f40071bb3b9da854d85ad3c363192151,
        type: 2}
      propertyPath: m_AnchoredPosition.x
      value: 6.9277105
      objectReference: {fileID: 0}
    - target: {fileID: 224799050041281046, guid: f40071bb3b9da854d85ad3c363192151,
        type: 2}
      propertyPath: m_AnchoredPosition.y
      value: -5
      objectReference: {fileID: 0}
    - target: {fileID: 224799050041281046, guid: f40071bb3b9da854d85ad3c363192151,
        type: 2}
      propertyPath: m_SizeDelta.x
      value: 3.8554215
      objectReference: {fileID: 0}
    - target: {fileID: 224940367335133146, guid: f40071bb3b9da854d85ad3c363192151,
        type: 2}
      propertyPath: m_AnchorMin.y
      value: 1
      objectReference: {fileID: 0}
    - target: {fileID: 224940367335133146, guid: f40071bb3b9da854d85ad3c363192151,
        type: 2}
      propertyPath: m_AnchorMax.y
      value: 1
      objectReference: {fileID: 0}
    - target: {fileID: 224940367335133146, guid: f40071bb3b9da854d85ad3c363192151,
        type: 2}
      propertyPath: m_AnchoredPosition.x
      value: 53.674698
      objectReference: {fileID: 0}
    - target: {fileID: 224940367335133146, guid: f40071bb3b9da854d85ad3c363192151,
        type: 2}
      propertyPath: m_AnchoredPosition.y
      value: -5
      objectReference: {fileID: 0}
    - target: {fileID: 224940367335133146, guid: f40071bb3b9da854d85ad3c363192151,
        type: 2}
      propertyPath: m_SizeDelta.x
      value: 97.349396
      objectReference: {fileID: 0}
    - target: {fileID: 224940367335133146, guid: f40071bb3b9da854d85ad3c363192151,
        type: 2}
      propertyPath: m_SizeDelta.y
      value: 15.421686
      objectReference: {fileID: 0}
    - target: {fileID: 224469193533178148, guid: f40071bb3b9da854d85ad3c363192151,
        type: 2}
      propertyPath: m_SizeDelta.y
      value: -118.87832
      objectReference: {fileID: 0}
    - target: {fileID: 224381116697831258, guid: f40071bb3b9da854d85ad3c363192151,
        type: 2}
      propertyPath: m_AnchorMin.y
      value: 0.00000011920929
      objectReference: {fileID: 0}
    - target: {fileID: 224469193533178148, guid: f40071bb3b9da854d85ad3c363192151,
        type: 2}
      propertyPath: m_AnchoredPosition.y
      value: 0
      objectReference: {fileID: 0}
    - target: {fileID: 224044590805200910, guid: f40071bb3b9da854d85ad3c363192151,
        type: 2}
      propertyPath: m_AnchorMax.x
      value: 1
      objectReference: {fileID: 0}
    - target: {fileID: 224044590805200910, guid: f40071bb3b9da854d85ad3c363192151,
        type: 2}
      propertyPath: m_AnchorMax.y
      value: 1
      objectReference: {fileID: 0}
    - target: {fileID: 224044590805200910, guid: f40071bb3b9da854d85ad3c363192151,
        type: 2}
      propertyPath: m_SizeDelta.x
      value: -17
      objectReference: {fileID: 0}
    - target: {fileID: 224044590805200910, guid: f40071bb3b9da854d85ad3c363192151,
        type: 2}
      propertyPath: m_SizeDelta.y
      value: -17
      objectReference: {fileID: 0}
    - target: {fileID: 224040229336280632, guid: f40071bb3b9da854d85ad3c363192151,
        type: 2}
      propertyPath: m_AnchorMax.x
      value: 1
      objectReference: {fileID: 0}
    - target: {fileID: 224040229336280632, guid: f40071bb3b9da854d85ad3c363192151,
        type: 2}
      propertyPath: m_SizeDelta.x
      value: -17
      objectReference: {fileID: 0}
    - target: {fileID: 224971784413052594, guid: f40071bb3b9da854d85ad3c363192151,
        type: 2}
      propertyPath: m_AnchorMax.y
      value: 1
      objectReference: {fileID: 0}
    - target: {fileID: 224971784413052594, guid: f40071bb3b9da854d85ad3c363192151,
        type: 2}
      propertyPath: m_SizeDelta.y
      value: -17
      objectReference: {fileID: 0}
    - target: {fileID: 224167448078349154, guid: f40071bb3b9da854d85ad3c363192151,
        type: 2}
      propertyPath: m_AnchorMin.x
      value: 0
      objectReference: {fileID: 0}
    - target: {fileID: 224669637824790466, guid: f40071bb3b9da854d85ad3c363192151,
        type: 2}
      propertyPath: m_SizeDelta.x
      value: 90.71408
      objectReference: {fileID: 0}
    - target: {fileID: 224669637824790466, guid: f40071bb3b9da854d85ad3c363192151,
        type: 2}
      propertyPath: m_SizeDelta.y
      value: 68.03556
      objectReference: {fileID: 0}
    - target: {fileID: 224291844198096202, guid: f40071bb3b9da854d85ad3c363192151,
        type: 2}
      propertyPath: m_SizeDelta.x
      value: 249.89996
      objectReference: {fileID: 0}
    - target: {fileID: 224291844198096202, guid: f40071bb3b9da854d85ad3c363192151,
        type: 2}
      propertyPath: m_SizeDelta.y
      value: 187.42497
      objectReference: {fileID: 0}
    - target: {fileID: 224329974975961464, guid: f40071bb3b9da854d85ad3c363192151,
        type: 2}
      propertyPath: m_AnchoredPosition.x
      value: -0.00006484985
      objectReference: {fileID: 0}
    - target: {fileID: 224517335846443408, guid: f40071bb3b9da854d85ad3c363192151,
        type: 2}
      propertyPath: m_AnchoredPosition.y
      value: 2.7500153
      objectReference: {fileID: 0}
    - target: {fileID: 224182156145897334, guid: f40071bb3b9da854d85ad3c363192151,
        type: 2}
      propertyPath: m_AnchoredPosition.x
      value: 0
      objectReference: {fileID: 0}
    - target: {fileID: 224619303588153584, guid: f40071bb3b9da854d85ad3c363192151,
        type: 2}
      propertyPath: m_AnchoredPosition.x
      value: -0.25
      objectReference: {fileID: 0}
    - target: {fileID: 224619303588153584, guid: f40071bb3b9da854d85ad3c363192151,
        type: 2}
      propertyPath: m_AnchoredPosition.y
      value: -0.25
      objectReference: {fileID: 0}
    - target: {fileID: 224396134141231896, guid: f40071bb3b9da854d85ad3c363192151,
        type: 2}
      propertyPath: m_AnchoredPosition.x
      value: 0
      objectReference: {fileID: 0}
    - target: {fileID: 114683022648654942, guid: f40071bb3b9da854d85ad3c363192151,
        type: 2}
      propertyPath: m_Value
      value: 1
      objectReference: {fileID: 0}
    m_RemovedComponents: []
  m_SourcePrefab: {fileID: 100100000, guid: f40071bb3b9da854d85ad3c363192151, type: 2}
  m_IsPrefabAsset: 0
