2018-10-04 11:20:35,933 INFO: Gigi motors startup [in /home/rono/Documents/gigimotors/app/__init__.py:97]
2018-10-04 11:20:49,726 INFO: Gigi motors startup [in /home/rono/Documents/gigimotors/app/__init__.py:97]
2018-10-05 14:43:06,264 INFO: Gigi motors startup [in /home/rono/Documents/gigimotors/app/__init__.py:97]
2018-10-05 14:43:11,224 INFO: Gigi motors startup [in /home/rono/Documents/gigimotors/app/__init__.py:97]
2018-10-15 15:53:27,063 INFO: Gigi motors startup [in /home/rono/Documents/gigimotors/app/__init__.py:102]
2018-10-15 15:53:40,228 INFO: Gigi motors startup [in /home/rono/Documents/gigimotors/app/__init__.py:102]
2018-10-15 15:54:18,729 INFO: Gigi motors startup [in /home/rono/Documents/gigimotors/app/__init__.py:102]
2018-10-15 15:54:32,094 INFO: Gigi motors startup [in /home/rono/Documents/gigimotors/app/__init__.py:102]
2018-10-15 19:02:14,688 INFO: Gigi motors startup [in /home/rono/Documents/gigimotors/app/__init__.py:102]
