%YAML 1.1
%TAG !u! tag:unity3d.com,2011:
--- !u!21 &2100000
Material:
  serializedVersion: 6
  m_ObjectHideFlags: 0
  m_CorrespondingSourceObject: {fileID: 0}
  m_PrefabInstance: {fileID: 0}
  m_PrefabAsset: {fileID: 0}
  m_Name: DebugShadow
  m_Shader: {fileID: -6465566751694194690, guid: e76e1a7e868cc4bf5a7021a8487a697f, type: 3}
  m_ShaderKeywords: 
  m_LightmapFlags: 4
  m_EnableInstancingVariants: 0
  m_DoubleSidedGI: 0
  m_CustomRenderQueue: -1
  stringTagMap: {}
  disabledShaderPasses: []
  m_SavedProperties:
    serializedVersion: 3
    m_TexEnvs: []
    m_Floats:
    - _Foam_Amount: 1.3
    - _Foam_Hide_Scale: 100
    - _Foam_Scale: 200
    - _Foam_Speed: 300
    - _Foam_Wave: 0.3
    - _Fresnel_Effect: 0.5
    - _Fresnel_Top_Effect: 0.75
    - _Overlap: 1
    - _Overlap_Max: 1
    - _Overlap_Min: 0
    - _Use_Overlap_Color: 1
    - _Wave_Angular_Frequency: 1
    - _Wave_Foam: 0.05
    - _Wave_Frequency: 10
    - _Wave_Height: 0.15
    - _Wave_Linear_Frequency: 0.1
    - _Wave_Sharpness: 2
    - _Wave_Speed: 0.25
    - _Wave_Tangent_Angular_Frequency: 0.1
    - _Wave_Tangent_Frequency: 1
    m_Colors:
    - _Color: {r: 0.4190103, g: 0.7724389, b: 0.8301887, a: 0}
    - _Foam_Color: {r: 1, g: 1, b: 1, a: 1}
    - _Overlap_Color: {r: 1, g: 1, b: 1, a: 0}
  m_BuildTextureStacks: []
