%YAML 1.1
%TAG !u! tag:unity3d.com,2011:
--- !u!114 &-286345232184122929
MonoBehaviour:
  m_ObjectHideFlags: 11
  m_CorrespondingSourceObject: {fileID: 0}
  m_PrefabInstance: {fileID: 0}
  m_PrefabAsset: {fileID: 0}
  m_GameObject: {fileID: 0}
  m_Enabled: 1
  m_EditorHideFlags: 0
  m_Script: {fileID: 11500000, guid: d0353a89b1f911e48b9e16bdc9f2e058, type: 3}
  m_Name: 
  m_EditorClassIdentifier: 
  version: 2
--- !u!21 &2100000
Material:
  serializedVersion: 6
  m_ObjectHideFlags: 0
  m_CorrespondingSourceObject: {fileID: 0}
  m_PrefabInstance: {fileID: 0}
  m_PrefabAsset: {fileID: 0}
  m_Name: Water 1
  m_Shader: {fileID: -6465566751694194690, guid: bb3525b0c1075354a8f2e0c947dbbb0b,
    type: 3}
  m_ShaderKeywords: 
  m_LightmapFlags: 4
  m_EnableInstancingVariants: 0
  m_DoubleSidedGI: 0
  m_CustomRenderQueue: -1
  stringTagMap: {}
  disabledShaderPasses: []
  m_SavedProperties:
    serializedVersion: 3
    m_TexEnvs:
    - _AO_Texture_Array:
        m_Texture: {fileID: 0}
        m_Scale: {x: 1, y: 1}
        m_Offset: {x: 0, y: 0}
    - _BaseMap:
        m_Texture: {fileID: 0}
        m_Scale: {x: 1, y: 1}
        m_Offset: {x: 0, y: 0}
    - _BumpMap:
        m_Texture: {fileID: 0}
        m_Scale: {x: 1, y: 1}
        m_Offset: {x: 0, y: 0}
    - _EmissionMap:
        m_Texture: {fileID: 0}
        m_Scale: {x: 1, y: 1}
        m_Offset: {x: 0, y: 0}
    - _Foam_Texture:
        m_Texture: {fileID: 2800000, guid: 707e56e72e0374c52954263e5ce52199, type: 3}
        m_Scale: {x: 1, y: 1}
        m_Offset: {x: 0, y: 0}
    - _MainTex:
        m_Texture: {fileID: 0}
        m_Scale: {x: 1, y: 1}
        m_Offset: {x: 0, y: 0}
    - _MetallicGlossMap:
        m_Texture: {fileID: 0}
        m_Scale: {x: 1, y: 1}
        m_Offset: {x: 0, y: 0}
    - _Noise:
        m_Texture: {fileID: 2800000, guid: 8b1b90fca7c834bf8a8974201e5ec9ce, type: 3}
        m_Scale: {x: 1, y: 1}
        m_Offset: {x: 0, y: 0}
    - _OcclusionMap:
        m_Texture: {fileID: 0}
        m_Scale: {x: 1, y: 1}
        m_Offset: {x: 0, y: 0}
    - _SampleTexture2D_D88DF4D8_Texture_1:
        m_Texture: {fileID: 0}
        m_Scale: {x: 1, y: 1}
        m_Offset: {x: 0, y: 0}
    - _SpecGlossMap:
        m_Texture: {fileID: 0}
        m_Scale: {x: 1, y: 1}
        m_Offset: {x: 0, y: 0}
    m_Floats:
    - Vector1_C89A23BB: -0.1
    - _AlphaClip: 0
    - _Blend: 0
    - _BumpScale: 1
    - _Cull: 2
    - _Cutoff: 0.5
    - _DstBlend: 0
    - _EnvironmentReflections: 1
    - _Foam_Amount: 0
    - _Foam_Hide_Scale: 70
    - _Foam_Scale: 50
    - _Foam_Speed: 50
    - _Foam_Step: 0.03
    - _Foam_Wave: 0.15
    - _Fresnel_Effect: 0.75
    - _Fresnel_Top_Effect: 3
    - _GlossMapScale: 0
    - _Glossiness: 0
    - _GlossyReflections: 0
    - _Light_Cut_Max: 1
    - _Light_Cut_Min: -0.5
    - _Light_Effect: 0.4
    - _Metallic: 0
    - _OcclusionStrength: 1
    - _Overlap: 0
    - _Overlap_Max: 1
    - _Overlap_Min: 1
    - _QueueOffset: 0
    - _ReceiveShadows: 1
    - _Shadow_Effect: 0.2
    - _Smoothness: 0.5
    - _SmoothnessTextureChannel: 0
    - _SpecularHighlights: 1
    - _SrcBlend: 1
    - _Surface: 0
    - _Use_Overlap_Color: 1
    - _Wave_Angular_Frequency: 0
    - _Wave_Foam: 0.07
    - _Wave_Frequency: 15
    - _Wave_Height: 0
    - _Wave_Linear_Frequency: 1
    - _Wave_Sharpness: 4
    - _Wave_Speed: 0.2
    - _Wave_Tangent_Angular_Frequency: 4
    - _Wave_Tangent_Frequency: 0.03
    - _WorkflowMode: 1
    - _ZWrite: 1
    m_Colors:
    - Color_B44194DD: {r: 0.5019608, g: 0.93333334, b: 0.47058824, a: 0}
    - Vector3_83BFA821: {r: 0, g: 0, b: 1, a: 0}
    - _BaseColor: {r: 1, g: 1, b: 1, a: 1}
    - _Color: {r: 1, g: 0.95686275, b: 0.60784316, a: 1}
    - _EmissionColor: {r: 0, g: 0, b: 0, a: 1}
    - _Foam_Color: {r: 1, g: 1, b: 1, a: 1}
    - _Foam_Direction: {r: 1, g: 1, b: 0, a: 0}
    - _Frenel_Color: {r: 1, g: 1, b: 1, a: 0}
    - _Overlap_Color: {r: 0.25490198, g: 0.227451, b: 0.29803923, a: 0}
    - _SpecColor: {r: 0.2, g: 0.2, b: 0.2, a: 1}
  m_BuildTextureStacks: []
