%YAML 1.1
%TAG !u! tag:unity3d.com,2011:
--- !u!1045 &1
EditorBuildSettings:
  m_ObjectHideFlags: 0
  serializedVersion: 2
  m_Scenes:
  - enabled: 1
    path: Assets/_misc/StartScreen.unity
    guid: f7292d97301b7514d92998511cf95879
  - enabled: 1
    path: Assets/_misc/HeavenScreen.unity
    guid: a67e0d7d7be800b48a8e5eb43b57de3f
  m_configObjects: {}
