^E:\FORM1\FORM1\FORM1.RESX
C:\WINDOWS\ASSEMBLY\PUBPOL30.DAT
^E:\FORM1\FORM1\FORM2.RESX
^E:\FORM1\FORM1\FORM3.RESX
^E:\FORM1\FORM1\PROPERTIES\RESOURCES.RESX
E:\FORM1\FORM1\RESOURCES\ывывы.PNG
^G:\FORM1\FORM1\FORM1.RESX
C:\WINDOWS\ASSEMBLY\PUBPOL30.DAT
C:\WINDOWS\MICROSOFT.NET\ASSEMBLY\GAC_MSIL\MICROSOFT.BUILD.TASKS.V4.0\V4.0_4.0.0.0__B03F5F7F11D50A3A\MICROSOFT.BUILD.TASKS.V4.0.DLL
^G:\FORM1\FORM1\FORM2.RESX
^G:\FORM1\FORM1\FORM3.RESX
^G:\FORM1\FORM1\PROPERTIES\RESOURCES.RESX
G:\FORM1\FORM1\RESOURCES\ывывы.PNG
