^D:\SERRVER\SERRVER\DEBUG\SERRVER.EXE.INTERMEDIATE.MANIFEST
D:\SERRVER\SERRVER\DEBUG\SERRVER.EXE.EMBED.MANIFEST
^C:\USERS\OKSAA\ONEDRIVE\РАБОЧИЙ СТОЛ\SERRVER\SERRVER\DEBUG\SERRVER.EXE.INTERMEDIATE.MANIFEST
C:\USERS\OKSAA\ONEDRIVE\Рабочий стол\SERRVER\SERRVER\DEBUG\SERRVER.EXE.EMBED.MANIFEST
^E:\SERRVER\SERRVER\DEBUG\SERRVER.EXE.INTERMEDIATE.MANIFEST
E:\SERRVER\SERRVER\DEBUG\SERRVER.EXE.EMBED.MANIFEST
^F:\SERRVER\SERRVER\DEBUG\SERRVER.EXE.INTERMEDIATE.MANIFEST
F:\SERRVER\SERRVER\DEBUG\SERRVER.EXE.EMBED.MANIFEST
