<?xml version="1.0" encoding="utf-8"?>
<!-- Generator: Adobe Illustrator 21.1.0, SVG Export Plug-In . SVG Version: 6.00 Build 0)  -->
<svg version="1.0" id="Layer_1" xmlns="http://www.w3.org/2000/svg" xmlns:xlink="http://www.w3.org/1999/xlink" x="0px" y="0px"
	 viewBox="0 0 480.034 442.287" enable-background="new 0 0 480.034 442.287" xml:space="preserve">
<circle fill="#45589D" cx="243.052" cy="221.143" r="221.143"/>
<path fill="#F11D34" d="M391.324,320.687h84.416c2.371,0,4.293,2.403,4.293,5.367l0,0c0,2.964-1.922,5.367-4.293,5.367H4.293
	c-2.371,0-4.293-2.403-4.293-5.367l0,0c0-2.964,1.922-5.367,4.293-5.367H200.8"/>
<line fill="#070606" x1="217.291" y1="329.152" x2="386.878" y2="327.23"/>
<rect x="62.233" y="353.681" fill="none" width="364.529" height="95.007"/>
<text transform="matrix(1 0 0 1 149.7433 374.6811)" fill="#FFFFFF" font-family="'Barlow-SemiBold'" font-size="30px" letter-spacing="1">je m’investis!</text>
<path fill="#FFFFFF" d="M180.325,325.377C101.458,193.788,87.154,117.54,87.154,117.54l208.661-93.057
	c55.69,158.717,141.431,266.631,141.431,266.631l-53.704,34.854"/>
<g>
	<path fill="#45589D" d="M189.073,115.712h6.667v31.72c0,0.952,0.194,1.658,0.582,2.116s1.129,0.688,2.222,0.688
		c0.441,0,0.785-0.018,1.032-0.053v5.9c-1.093,0.3-2.055,0.45-2.884,0.45c-2.452,0-4.334-0.657-5.648-1.971
		c-1.314-1.314-1.971-3.188-1.971-5.622V115.712z"/>
	<path fill="#45589D" d="M203.161,138c0.626-1.649,1.503-3.095,2.632-4.339c1.129-1.243,2.535-2.231,4.22-2.963
		c1.685-0.732,3.523-1.098,5.516-1.098c2.469,0,4.7,0.617,6.693,1.852c1.993,1.235,3.536,2.87,4.63,4.907
		c1.093,2.037,1.64,4.264,1.64,6.68c0,0.759-0.053,1.464-0.159,2.116h-19.63c0.388,1.622,1.212,2.919,2.474,3.889
		c1.261,0.97,2.826,1.455,4.696,1.455c1.235,0,2.416-0.238,3.545-0.714s2.055-1.19,2.778-2.143l4.55,3.624
		c-1.164,1.64-2.707,2.928-4.63,3.862c-1.923,0.934-3.986,1.402-6.191,1.402c-2.54,0-4.859-0.582-6.958-1.746
		s-3.748-2.769-4.947-4.815c-1.199-2.046-1.799-4.304-1.799-6.773C202.222,141.382,202.534,139.649,203.161,138z M221.772,140.262
		c-0.194-1.305-0.891-2.399-2.09-3.28c-1.199-0.882-2.601-1.323-4.206-1.323c-1.534,0-2.884,0.419-4.048,1.257
		c-1.164,0.838-1.993,1.953-2.487,3.347H221.772z"/>
	<path fill="#45589D" d="M155.495,220.938c1.466,0,2.728-0.098,3.79-0.292c1.062-0.194,1.996-0.471,2.803-0.83
		c0.807-0.359,1.472-0.883,1.996-1.57c0.524-0.687,0.95-1.405,1.278-2.153c0.329-0.748,0.575-1.749,0.74-3.005
		c0.165-1.256,0.277-2.504,0.336-3.745c0.059-1.241,0.09-2.803,0.09-4.687v-61.183h12.021v60.196c0,5.114-0.194,9.12-0.583,12.021
		s-1.301,5.503-2.736,7.805c-1.705,2.781-4.127,4.889-7.267,6.325c-3.14,1.435-7.326,2.153-12.56,2.153h-0.538v-11.034H155.495z"/>
	<path fill="#45589D" d="M195.394,173.66c4.5-4.426,9.966-6.639,16.395-6.639c4.247,0,8.156,1.009,11.73,3.028
		c3.574,2.018,6.384,4.777,8.433,8.276c2.049,3.499,3.073,7.326,3.073,11.483c0,4.127-1.024,7.947-3.073,11.461
		c-2.049,3.513-4.859,6.294-8.433,8.343c-3.574,2.049-7.483,3.073-11.73,3.073c-4.216,0-8.104-1.024-11.662-3.073
		c-3.558-2.049-6.362-4.83-8.41-8.343c-2.049-3.513-3.073-7.334-3.073-11.461C188.643,183.469,190.894,178.086,195.394,173.66z
		 M203.288,198.263c2.377,2.377,5.211,3.566,8.5,3.566c3.35,0,6.205-1.189,8.567-3.566s3.544-5.195,3.544-8.455
		c0-3.23-1.181-6.033-3.544-8.41s-5.218-3.566-8.567-3.566c-3.289,0-6.123,1.189-8.5,3.566s-3.566,5.181-3.566,8.41
		C199.722,193.068,200.911,195.886,203.288,198.263z"/>
	<path fill="#45589D" d="M244.174,167.829h11.304v22.607c0,4.007,0.62,6.908,1.862,8.702c1.241,1.794,3.686,2.691,7.334,2.691
		s6.092-0.897,7.334-2.691c1.241-1.794,1.861-4.695,1.861-8.702v-22.607h11.304v25.657c0,6.579-1.802,11.424-5.405,14.533
		c-3.603,3.11-8.635,4.665-15.094,4.665c-6.459,0-11.491-1.555-15.094-4.665c-3.603-3.11-5.405-7.954-5.405-14.533V167.829z"/>
	<path fill="#45589D" d="M298,167.829h11.304v3.23c2.094-1.555,4.343-2.616,6.751-3.185c2.408-0.569,5.749-0.852,10.025-0.852v10.81
		c-2.84,0-5.271,0.165-7.289,0.493c-2.018,0.329-3.641,0.785-4.867,1.368c-1.226,0.583-2.183,1.383-2.871,2.4
		c-0.687,1.017-1.152,2.086-1.391,3.207c-0.239,1.121-0.359,2.489-0.359,4.104v22.069H298V167.829z"/>
	<path fill="#45589D" d="M168.427,239.224c2.916-2.868,6.458-4.302,10.624-4.302c3.023,0,5.639,0.872,7.848,2.616v-17.876h7.326
		v44.064h-7.326v-1.831c-2.151,1.744-4.767,2.616-7.848,2.616c-2.732,0-5.252-0.663-7.557-1.991c-2.306-1.328-4.122-3.13-5.45-5.406
		c-1.328-2.277-1.991-4.752-1.991-7.426C164.053,245.58,165.511,242.092,168.427,239.224z M173.543,255.167
		c1.541,1.541,3.377,2.311,5.508,2.311c2.171,0,4.021-0.77,5.552-2.311c1.531-1.54,2.296-3.367,2.296-5.479
		c0-2.093-0.765-3.909-2.296-5.45c-1.531-1.54-3.381-2.311-5.552-2.311c-2.131,0-3.968,0.77-5.508,2.311
		c-1.541,1.541-2.311,3.357-2.311,5.45C171.232,251.8,172.003,253.626,173.543,255.167z"/>
	<path fill="#45589D" d="M202.537,235.446h7.325v14.649c0,2.596,0.402,4.476,1.205,5.639c0.805,1.163,2.389,1.744,4.753,1.744
		c2.363,0,3.948-0.581,4.751-1.744c0.805-1.163,1.207-3.043,1.207-5.639v-14.649h7.325v16.626c0,4.263-1.168,7.402-3.503,9.417
		c-2.334,2.015-5.594,3.023-9.78,3.023s-7.446-1.008-9.782-3.023c-2.334-2.015-3.502-5.154-3.502-9.417V235.446z"/>
	<path fill="#45589D" d="M244.053,218.553l15.378,41.218l15.344-41.218h10.287l-20.714,52.865h-9.799l-20.784-52.865H244.053z"/>
	<path fill="#45589D" d="M290.658,242.022c3.499-3.441,7.748-5.161,12.747-5.161c3.301,0,6.34,0.785,9.118,2.354
		c2.779,1.569,4.964,3.714,6.556,6.434c1.594,2.72,2.39,5.695,2.39,8.927c0,3.208-0.796,6.178-2.39,8.91
		c-1.592,2.731-3.776,4.893-6.556,6.486c-2.777,1.593-5.817,2.389-9.118,2.389c-3.278,0-6.302-0.796-9.067-2.389
		c-2.767-1.593-4.946-3.755-6.539-6.486c-1.592-2.731-2.388-5.702-2.388-8.91C285.411,249.648,287.16,245.463,290.658,242.022z
		 M296.795,261.149c1.848,1.848,4.051,2.772,6.609,2.772c2.603,0,4.823-0.924,6.66-2.772c1.836-1.848,2.755-4.039,2.755-6.573
		c0-2.511-0.919-4.69-2.755-6.538c-1.838-1.848-4.057-2.772-6.66-2.772c-2.558,0-4.761,0.924-6.609,2.772
		c-1.848,1.848-2.771,4.028-2.771,6.538C294.024,257.11,294.947,259.301,296.795,261.149z"/>
	<path fill="#45589D" d="M324.676,237.489h5.37v-11.508h8.753v11.508h9.032v8.439h-9.032v13.565c0,3.045,1.266,4.568,3.801,4.568
		c0.65,0,1.331-0.029,2.039-0.087c0.71-0.058,1.262-0.111,1.657-0.157l0.593-0.105v7.776c-1.721,0.582-3.988,0.872-6.8,0.872
		c-3.233,0-5.713-0.988-7.446-2.964c-1.731-1.976-2.597-4.662-2.597-8.055v-15.413h-5.37V237.489z"/>
	<path fill="#45589D" d="M354.02,247.933c0.827-2.173,1.982-4.08,3.471-5.719c1.487-1.639,3.342-2.941,5.561-3.906
		c2.222-0.965,4.644-1.447,7.272-1.447c3.253,0,6.195,0.813,8.823,2.441c2.626,1.628,4.66,3.784,6.103,6.469
		c1.44,2.685,2.162,5.62,2.162,8.805c0,1-0.07,1.929-0.209,2.79h-25.875c0.511,2.138,1.598,3.847,3.259,5.126
		c1.664,1.279,3.725,1.918,6.191,1.918c1.627,0,3.184-0.314,4.673-0.942c1.487-0.628,2.708-1.569,3.662-2.825l5.998,4.777
		c-1.534,2.162-3.569,3.859-6.103,5.091c-2.535,1.232-5.255,1.848-8.16,1.848c-3.348,0-6.406-0.767-9.171-2.302
		c-2.767-1.534-4.942-3.65-6.521-6.347c-1.582-2.696-2.371-5.673-2.371-8.927C352.783,252.39,353.195,250.106,354.02,247.933z
		 M378.553,250.914c-0.256-1.72-1.175-3.162-2.755-4.324c-1.582-1.162-3.43-1.744-5.545-1.744c-2.023,0-3.801,0.552-5.335,1.656
		c-1.534,1.105-2.628,2.574-3.278,4.411H378.553z"/>
</g>
</svg>
