module bitbucket.org/_metalogic_/events-svc

go 1.18

require (
	bitbucket.org/_metalogic_/build v1.0.2
	bitbucket.org/_metalogic_/config v1.4.0
	bitbucket.org/_metalogic_/glib v0.9.7
	bitbucket.org/_metalogic_/httptreemux-swagger v1.1.0
	bitbucket.org/_metalogic_/log v1.4.1
	github.com/denisenkom/go-mssqldb v0.10.0
	github.com/dimfeld/httptreemux/v5 v5.2.2
	github.com/nats-io/nats.go v1.10.0
	github.com/swaggo/swag v1.8.0
)

require (
	bitbucket.org/_metalogic_/color v1.0.4 // indirect
	bitbucket.org/_metalogic_/colorable v1.0.3 // indirect
	bitbucket.org/_metalogic_/isatty v1.0.4 // indirect
	github.com/KyleBanks/depth v1.2.1 // indirect
	github.com/PuerkitoBio/purell v1.1.1 // indirect
	github.com/PuerkitoBio/urlesc v0.0.0-20170810143723-de5bf2ad4578 // indirect
	github.com/go-openapi/jsonpointer v0.19.5 // indirect
	github.com/go-openapi/jsonreference v0.19.6 // indirect
	github.com/go-openapi/spec v0.20.4 // indirect
	github.com/go-openapi/swag v0.19.15 // indirect
	github.com/golang-sql/civil v0.0.0-20190719163853-cb61b32ac6fe // indirect
	github.com/golang/protobuf v1.4.3 // indirect
	github.com/josharian/intern v1.0.0 // indirect
	github.com/mailru/easyjson v0.7.6 // indirect
	github.com/nats-io/jwt v1.1.0 // indirect
	github.com/nats-io/nats-server/v2 v2.1.9 // indirect
	github.com/nats-io/nkeys v0.1.4 // indirect
	github.com/nats-io/nuid v1.0.1 // indirect
	github.com/swaggo/files v0.0.0-20210815190702-a29dd2bc99b2 // indirect
	golang.org/x/crypto v0.0.0-20201016220609-9e8e0b390897 // indirect
	golang.org/x/net v0.0.0-20210813160813-60bc85c4be6d // indirect
	golang.org/x/sys v0.0.0-20210809222454-d867a43fc93e // indirect
	golang.org/x/text v0.3.7 // indirect
	golang.org/x/tools v0.1.7 // indirect
	google.golang.org/protobuf v1.25.0 // indirect
	gopkg.in/yaml.v2 v2.4.0 // indirect
)
