module bitbucket.org/_metalogic_/expr

go 1.12

require (
	github.com/antlr/antlr4 v0.0.0-20191011202612-ad2bd05285ca
	github.com/gdamore/tcell v1.1.2
	github.com/rivo/tview v0.0.0-20190515161233-bd836ef13b4b
	github.com/sanity-io/litter v1.1.0
	github.com/stretchr/testify v1.3.0
	golang.org/x/text v0.3.2
)
