module bitbucket.org/_metalogic_/frisby

go 1.14

require (
	bitbucket.org/_metalogic_/request v1.0.0
	github.com/bitly/go-simplejson v0.5.0
	golang.org/x/net v0.0.0-20200202094626-16171245cfb2 // indirect
)
