module bitbucket.org/_metalogic_/glib

go 1.23

require (
	bitbucket.org/_metalogic_/build v1.0.2
	bitbucket.org/_metalogic_/password v1.0.0
	github.com/denisenkom/go-mssqldb v0.12.2
	github.com/lib/pq v1.10.6
	golang.org/x/crypto v0.0.0-20201016220609-9e8e0b390897
)

require (
	github.com/golang-sql/civil v0.0.0-20190719163853-cb61b32ac6fe // indirect
	github.com/golang-sql/sqlexp v0.1.0 // indirect
)
