module bitbucket.org/_metalogic_/static

go 1.12

require (
	github.com/yuin/goldmark v1.1.25
	github.com/yuin/goldmark-highlighting v0.0.0-20200307114337-60d527fdb691
	github.com/yuin/goldmark-meta v0.0.0-20191126180153-f0638e958b60
	gopkg.in/yaml.v2 v2.2.8
)
