ABC,1,Separator
ABC,2,Orientation Of Process Connection
ABC,3,Separator
ABC,4,Center To Center Distance
ABC,5,Separator
ABC,6,Flanged Connection
ABC,6,Screwed Connection
ABC,7,Separator
ABC,24,End
TULG,1,Separator
TULG,2,Orientation Of Process Connection
TULG,3,Seperator
TULG,4,Flanged Connections
TULG,5,Separator
TULG,6,End
