TLG,1,Separator
TLG,2,Orientation Of Process Connection
TLG,3,Separator
TLG,4,Center To Center Distance
TLG,5,Separator
TLG,6,Flanged Connection
TLG,6,Screwed Connection
TLG,7,Separator
TLG,8,MOC Of Liquid Chamber
TLG,9,MOC Of Cover Plate
TLG,10,Fastener
TLG,11,Separator
TLG,12,Toughened Borosilicate Glass
TLG,13,Cushion
TLG,14,Gasket
TLG,15,Separator
TLG,16,Isolation Valve
TLG,17,Vent
TLG,18,Drain
TLG,19,Separator
TLG,20,Calibrated Scale
TLG,21,Separator
TLG,22,Special Features
TLG,23,Separator
TLG,24,End
