{
  "streams": [
    {
      "id": 1,
      "title": "Hello World",
      "description": "Greetings Martians",
      "userId": "104851314699965724473"
    },
    {
      "id": 2,
      "title": "Hello World Again",
      "description": "Greetings Martians ...",
      "userId": ""
    },
    {
      "title": "Naresh Khalasi",
      "description": "Vayana Network",
      "userId": "104851314699965724473",
      "id": 3
    },
    {
      "title": "New Movie",
      "description": "Some Set in Mumbai",
      "userId": "104851314699965724473",
      "id": 4
    }
  ]
}