8 4 7 246 9 245 9 144 0 0
8 5 7 247 9 241 9 147 0 0
8 6 7 247 9 242 9 145 0 0
8 4 7 246 9 244 9 145 0 0
8 4 7 246 9 243 9 145 0 0
8 5 7 247 9 245 9 148 0 0
8 8 7 247 9 240 9 146 0 0
8 4 7 247 9 241 9 145 0 0
8 7 7 247 9 250 9 144 0 0
8 7 7 247 9 243 9 145 0 0
8 5 7 247 9 242 9 147 0 0
8 5 7 247 9 246 9 147 0 0
8 8 7 247 9 239 9 145 0 0
8 4 7 247 9 243 9 145 0 0
8 9 7 247 9 243 9 144 0 0
8 7 7 247 9 240 9 145 0 0
8 8 7 248 9 243 9 147 0 0
8 10 7 247 9 240 9 144 0 0
8 11 7 247 9 241 9 143 0 0
8 6 7 248 9 250 9 143 0 0
8 4 7 247 9 245 9 143 0 0
8 6 7 248 9 243 9 146 0 0
8 9 7 247 9 245 9 145 0 0
8 8 7 248 9 240 9 149 0 0
8 5 7 247 9 237 9 146 0 0
7 251 7 248 9 241 9 143 0 0
7 252 7 253 9 246 9 245 0 0
7 244 7 253 9 231 9 255 0 0
7 238 7 253 9 217 10 2 0 0
7 218 7 252 9 211 10 2 0 0
8 17 7 248 9 253 9 149 0 0
8 31 7 248 9 249 9 151 0 0
8 45 7 248 9 250 9 152 0 0
8 51 7 249 9 253 9 155 0 0
7 243 7 246 9 233 9 144 0 0
8 2 7 246 9 241 9 143 0 0
8 27 7 247 9 247 9 143 0 0
8 20 7 247 9 234 9 142 0 0
7 230 7 246 9 248 9 165 0 0
7 255 7 246 10 2 9 166 0 0
8 5 7 246 10 13 9 163 0 0
7 207 7 245 9 225 9 160 0 0
7 232 7 243 9 217 9 146 0 0
7 234 7 243 9 245 9 146 0 0
7 207 7 243 9 223 9 143 0 0
7 123 7 239 9 185 9 124 0 0
7 189 7 238 10 30 9 104 0 0
7 194 7 238 10 11 9 99 0 0
7 213 7 238 9 247 9 93 0 0
7 62 7 230 9 237 9 190 0 0
7 83 7 229 9 249 9 176 0 0
7 102 7 229 10 8 9 159 0 0
7 47 7 228 9 220 9 141 0 0
7 228 7 219 9 217 8 251 0 0
8 44 7 219 10 21 9 3 0 0
7 199 7 219 9 205 9 4 0 0
7 254 7 219 10 29 9 22 0 0
7 247 7 219 10 11 9 24 0 0
7 210 7 219 9 203 9 28 0 0
8 58 7 223 10 111 9 57 0 0
8 100 7 223 9 198 9 61 0 0
8 27 7 224 9 191 9 64 0 0
8 15 7 229 9 212 9 163 0 0
8 11 7 229 9 176 9 162 0 0
8 26 7 229 10 37 9 143 0 0
8 55 7 230 9 185 9 133 0 0
8 16 7 233 10 86 9 142 0 0
8 11 7 233 9 234 9 142 0 0
7 156 7 232 9 245 9 136 0 0
7 203 7 232 9 207 9 124 0 0
8 28 7 232 10 5 9 114 0 0
8 63 7 237 10 101 9 145 0 0
8 32 7 238 9 240 9 144 0 0
8 67 7 238 9 185 9 143 0 0
8 20 7 238 9 232 9 137 0 0
7 249 7 239 10 28 9 118 0 0
8 49 7 239 10 4 9 116 0 0
7 223 7 239 9 217 9 120 0 0
7 210 7 239 9 222 9 120 0 0
7 206 7 231 10 7 9 50 0 0
7 233 7 230 9 189 9 46 0 0
7 215 7 230 9 206 9 32 0 0
7 254 7 231 9 236 9 34 0 0
8 66 7 233 9 209 9 81 0 0
8 22 7 232 10 128 9 92 0 0
7 188 7 232 9 206 9 73 0 0
7 178 7 228 9 245 9 3 0 0
8 100 7 228 10 11 9 25 0 0
7 224 7 229 10 119 9 10 0 0
8 123 7 229 10 12 9 2 0 0
8 65 7 231 9 219 8 222 0 0
8 92 7 231 10 67 9 1 0 0
8 84 7 234 9 235 9 4 0 0
8 16 7 234 10 9 8 254 0 0
8 27 7 238 9 244 9 38 0 0
7 246 7 238 9 210 9 43 0 0
8 30 7 238 9 241 9 48 0 0
7 218 7 238 9 224 9 57 0 0
8 4 7 244 9 236 9 75 0 0
8 21 7 244 9 240 9 78 0 0
8 150 7 245 10 111 9 76 0 0
8 116 7 245 9 204 9 79 0 0
8 47 7 249 10 43 9 110 0 0
8 106 7 249 10 47 9 89 0 0
8 68 7 254 9 250 9 83 0 0
8 133 7 254 9 247 9 78 0 0
8 70 8 6 9 212 9 118 0 0
8 181 8 7 10 9 9 140 0 0
8 56 8 15 9 199 9 150 0 0
8 106 8 15 9 251 9 141 0 0
8 90 8 25 9 232 9 143 0 0
8 151 8 26 10 13 9 150 0 0
8 76 8 27 10 62 9 159 0 0
8 110 8 35 9 236 9 175 0 0
8 108 8 35 9 235 9 171 0 0
8 98 8 40 9 235 9 175 0 0
8 79 8 41 9 242 9 175 0 0
8 90 8 40 10 1 9 162 0 0
8 79 8 41 9 254 9 159 0 0
8 67 8 41 9 254 9 160 0 0
8 64 8 41 9 255 9 159 0 0
8 23 8 42 9 244 9 149 0 0
8 30 8 41 9 245 9 150 0 0
8 28 8 41 9 240 9 149 0 0
8 29 8 41 9 247 9 150 0 0
8 22 8 37 9 244 9 149 0 0
8 21 8 37 9 244 9 149 0 0
8 21 8 37 9 246 9 148 0 0
8 22 8 37 9 244 9 148 0 0
8 25 8 37 9 245 9 148 0 0
8 25 8 34 9 242 9 149 0 0
8 26 8 33 9 243 9 150 0 0
8 23 8 33 9 246 9 149 0 0
8 24 8 34 9 243 9 150 0 0
8 21 8 34 9 238 9 149 0 0
8 25 8 30 9 249 9 136 0 0
8 28 8 30 9 243 9 135 0 0
8 30 8 30 9 242 9 133 0 0
8 27 8 28 9 247 9 149 0 0
8 28 8 28 9 245 9 149 0 0
8 25 8 28 9 239 9 150 0 0
8 25 8 28 9 240 9 150 0 0
8 27 8 26 9 244 9 147 0 0
8 25 8 26 9 242 9 145 0 0
8 29 8 26 9 242 9 147 0 0
8 26 8 26 9 243 9 148 0 0
8 24 8 24 9 251 9 137 0 0
8 24 8 24 9 245 9 138 0 0
8 28 8 24 9 248 9 139 0 0
8 29 8 22 9 248 9 146 0 0
8 29 8 22 9 242 9 147 0 0
8 25 8 22 9 248 9 146 0 0
8 28 8 22 9 244 9 147 0 0
8 26 8 20 9 244 9 146 0 0
8 26 8 21 9 240 9 134 0 0
8 25 8 20 9 241 9 134 0 0
8 28 8 21 9 247 9 134 0 0
8 25 8 21 9 245 9 135 0 0
8 25 8 19 9 247 9 151 0 0
8 24 8 19 9 244 9 150 0 0
8 27 8 19 9 244 9 150 0 0
8 25 8 19 9 242 9 150 0 0
8 35 8 18 9 241 9 149 0 0
8 26 8 18 9 241 9 148 0 0
8 42 8 18 10 15 9 146 0 0
8 38 8 18 9 255 9 149 0 0
8 15 8 13 9 246 9 131 0 0
8 15 8 13 9 254 9 133 0 0
8 19 8 13 10 0 9 135 0 0
8 21 8 13 9 251 9 138 0 0
8 29 8 13 9 241 9 143 0 0
8 30 8 13 9 240 9 142 0 0
8 34 8 12 9 235 9 138 0 0
8 34 8 13 9 236 9 140 0 0
8 28 8 13 9 233 9 138 0 0
8 28 8 13 9 239 9 132 0 0
8 29 8 13 9 234 9 132 0 0
8 22 8 13 9 233 9 132 0 0
8 28 8 13 9 236 9 132 0 0
8 27 8 14 9 241 9 132 0 0
8 22 8 13 9 246 9 126 0 0
8 24 8 13 9 250 9 127 0 0
8 28 8 14 9 246 9 129 0 0
8 37 8 13 9 240 9 130 0 0
8 37 8 15 9 253 9 131 0 0
8 42 8 15 9 247 9 131 0 0
8 49 8 15 9 240 9 133 0 0
8 75 8 16 9 234 9 98 0 0
8 71 8 16 9 238 9 99 0 0
8 62 8 16 9 235 9 98 0 0
8 59 8 16 9 239 9 98 0 0
8 21 8 16 9 246 9 73 0 0
8 29 8 16 9 255 9 74 0 0
8 27 8 16 9 232 9 76 0 0
8 5 8 16 9 240 9 77 0 0
8 52 8 16 9 244 9 49 0 0
8 50 8 16 9 249 9 52 0 0
8 41 8 16 9 255 9 57 0 0
8 41 8 16 9 235 9 58 0 0
8 42 8 16 9 241 9 58 0 0
8 17 8 16 9 254 9 53 0 0
8 35 8 16 9 228 9 50 0 0
8 59 8 16 9 235 9 49 0 0
8 54 8 16 9 232 9 52 0 0
8 40 8 16 9 236 9 57 0 0
8 104 8 19 9 251 9 56 0 0
8 104 8 19 9 235 9 60 0 0
8 86 8 19 9 255 9 64 0 0
8 75 8 19 9 250 9 69 0 0
8 218 8 29 9 221 9 54 0 0
8 203 8 29 10 4 9 65 0 0
8 235 8 30 10 54 9 79 0 0
8 225 8 31 9 255 9 98 0 0
8 44 8 37 9 215 9 245 0 0
8 80 8 37 9 246 9 250 0 0
8 47 8 36 10 4 9 249 0 0
8 65 8 36 9 221 9 247 0 0
8 53 8 41 9 213 10 26 0 0
8 39 8 40 10 46 10 26 0 0
8 111 8 41 9 239 10 21 0 0
8 94 8 41 9 167 10 19 0 0
8 106 8 44 9 186 10 35 0 0
8 92 8 44 10 20 10 55 0 0
8 73 8 44 9 237 10 59 0 0
7 243 8 43 9 231 10 52 0 0
7 222 8 43 9 174 10 37 0 0
8 38 8 43 9 228 10 16 0 0
8 19 8 45 9 232 10 42 0 0
7 123 8 44 9 183 10 34 0 0
8 37 8 49 10 47 10 11 0 0
8 93 8 49 9 161 9 247 0 0
8 113 8 52 9 210 10 37 0 0
8 207 8 53 9 247 10 42 0 0
8 82 8 53 9 213 10 45 0 0
8 124 8 53 9 214 10 50 0 0
8 1 8 55 9 224 10 66 0 0
8 33 8 55 9 223 10 66 0 0
8 84 8 55 9 227 10 78 0 0
8 121 8 56 9 199 10 78 0 0
7 195 8 48 10 14 10 18 0 0
8 53 8 48 9 198 10 15 0 0
8 100 8 48 9 175 10 15 0 0
7 251 8 48 10 53 10 21 0 0
7 141 8 39 10 55 9 225 0 0
7 158 8 38 9 214 9 207 0 0
8 36 8 38 9 242 9 182 0 0
8 179 8 38 9 213 9 194 0 0
7 245 8 35 10 11 10 14 0 0
8 83 8 35 10 29 10 1 0 0
7 252 8 34 10 72 9 253 0 0
8 3 8 29 10 63 10 12 0 0
8 68 8 28 9 187 10 10 0 0
8 14 8 28 9 216 9 250 0 0
7 185 8 20 10 16 9 252 0 0
8 5 8 20 10 45 9 248 0 0
7 232 8 20 9 188 9 245 0 0
7 205 8 19 10 6 9 231 0 0
7 253 8 19 9 229 10 30 0 0
7 211 8 19 9 238 10 35 0 0
8 26 8 14 10 17 10 61 0 0
8 8 8 15 9 198 10 61 0 0
7 147 8 13 10 22 10 61 0 0
8 87 8 9 9 247 9 242 0 0
8 97 8 9 9 208 10 3 0 0
8 71 8 9 9 170 10 23 0 0
7 251 8 9 10 43 10 34 0 0
8 24 8 10 10 45 10 27 0 0
7 160 8 6 10 53 10 50 0 0
7 233 8 6 9 196 10 26 0 0
8 26 8 5 10 9 10 37 0 0
7 194 7 255 9 219 10 46 0 0
7 164 7 255 9 214 10 53 0 0
7 168 7 254 10 17 10 47 0 0
7 177 7 254 9 242 10 36 0 0
7 73 7 245 9 206 9 253 0 0
7 103 7 245 10 44 9 244 0 0
7 236 7 245 10 22 9 245 0 0
7 198 7 234 9 225 9 184 0 0
8 11 7 234 9 204 9 186 0 0
8 52 7 234 9 239 9 190 0 0
7 253 7 234 9 230 9 191 0 0
8 9 7 235 9 184 9 197 0 0
8 43 7 235 10 30 9 202 0 0
8 64 7 235 10 19 9 219 0 0
8 14 7 235 9 252 9 238 0 0
7 88 7 226 9 240 9 248 0 0
7 196 7 227 10 117 9 66 0 0
8 76 7 226 9 246 9 45 0 0
8 58 7 227 10 36 9 37 0 0
8 85 7 227 10 24 9 39 0 0
8 101 7 228 10 103 9 52 0 0
8 21 7 232 9 205 10 3 0 0
7 204 7 232 9 194 10 10 0 0
7 155 7 231 9 249 10 7 0 0
7 54 7 231 9 226 9 251 0 0
7 244 7 231 10 75 9 250 0 0
8 53 7 231 9 204 9 244 0 0
8 36 7 231 9 204 9 244 0 0
7 228 7 212 10 3 9 74 0 0
7 221 7 212 9 249 9 80 0 0
7 233 7 212 10 8 9 79 0 0
7 235 7 212 9 247 9 74 0 0
8 3 7 216 9 255 9 212 0 0
8 7 7 216 9 250 9 209 0 0
8 5 7 216 9 255 9 211 0 0
8 6 7 217 9 255 9 211 0 0
8 53 7 222 9 212 9 151 0 0
8 56 7 222 9 219 9 148 0 0
8 42 7 223 9 205 9 147 0 0
8 37 7 223 9 234 9 147 0 0
8 38 7 223 9 240 9 148 0 0
8 6 7 228 9 236 9 147 0 0
8 4 7 228 9 242 9 145 0 0
8 5 7 228 9 238 9 145 0 0
8 6 7 228 9 243 9 144 0 0
8 7 7 228 9 237 9 146 0 0
8 8 7 231 9 241 9 145 0 0
8 8 7 231 9 245 9 146 0 0
8 9 7 231 9 241 9 147 0 0
8 12 7 231 9 244 9 147 0 0
8 8 7 233 9 238 9 146 0 0
8 9 7 233 9 242 9 147 0 0
8 5 7 233 9 244 9 147 0 0
8 10 7 234 9 244 9 145 0 0
8 8 7 236 9 247 9 146 0 0
8 7 7 236 9 247 9 147 0 0
8 10 7 236 9 243 9 146 0 0
8 11 7 236 9 244 9 146 0 0
8 11 7 237 9 236 9 146 0 0
8 10 7 238 9 241 9 145 0 0
8 8 7 238 9 238 9 144 0 0
8 9 7 238 9 241 9 143 0 0
8 5 7 239 9 244 9 144 0 0
8 9 7 239 9 242 9 145 0 0
8 9 7 239 9 240 9 143 0 0
8 11 7 240 9 240 9 144 0 0
8 6 7 240 9 244 9 146 0 0
8 11 7 239 9 239 9 146 0 0
8 11 7 241 9 241 9 146 0 0
8 8 7 241 9 246 9 147 0 0
8 9 7 242 9 245 9 151 0 0
8 10 7 247 9 242 9 149 0 0
8 8 7 247 9 238 9 151 0 0
8 8 7 247 9 242 9 152 0 0
8 9 7 247 9 250 9 150 0 0
8 9 7 247 9 243 9 153 0 0
8 8 7 247 9 242 9 152 0 0
8 7 7 247 9 245 9 152 0 0
8 8 7 247 9 246 9 151 0 0
8 9 7 248 9 244 9 152 0 0
8 7 7 248 9 244 9 151 0 0
8 10 7 248 9 245 9 152 0 0
8 9 7 248 9 246 9 150 0 0
8 8 7 248 9 239 9 150 0 0
8 8 7 248 9 241 9 152 0 0
8 10 7 248 9 240 9 153 0 0
8 7 7 248 9 248 9 153 0 0
8 11 7 248 9 243 9 153 0 0
8 8 7 248 9 241 9 152 0 0
8 8 7 248 9 242 9 151 0 0
8 8 7 248 9 239 9 150 0 0
8 11 7 249 9 241 9 152 0 0
8 9 7 249 9 238 9 153 0 0
8 13 7 249 9 245 9 152 0 0
8 6 7 249 9 240 9 151 0 0
8 8 7 249 9 243 9 150 0 0
8 8 7 249 9 237 9 151 0 0
8 7 7 249 9 243 9 151 0 0
8 7 7 249 9 242 9 151 0 0
8 11 7 249 9 248 9 152 0 0
8 9 7 249 9 241 9 150 0 0
8 12 7 249 9 238 9 150 0 0
8 6 7 250 9 244 9 151 0 0
8 9 7 249 9 242 9 151 0 0
8 13 7 250 9 244 9 152 0 0
8 10 7 249 9 249 9 152 0 0
8 9 7 250 9 244 9 152 0 0
8 12 7 249 9 242 9 151 0 0
8 10 7 249 9 241 9 151 0 0
8 8 7 249 9 239 9 151 0 0
8 8 7 250 9 243 9 153 0 0
8 8 7 250 9 243 9 154 0 0
8 7 7 250 9 237 9 152 0 0
8 9 7 250 9 240 9 150 0 0
8 8 7 250 9 243 9 149 0 0
8 10 7 250 9 240 9 147 0 0
8 5 7 250 9 245 9 150 0 0
8 7 7 250 9 242 9 153 0 0
8 8 7 250 9 242 9 152 0 0
8 6 7 250 9 243 9 152 0 0
8 5 7 250 9 244 9 152 0 0
8 8 7 245 9 239 9 145 0 0
8 10 7 245 9 243 9 146 0 0
8 8 7 245 9 241 9 147 0 0
8 11 7 245 9 243 9 145 0 0
8 9 7 246 9 240 9 146 0 0
8 10 7 245 9 244 9 146 0 0
8 9 7 246 9 241 9 146 0 0
8 7 7 246 9 243 9 148 0 0
8 8 7 246 9 243 9 147 0 0
8 8 7 247 9 246 9 147 0 0
8 6 7 246 9 240 9 145 0 0
8 8 7 246 9 243 9 145 0 0
8 5 7 247 9 244 9 145 0 0
8 8 7 247 9 240 9 145 0 0
8 9 7 247 9 245 9 146 0 0
8 8 7 248 9 243 9 147 0 0
8 9 7 248 9 242 9 146 0 0
8 5 7 248 9 247 9 147 0 0
8 9 7 248 9 242 9 146 0 0
8 7 7 248 9 246 9 148 0 0
8 11 7 248 9 243 9 147 0 0
8 8 7 248 9 243 9 147 0 0
8 8 7 248 9 236 9 146 0 0
8 10 7 248 9 242 9 145 0 0
8 9 7 249 9 243 9 147 0 0
8 8 7 249 9 239 9 147 0 0
8 9 7 249 9 242 9 145 0 0
8 8 7 249 9 236 9 145 0 0
8 5 7 249 9 240 9 145 0 0
8 8 7 249 9 244 9 144 0 0
8 8 7 249 9 247 9 145 0 0
8 8 7 249 9 241 9 145 0 0
8 6 7 249 9 244 9 148 0 0
8 9 7 249 9 243 9 148 0 0
8 13 7 249 9 241 9 147 0 0
8 6 7 249 9 244 9 146 0 0
8 8 7 249 9 244 9 145 0 0
8 9 7 249 9 243 9 145 0 0
8 10 7 250 9 242 9 146 0 0
8 12 7 249 9 241 9 146 0 0
8 8 7 249 9 238 9 145 0 0
8 6 7 249 9 243 9 145 0 0
8 8 7 249 9 242 9 145 0 0
8 7 7 249 9 238 9 147 0 0
8 8 7 249 9 242 9 148 0 0
8 9 7 249 9 240 9 146 0 0
8 9 7 249 9 245 9 145 0 0
8 5 7 249 9 245 9 146 0 0
8 6 7 250 9 252 9 148 0 0
8 10 7 249 9 241 9 147 0 0
8 9 7 254 9 248 9 152 0 0
8 9 7 254 9 240 9 152 0 0
8 8 7 254 9 241 9 151 0 0
8 11 7 254 9 246 9 150 0 0
8 9 7 253 9 241 9 151 0 0
8 8 7 253 9 246 9 152 0 0
8 9 7 254 9 243 9 152 0 0
8 6 7 253 9 245 9 152 0 0
8 9 7 253 9 237 9 149 0 0
8 9 7 253 9 248 9 150 0 0
8 11 7 253 9 244 9 151 0 0
8 12 7 253 9 247 9 151 0 0
8 5 7 253 9 248 9 150 0 0
8 6 7 253 9 240 9 150 0 0
8 8 7 252 9 239 9 150 0 0
8 9 7 252 9 243 9 149 0 0
8 10 7 252 9 239 9 149 0 0
8 8 7 252 9 246 9 153 0 0
8 10 7 252 9 243 9 153 0 0
8 10 7 252 9 244 9 151 0 0
8 7 7 252 9 237 9 151 0 0
8 9 7 252 9 240 9 149 0 0
8 6 7 252 9 242 9 151 0 0
8 7 7 252 9 244 9 152 0 0
8 5 7 252 9 244 9 151 0 0
8 9 7 252 9 242 9 151 0 0
8 6 7 252 9 242 9 150 0 0
8 6 7 252 9 241 9 152 0 0
8 5 7 252 9 245 9 154 0 0
8 7 7 251 9 247 9 155 0 0
8 10 7 251 9 244 9 153 0 0
8 11 7 251 9 243 9 151 0 0
8 9 7 251 9 240 9 152 0 0
8 9 7 252 9 246 9 154 0 0
8 6 7 251 9 246 9 149 0 0
8 9 7 251 9 246 9 151 0 0
8 7 7 251 9 243 9 153 0 0
8 13 7 251 9 247 9 152 0 0
8 9 7 251 9 242 9 151 0 0
8 7 7 251 9 237 9 149 0 0
8 7 7 251 9 244 9 148 0 0
8 12 7 251 9 245 9 148 0 0
8 8 7 251 9 241 9 150 0 0
8 11 7 251 9 240 9 150 0 0
8 9 7 251 9 240 9 152 0 0
8 9 7 251 9 246 9 153 0 0
8 11 7 251 9 244 9 151 0 0
8 8 7 251 9 239 9 151 0 0
8 8 7 251 9 245 9 151 0 0
8 7 7 251 9 243 9 153 0 0
8 9 7 251 9 238 9 151 0 0
8 7 7 251 9 245 9 152 0 0
8 5 7 251 9 242 9 152 0 0
8 7 7 251 9 242 9 152 0 0
8 7 7 246 9 241 9 145 0 0