:200000000A000000000000004000000000000000849A00050112000404040012608400005E
:200020005612090407C138320A001000840000000416800080120400842700480016000042
:2000400008E07F1D000780000800000A0000410064031000050DFCBE3DFFFFFF2200F008AB
:20006000040000000000022004040404000000010000C00040011011C001001140014001D3
:2000800000000000000000000000000000000000CD02003C10006000120064204D0780007B
:2000A00002000D00010A323500198002CD000000720008008D004000CD0000000000000043
:2000C0000F0080007030000F0080220000000400000000000000000000000000000000003C
:2000E0000000000009000400040400040000000100000000000000000000000000000000E6
:200100000000000000000000000000000000000000010000000000000000000000000000DE
:2001200000000000000100000000000002000D000900060003010C0005000A000000000081
:200140000000000000000F01000080000000004000000000000000000000000000000000CF
:2001600000000000400004000404000400000001000000000000000000000000000000002E
:2001800000000000000000000000000000000000000000000000000000000000000000005F
:2001A000000F0000000000000000000000000000010000000000000001000000000000002E
:2001C00000000000000000000000000000000000000000000000000000000000000000001F
:2001E000000000000000000000040000108040100200000000100000000000000000000009
:200200000000000000000000000000000000000000000000000000000000000000000000DE
:2002200000000000000000000000000080001000000000000000000000000000000000002E
:200240000000000024000041000001009002202800020808000200140040010014120020AF
:200260000000000100500000080000180000000000000800000018000002000000A2000049
:20028000000000000000000000000000000000000000000000000000000000000800421004
:2002A00010A00080000000810000000000000000000000000000000000000000000000008D
:2002C0000000004000000040004000000000000020024000000000000004405D005000000B
:2002E0008021190C0200002000000000000000000000000000000000000000000000000016
:20030000F000F1007E000000000002006200B100000000000000F0009F00000000000000DA
:2003200000000000000020000000000000000000000000000000000000000000000000009D
:200340000000000000140240000000008003280000000000000000150000000000844200C1
:200360000000000020031C08000000000080212000000000000008010000000000021480D6
:200380000000000000822008000000000200080800000000002042480000000000000000F7
:2003A000000000000040000000000000000015550000000080800000000000000000000093
:2003C00000000000000000000000000000000000000000000000000000000000000000001D
:2003E0000000000000000000000000000000000000000000000000000000000000000000FD
:20040000F000F000700000000000F000C000F000D0003000000000001000000000000000DC
:200420000000000000000000000000000000000000000000000000000000000000000000BC
:2004400000000000000000000000000000000000000000000000000000000000000000009C
:2004600000000000000000000400000000000000000008000100000000000000000000006F
:2004800000000000000000000000000000000000000000000000000000000000000000005C
:2004A0000000000000000000000000000000800000000000000000000000000000000000BC
:2004C000000008000000000000000000000000000000000000000000000000000000000014
:2004E0000000000000000000000000000000000000000000000000000000000000000000FC
:200500000000000000000000000000000000000004000000000000000000000000000000D7
:2005200001000000000080000000000000000000000000000000000000000000000000003A
:20054000000040000001000000008000000000000000000000014000000000000000000099
:2005600000000000000000000000000000000000000000000000000000000000000000007B
:2005800040000000000000000000000000000000000000002000C00000000000000000003B
:2005A00000003000000000000000000000000000000000000000000000000000000000000B
:2005C00000000000000000000000000000000000000000000000000000000000000000001B
:2005E0000000000000000000000000000000000000000000000000000001000000004000BA
:200600000000000000000000000000000000000000000000000000000000000000000000DA
:200620000000000000000000000000000000000000000000000000000000000000000000BA
:2006400000000000000000000000000000000000000000000000000000000000000000009A
:2006600000000000000000000000000000000000000000000000000000000000000000007A
:200680000000000000000000000000000000600000000000000000000000000000000000FA
:2006A00000000000000000000000000000000000000000000000000000000000000000003A
:2006C0000451510051000000007F7F00000000000000000000000000000000000000000025
:00000001FF
