:20000000170045020B027E020052040860094010807C40006401892D006501890F01083749
:200020002F01310159045C105F01840986068F0490039101920C9410970798059A0A9C02A5
:200040009E0DB102B410B501B60FB704B908BA80BE10C040C101C5D0C602C701C816C9FFF2
:20006000CAFFCBFFCDA0CF04D018D280D425D804D904DA04DB04DC10DD11DF01E040E2C088
:20008000E440E540E6C0E8C0EAC0ECC0EEC0010921000809080A89180419401A01214A22D1
:2000A0002024402C02310232083B404040438049015208538059095B4060047002734081E5
:2000C00040C004C20FCA10CC03CE08D009D60BD804E001011701EE0801180354095B045F0F
:2000E000010119340098038009800A881028114118141982200A2154225428202A042B80F4
:20010000318032143301399540044104430248454908500252245C205D8A61406701682876
:2001200069556B0371808B0296889940A404A908AB80B620B740C00FC20BC40FCA03CC0FB6
:20014000CE0FD007D20CD6F0D818EE08011A2900CD047205450608073A080209440A0D0BC8
:20016000390C100E601001123217101812190E1A641CCD1D631F04204D228024CD288D2A06
:20018000402E8032803330340F350F3670374039203AA03E043F405440580459045B045FB9
:2001A00001011B26000801A109800A88102A1302181019A01B802108221023013108325032
:2001C00039284802494060106140622081089129928897019B02A02EA180A220A780A81036
:2001E000C00FC20BC40FCC0ECE06D80EE001EC010140023380CC10014101A780014201A707
:2002000080014301A7800145025F01D6010146019701014704080883019701C20801480206
:20022000AF80EE10014C090E015F0164808A01AC08C201D601D801E601014D0383019701E2
:20024000A88001500400030C0310011C0101510100020000041600005612090401040012E6
:20026000602700480712380400C100320A9A100584160000841200008484000080000400F2
:200280000400800080007F1D80E0080708000028000051003605200004BEF0DC3BFFFFFFAD
:2002A0002200F008040000000000022004040404000000010000C00040011011C0010011F9
:2002C00040014001000000000000000000000000000000000000000000000000C0000000DC
:2002E0000800807C740060000000000000FFFF0080000000000000000000000000000000A8
:00000001FF
