6 127 6 94 8 16 6 174 117 65
6 129 6 94 8 0 6 165 117 66
6 118 6 95 8 11 6 167 117 67
6 134 6 95 8 19 6 176 117 68
6 124 6 95 8 18 6 165 117 69
6 139 6 95 8 11 6 154 117 70
6 133 6 95 8 8 6 157 117 71
6 111 6 94 8 14 6 205 117 73
6 132 6 95 8 5 6 191 117 74
6 121 6 95 8 33 6 162 117 75
6 136 6 95 8 8 6 160 117 76
6 116 6 95 8 18 6 188 117 77
6 128 6 94 8 18 6 197 117 78
6 131 6 95 8 21 6 197 117 78
6 146 6 94 8 7 6 175 117 79
6 119 6 95 8 11 6 157 117 80
6 126 6 95 8 13 6 163 117 82
6 126 6 95 8 29 6 165 117 83
6 126 6 94 8 3 6 171 117 84
6 127 6 94 7 249 6 191 117 85
6 127 6 95 8 7 6 203 117 86
6 123 6 94 8 6 6 182 117 87
6 126 6 95 8 10 6 163 117 88
6 125 6 94 8 24 6 171 117 89
6 125 6 95 8 28 6 192 117 90
6 128 6 95 8 21 6 210 117 91
6 118 6 94 8 28 6 200 117 92
6 122 6 94 8 12 6 195 117 93
6 122 6 94 8 20 6 195 117 94
6 130 6 94 8 7 6 187 117 95
6 120 6 95 8 13 6 184 117 96
6 126 6 95 8 40 6 197 117 97
6 122 6 95 8 40 6 177 117 98
6 128 6 95 7 248 6 166 117 99
6 129 6 95 7 252 6 177 117 100
6 122 6 95 8 38 6 192 117 101
6 127 6 95 8 11 6 188 117 102
6 134 6 95 8 17 6 184 117 103
6 125 6 95 8 32 6 198 117 104
6 122 6 95 8 9 6 200 117 105
6 129 6 95 8 16 6 195 117 106
6 127 6 95 7 246 6 173 117 107
6 122 6 94 8 20 6 183 117 108
6 125 6 95 8 28 6 182 117 109
6 139 6 95 8 11 6 185 117 110
6 140 6 95 8 10 6 175 117 112
6 125 6 95 8 24 6 167 117 113
6 125 6 95 7 245 6 176 117 114
6 128 6 95 8 36 6 193 117 115
6 129 6 95 8 32 6 198 117 116
6 121 6 95 8 15 6 168 117 117
6 128 6 95 8 31 6 152 117 118
6 125 6 95 8 30 6 165 117 119
6 127 6 95 7 245 6 179 117 120
6 126 6 95 8 19 6 195 117 121
6 123 6 95 8 4 6 199 117 122
6 132 6 95 8 13 6 194 117 123
6 130 6 95 8 19 6 189 117 124
6 126 6 95 8 10 6 196 117 125
6 121 6 95 8 24 6 182 117 126
6 126 6 95 8 20 6 187 117 127
6 129 6 95 8 18 6 181 117 129
6 118 6 95 8 17 6 181 117 130
6 133 6 95 8 3 6 185 117 131
6 120 6 95 8 25 6 172 117 132
6 120 6 95 8 0 6 174 117 133
6 120 6 95 8 16 6 171 117 134
6 127 6 95 7 255 6 158 117 135
6 124 6 95 8 37 6 155 117 136
6 129 6 95 8 4 6 161 117 137
6 129 6 95 7 237 6 173 117 138
6 122 6 95 8 19 6 162 117 139
6 126 6 95 8 32 6 179 117 140
6 124 6 95 8 34 6 167 117 141
6 125 6 95 7 243 6 166 117 142
6 123 6 95 8 6 6 190 117 143
6 131 6 95 8 3 6 188 117 144
6 132 6 95 8 14 6 164 117 145
6 130 6 95 8 15 6 161 117 146
6 137 6 95 8 15 6 170 117 147
6 126 6 95 8 18 6 177 117 148
6 131 6 95 8 15 6 186 117 150
6 124 6 95 8 14 6 184 117 151
6 128 6 95 8 11 6 186 117 152
6 127 6 95 8 29 6 180 117 153
6 133 6 95 8 13 6 177 117 154
6 126 6 95 8 9 6 188 117 159
6 125 6 95 8 12 6 159 117 161
6 125 6 95 8 15 6 167 117 162
6 131 6 95 8 20 6 185 117 163
6 115 6 95 8 16 6 169 117 165
6 127 6 95 8 22 6 162 117 166
6 123 6 95 8 11 6 165 117 167
6 124 6 95 8 21 6 170 117 168
6 123 6 95 8 5 6 180 117 169
6 130 6 94 8 24 6 187 117 170
6 128 6 95 8 22 6 191 117 171
6 125 6 94 8 24 6 210 117 172
6 128 6 95 8 19 6 196 117 173
6 125 6 95 8 24 6 178 117 174
6 123 6 95 8 8 6 192 117 175
6 126 6 95 8 6 6 178 117 176
6 125 6 95 8 10 6 200 117 177
6 126 6 95 8 41 6 186 117 178
6 121 6 95 8 12 6 189 117 179
6 127 6 95 8 6 6 193 117 180
6 127 6 96 8 6 6 196 117 181
6 131 6 95 8 7 6 197 117 182
6 122 6 94 8 28 6 184 117 183
6 133 6 94 8 13 6 176 117 184
6 133 6 95 8 13 6 166 117 185
6 119 6 95 8 21 6 161 117 186
6 134 6 95 8 11 6 169 117 187
6 130 6 95 8 17 6 173 117 188
6 130 6 95 8 14 6 177 117 189
6 128 6 95 8 16 6 172 117 190
6 128 6 95 8 20 6 185 117 192
6 125 6 95 8 5 6 176 117 193
6 123 6 95 8 19 6 182 117 194
6 120 6 95 8 35 6 178 117 195
6 123 6 95 8 20 6 183 117 196
6 127 6 95 8 16 6 182 117 197
6 128 6 95 8 34 6 183 117 198
6 123 6 95 8 26 6 188 117 199
6 133 6 96 8 2 6 191 117 200
6 126 6 95 7 246 6 172 117 201
6 129 6 95 7 255 6 176 117 202
6 126 6 95 7 251 6 179 117 203
6 133 6 95 8 10 6 173 117 204
6 128 6 95 7 249 6 182 117 205
6 127 6 95 8 23 6 178 117 207
6 126 6 95 8 18 6 192 117 208
6 136 6 95 8 6 6 188 117 209
6 112 6 95 8 11 6 183 117 210
6 119 6 96 8 25 6 174 117 211
6 124 6 95 8 24 6 174 117 211
6 129 6 95 8 23 6 166 117 212
6 123 6 95 8 21 6 178 117 213
6 122 6 95 8 21 6 178 117 214
6 119 6 96 8 11 6 188 117 215
6 133 6 96 8 27 6 195 117 216
6 127 6 95 8 8 6 179 117 217
6 127 6 95 8 10 6 186 117 218
6 126 6 95 8 39 6 179 117 219
6 129 6 95 8 2 6 174 117 220
6 122 6 95 8 29 6 186 117 221
6 129 6 95 8 38 6 197 117 222
6 129 6 95 8 8 6 182 117 223
6 124 6 95 8 11 6 189 117 224
6 128 6 95 8 19 6 178 117 225
6 128 6 95 8 23 6 186 117 226
6 126 6 95 8 28 6 173 117 227
6 127 6 95 8 16 6 175 117 228
6 124 6 95 8 17 6 182 117 229
6 125 6 95 8 18 6 187 117 230
6 136 6 95 8 3 6 187 117 230
6 126 6 95 8 15 6 206 117 231
6 120 6 95 8 7 6 191 117 232
6 134 6 95 8 8 6 187 117 233
6 125 6 95 8 20 6 197 117 234
6 121 6 95 8 19 6 196 117 235
6 127 6 95 8 14 6 185 117 236
6 125 6 95 8 7 6 177 117 237
6 127 6 95 8 16 6 189 117 239
6 128 6 95 8 21 6 185 117 240
6 131 6 95 8 8 6 175 117 241
6 121 6 95 8 22 6 168 117 242
6 119 6 95 8 21 6 178 117 243
6 130 6 95 8 18 6 171 117 244
6 132 6 96 8 8 6 171 117 245
6 123 6 95 8 22 6 160 117 246
6 130 6 95 8 15 6 190 117 248
6 130 6 94 8 21 6 193 117 250
6 123 6 95 8 14 6 175 117 251
6 123 6 95 8 29 6 169 117 252
6 127 6 95 8 9 6 178 117 253
6 122 6 95 8 13 6 177 117 255
6 127 6 95 8 14 6 176 118 0
6 128 6 95 8 17 6 188 118 1
6 131 6 95 8 33 6 197 118 2
6 127 6 95 8 4 6 198 118 3
6 122 6 95 7 254 6 198 118 4
6 127 6 95 7 248 6 193 118 5
6 132 6 95 8 22 6 200 118 6
6 126 6 95 8 5 6 185 118 7
6 130 6 95 8 19 6 184 118 8
6 127 6 95 8 7 6 172 118 9
6 129 6 96 8 20 6 193 118 12
6 132 6 95 8 16 6 179 118 13
6 126 6 95 8 13 6 184 118 15
6 120 6 95 8 15 6 192 118 17
6 123 6 95 8 14 6 180 118 18
6 127 6 95 8 27 6 170 118 19
6 122 6 95 8 6 6 188 118 21
6 123 6 95 8 27 6 186 118 22
6 115 6 95 8 17 6 195 118 23
6 129 6 95 8 10 6 195 118 23
6 121 6 95 8 14 6 196 118 24
6 127 6 95 8 20 6 188 118 25
6 131 6 95 8 13 6 184 118 26
6 125 6 95 8 13 6 177 118 27
6 127 6 95 8 15 6 179 118 28
6 130 6 96 8 10 6 181 118 29
6 127 6 95 8 31 6 198 118 30
6 128 6 95 8 16 6 188 118 31
6 125 6 95 8 1 6 176 118 32
6 132 6 95 7 233 6 182 118 33
6 132 6 96 8 12 6 194 118 34
6 130 6 96 8 4 6 199 118 35
6 125 6 95 8 2 6 186 118 36
6 128 6 95 8 20 6 187 118 37
6 128 6 96 8 14 6 185 118 38
6 124 6 95 8 19 6 169 118 39
6 131 6 95 8 16 6 178 118 40
6 124 6 95 8 17 6 162 118 41
6 126 6 95 8 13 6 166 118 42
6 118 6 95 8 17 6 166 118 43
6 128 6 95 8 23 6 175 118 44
6 127 6 95 8 13 6 174 118 45
6 130 6 95 8 16 6 175 118 46
6 133 6 95 8 10 6 184 118 47
6 132 6 95 8 3 6 182 118 48
6 131 6 95 8 10 6 170 118 49
6 131 6 95 8 8 6 169 118 50
6 127 6 95 8 18 6 170 118 51
6 126 6 95 8 21 6 168 118 52
6 126 6 95 8 4 6 166 118 53
6 126 6 95 8 7 6 188 118 54
6 124 6 95 8 6 6 197 118 55
6 124 6 95 8 6 6 206 118 56
6 130 6 96 8 21 6 203 118 57
6 127 6 95 8 12 6 183 118 58
6 132 6 95 8 15 6 178 118 59
6 123 6 95 8 18 6 172 118 60
6 141 6 95 8 17 6 172 118 60
6 125 6 95 8 5 6 195 118 62
6 122 6 95 8 7 6 195 118 63
6 130 6 95 7 255 6 183 118 64
6 130 6 95 8 14 6 186 118 65
6 130 6 95 8 7 6 208 118 65
6 130 6 95 8 15 6 198 118 66
6 130 6 95 8 20 6 188 118 67
6 124 6 95 8 23 6 182 118 68
6 133 6 95 8 23 6 186 118 69
6 129 6 95 8 17 6 190 118 70
6 128 6 95 7 248 6 195 118 71
6 124 6 95 8 25 6 210 118 72
6 122 6 95 8 16 6 205 118 74
6 127 6 95 8 50 6 207 118 75
6 125 6 95 8 29 6 182 118 76
6 127 6 95 8 10 6 189 118 77
6 122 6 95 8 23 6 196 118 78
6 130 6 95 8 8 6 184 118 79
6 130 6 95 8 15 6 175 118 81
6 130 6 95 8 14 6 166 118 82
6 134 6 95 8 12 6 190 118 83
6 136 6 95 8 7 6 196 118 84
6 133 6 95 8 21 6 192 118 85
6 127 6 95 8 2 6 190 118 86
6 132 6 96 8 15 6 193 118 87
6 129 6 95 8 23 6 192 118 88
6 143 6 95 8 4 6 173 118 89
6 125 6 96 8 18 6 178 118 90
6 136 6 95 8 6 6 174 118 91
6 133 6 95 8 8 6 189 118 92
6 134 6 95 8 12 6 190 118 93
6 132 6 96 8 18 6 190 118 94
6 125 6 95 8 13 6 189 118 95
6 127 6 95 8 18 6 189 118 95
6 128 6 96 8 13 6 191 118 96
6 126 6 96 8 9 6 204 118 97
6 127 6 95 8 9 6 203 118 98
6 133 6 95 8 14 6 199 118 99
6 135 6 95 8 22 6 200 118 100
6 145 6 95 8 1 6 205 118 102
6 163 6 95 8 44 6 229 118 103
6 134 6 95 8 7 6 242 118 104
6 107 6 95 8 10 6 242 118 105
6 100 6 95 8 14 6 215 118 107
6 103 6 95 8 7 6 223 118 108
6 105 6 96 8 3 6 209 118 109
6 112 6 95 8 18 6 204 118 110
6 109 6 95 8 7 6 210 118 111
6 112 6 95 8 15 6 196 118 112
6 108 6 95 8 8 6 203 118 113
6 114 6 95 8 27 6 208 118 114
6 114 6 95 8 24 6 217 118 116
6 122 6 95 8 20 6 209 118 117
6 127 6 95 8 19 6 199 118 118
6 113 6 95 8 20 6 195 118 119
6 115 6 95 8 32 6 197 118 120
6 109 6 95 8 11 6 209 118 121
6 110 6 96 8 13 6 215 118 123
6 117 6 95 7 252 6 214 118 124
6 120 6 95 8 17 6 211 118 125
6 115 6 95 8 15 6 214 118 126
6 125 6 95 8 4 6 223 118 127
6 105 6 95 7 247 6 218 118 128
6 101 6 95 8 33 6 239 118 129
6 106 6 95 7 250 6 241 118 130
6 101 6 95 8 14 6 230 118 131
6 101 6 95 8 13 6 232 118 133
6 104 6 95 8 27 6 224 118 134
6 124 6 95 8 7 6 213 118 135
6 130 6 95 8 13 6 236 118 136
6 136 6 95 7 253 6 233 118 137
6 141 6 95 8 17 6 228 118 138
6 142 6 95 8 12 6 225 118 139
6 140 6 95 8 16 6 216 118 141
6 153 6 95 8 13 6 201 118 142
6 142 6 95 8 5 6 205 118 143
6 131 6 95 7 253 6 219 118 144
6 109 6 95 8 17 6 224 118 145
6 114 6 95 8 20 6 234 118 146
6 117 6 95 8 36 6 237 118 147
6 112 6 95 8 42 6 220 118 148
6 112 6 95 8 38 6 231 118 149
6 111 6 95 8 21 6 220 118 150
6 116 6 95 8 9 6 237 118 151
6 118 6 95 8 6 6 217 118 152
6 112 6 95 8 23 6 221 118 153
6 107 6 95 8 15 6 215 118 154
6 116 6 95 8 22 6 193 118 156
6 112 6 95 8 17 6 199 118 157
6 112 6 95 8 31 6 211 118 158
6 109 6 95 8 32 6 224 118 159
6 129 6 94 8 11 6 227 118 160
6 123 6 95 8 16 6 220 118 161
6 131 6 95 8 3 6 234 118 162
6 112 6 95 8 3 6 222 118 163
6 97 6 95 7 252 6 241 118 164
6 21 6 95 7 209 6 241 118 164
5 217 6 94 8 6 6 241 118 165
6 3 6 95 8 36 6 234 118 166
6 51 6 95 8 38 6 226 118 167
6 59 6 95 8 12 6 222 118 168
6 58 6 94 7 235 6 206 118 169
6 51 6 94 7 235 6 197 118 170
6 49 6 95 8 22 6 205 118 171
6 48 6 94 8 24 6 214 118 172
6 55 6 94 8 3 6 215 118 173
6 69 6 94 8 7 6 218 118 174
6 69 6 94 8 8 6 210 118 175
6 93 6 94 8 30 6 192 118 176
6 93 6 93 8 38 6 192 118 176
6 75 6 94 8 21 6 186 118 177
6 64 6 94 8 17 6 185 118 178
6 83 6 94 8 21 6 188 118 180
6 68 6 93 8 14 6 188 118 180
6 72 6 94 8 28 6 182 118 182
6 65 6 93 8 7 6 181 118 183
6 60 6 94 8 6 6 165 118 184
6 91 6 94 8 0 6 172 118 185
6 85 6 93 8 49 6 160 118 186
6 77 6 94 7 247 6 159 118 187
6 84 6 94 8 15 6 170 118 189
6 73 6 93 8 20 6 177 118 190
6 67 6 93 8 29 6 169 118 191
6 83 6 93 8 10 6 152 118 192
6 79 6 93 8 16 6 154 118 193
6 57 6 93 7 243 6 170 118 194
6 90 6 93 8 36 6 162 118 195
6 64 6 92 8 8 6 150 118 196
6 70 6 93 7 240 6 150 118 197
6 68 6 93 7 255 6 158 118 198
6 77 6 93 8 16 6 165 118 199
6 53 6 92 8 5 6 165 118 199
6 59 6 93 7 241 6 149 118 200
6 69 6 92 8 34 6 146 118 201
6 73 6 93 8 80 6 129 118 202
6 91 6 93 8 1 6 138 118 203
6 84 6 93 8 32 6 137 118 204
6 94 6 92 8 18 6 130 118 205
6 89 6 92 8 47 6 133 118 206
6 60 6 92 8 12 6 134 118 207
6 58 6 93 8 12 6 136 118 208
6 53 6 92 7 253 6 134 118 209
6 39 6 92 8 4 6 129 118 210
6 58 6 92 8 23 6 126 118 211
6 30 6 92 7 243 6 122 118 212
6 21 6 92 8 13 6 133 118 213
6 27 6 92 8 29 6 129 118 214
6 51 6 92 8 61 6 128 118 215
6 57 6 91 8 16 6 119 118 216
6 46 6 92 7 218 6 125 118 217
6 71 6 92 7 221 6 126 118 218
6 86 6 92 8 37 6 113 118 219
6 66 6 91 8 49 6 98 118 220
6 66 6 91 8 37 6 108 118 221
6 76 6 91 8 4 6 83 118 222
6 84 6 92 7 233 6 96 118 223
6 96 6 92 8 58 6 91 118 224
6 72 6 91 8 15 6 91 118 225
6 87 6 91 7 232 6 80 118 225
6 79 6 91 8 3 6 100 118 226
6 75 6 92 8 25 6 109 118 228
6 71 6 91 8 3 6 112 118 229
6 92 6 91 8 3 6 106 118 230
6 68 6 91 8 51 6 117 118 231
6 62 6 91 7 250 6 102 118 232
6 61 6 91 7 197 6 102 118 233
6 78 6 91 8 65 6 83 118 234
6 97 6 91 7 243 6 79 118 235
6 107 6 91 7 236 6 88 118 237
6 120 6 91 8 36 6 94 118 238
6 103 6 91 7 245 6 90 118 239
6 113 6 91 8 31 6 90 118 240
6 100 6 91 7 255 6 80 118 241
6 127 6 90 8 82 6 79 118 242
6 103 6 91 8 6 6 79 118 243
6 125 6 91 8 27 6 87 118 245
6 151 6 91 8 0 6 100 118 246
6 129 6 91 7 252 6 87 118 247
6 131 6 91 8 40 6 107 118 248
6 115 6 91 8 95 6 96 118 249
6 108 6 91 8 12 6 97 118 250
6 95 6 91 8 40 6 112 118 251
6 95 6 91 7 201 6 125 118 252
6 86 6 91 8 6 6 119 118 253
6 100 6 91 8 36 6 119 118 253
6 79 6 91 8 36 6 120 118 254
6 101 6 91 7 243 6 116 118 255
6 101 6 91 8 4 6 108 119 0
6 104 6 91 8 42 6 101 119 1
6 96 6 91 8 15 6 100 119 2
6 106 6 91 8 12 6 100 119 2
6 94 6 91 8 12 6 103 119 3
6 98 6 90 7 252 6 103 119 4
6 101 6 90 7 252 6 116 119 5
6 136 6 90 8 69 6 109 119 6
6 124 6 90 8 66 6 112 119 7
6 124 6 91 7 197 6 107 119 8
6 136 6 91 7 233 6 110 119 9
6 107 6 91 7 224 6 110 119 9
6 106 6 91 7 224 6 108 119 10
6 120 6 91 8 131 6 123 119 11
6 101 6 91 8 18 6 112 119 12
6 84 6 91 7 231 6 113 119 13
6 83 6 91 7 212 6 122 119 14
6 83 6 90 8 6 6 120 119 15
6 117 6 90 8 25 6 119 119 16
6 105 6 90 8 42 6 124 119 17
6 111 6 91 7 236 6 120 119 19
6 110 6 90 8 2 6 123 119 20
6 99 6 90 8 57 6 123 119 20
6 146 6 91 8 77 6 126 119 21
6 143 6 91 7 170 6 129 119 22
6 131 6 90 8 6 6 134 119 23
6 158 6 91 8 73 6 127 119 24
6 135 6 91 7 227 6 134 119 26
6 156 6 90 8 69 6 134 119 27
6 145 6 90 8 48 6 143 119 28
6 157 6 91 8 3 6 151 119 29
6 118 6 91 7 209 6 157 119 30
6 85 6 91 8 7 6 167 119 31
6 96 6 91 7 251 6 166 119 32
6 102 6 91 8 8 6 172 119 33
6 102 6 90 7 254 6 162 119 34
6 123 6 91 8 18 6 164 119 35
6 106 6 90 7 237 6 165 119 37
6 128 6 90 8 24 6 174 119 38
6 109 6 90 7 221 6 169 119 39
6 132 6 90 8 30 6 155 119 40
6 114 6 91 8 30 6 169 119 41
6 105 6 91 8 116 6 161 119 42
6 135 6 91 7 219 6 170 119 43
6 133 6 90 8 44 6 168 119 44
6 105 6 91 8 4 6 186 119 45
6 122 6 91 8 81 6 196 119 46
6 117 6 90 7 216 6 193 119 47
6 92 6 91 7 188 6 188 119 48
6 97 6 90 7 234 6 173 119 49
6 90 6 90 8 60 6 177 119 50
6 76 6 90 8 37 6 175 119 51
6 113 6 90 7 247 6 174 119 52
6 94 6 90 7 188 6 173 119 53
6 99 6 91 8 26 6 151 119 54
6 118 6 91 8 124 6 156 119 55
6 136 6 91 8 64 6 156 119 55
6 148 6 91 8 33 6 163 119 56
6 133 6 90 7 244 6 157 119 57
6 139 6 90 7 244 6 155 119 58
6 112 6 90 7 245 6 158 119 59
6 101 6 90 7 245 6 174 119 60
6 84 6 91 7 252 6 149 119 62
6 92 6 90 8 24 6 147 119 63
6 100 6 90 8 42 6 168 119 64
6 80 6 90 7 247 6 155 119 65
6 89 6 90 7 241 6 169 119 66
6 86 6 91 8 44 6 150 119 67
6 113 6 90 8 63 6 156 119 68
6 90 6 90 7 233 6 137 119 70
6 69 6 90 7 175 6 135 119 71
6 81 6 91 8 18 6 136 119 72
6 106 6 90 8 79 6 141 119 73
6 128 6 90 8 118 6 140 119 74
6 132 6 90 7 253 6 138 119 76
6 126 6 90 7 204 6 139 119 77
6 119 6 89 7 190 6 144 119 78
6 98 6 90 8 134 6 147 119 79
6 95 6 90 8 55 6 147 119 80
6 99 6 90 7 240 6 128 119 81
6 71 6 90 8 1 6 144 119 82
6 62 6 90 8 55 6 132 119 83
6 118 6 90 7 231 6 121 119 84
6 132 6 90 8 72 6 114 119 86
6 132 6 90 8 75 6 116 119 87
6 154 6 89 8 47 6 123 119 88
6 99 6 90 8 46 6 142 119 91
6 99 6 90 8 46 6 143 119 92
6 95 6 90 8 78 6 143 119 93
6 118 6 90 8 9 6 120 119 94
6 95 6 90 8 21 6 128 119 95
6 94 6 90 8 55 6 121 119 96
6 88 6 89 7 213 6 123 119 97
6 108 6 90 8 17 6 136 119 98
6 144 6 90 7 204 6 133 119 99
6 109 6 89 8 53 6 133 119 99
6 99 6 90 8 84 6 140 119 100
6 144 6 90 8 18 6 133 119 101
6 127 6 90 8 18 6 123 119 102
6 182 6 90 8 136 6 114 119 103
6 141 6 90 7 246 6 115 119 104
6 134 6 89 7 56 6 123 119 105
6 141 6 90 8 56 6 135 119 106
6 130 6 90 8 2 6 138 119 107
6 109 6 90 7 182 6 130 119 108
6 142 6 90 8 54 6 137 119 109
6 90 6 90 8 115 6 131 119 110
6 105 6 90 8 25 6 136 119 111
6 147 6 89 7 236 6 143 119 112
6 111 6 90 8 12 6 134 119 113
6 152 6 90 7 221 6 126 119 114
6 98 6 90 7 243 6 123 119 115
6 151 6 89 8 99 6 130 119 116
6 147 6 90 8 62 6 118 119 118
6 159 6 90 7 244 6 118 119 119
6 140 6 90 7 248 6 123 119 120
6 83 6 90 8 34 6 131 119 121
6 159 6 90 8 98 6 139 119 122
6 113 6 91 8 12 6 140 119 123
6 67 6 90 8 17 6 128 119 124
6 119 6 91 8 45 6 134 119 125
6 120 6 90 8 85 6 141 119 126
6 133 6 90 7 231 6 129 119 127
6 173 6 90 7 248 6 121 119 128
6 151 6 90 7 207 6 128 119 129
6 147 6 90 7 251 6 131 119 130
6 159 6 90 8 48 6 126 119 131
6 86 6 91 8 26 6 127 119 132
6 191 6 90 8 152 6 142 119 133
6 33 6 90 7 205 6 147 119 134
6 95 6 90 8 62 6 162 119 135
6 116 6 90 8 32 6 141 119 136
6 108 6 91 7 165 6 143 119 137
6 108 6 90 7 231 6 137 119 138
6 172 6 90 8 66 6 114 119 139
6 126 6 90 7 232 6 111 119 140
6 107 6 90 7 244 6 112 119 141
6 161 6 90 8 63 6 144 119 142
6 134 6 90 7 238 6 146 119 143
6 147 6 90 8 16 6 130 119 144
6 147 6 90 8 123 6 118 119 145
6 152 6 90 7 244 6 100 119 146
6 109 6 90 7 135 6 98 119 147
6 187 6 90 8 48 6 111 119 148
6 117 6 90 8 96 6 135 119 149
6 149 6 90 8 123 6 135 119 149
6 147 6 90 7 218 6 137 119 150
6 141 6 90 8 8 6 127 119 151
6 140 6 90 8 2 6 139 119 152
6 147 6 90 8 2 6 132 119 153
6 134 6 90 7 233 6 134 119 154
6 122 6 90 8 0 6 141 119 155
6 123 6 90 7 206 6 121 119 156
6 122 6 90 7 241 6 113 119 157
6 128 6 90 8 40 6 126 119 158
6 129 6 91 8 73 6 120 119 159
6 132 6 90 8 21 6 132 119 160
6 169 6 91 7 226 6 136 119 162
6 130 6 91 8 82 6 142 119 163
6 169 6 90 8 49 6 148 119 164
6 145 6 90 7 187 6 115 119 165
6 172 6 90 8 40 6 125 119 166
6 136 6 90 8 47 6 134 119 168
6 157 6 90 7 243 6 148 119 169
6 138 6 91 8 56 6 153 119 170
6 124 6 90 7 211 6 140 119 171
6 135 6 91 7 198 6 135 119 172
6 143 6 90 7 230 6 146 119 173
6 140 6 91 7 227 6 140 119 174
6 155 6 91 8 61 6 138 119 175
6 172 6 91 8 35 6 122 119 177
6 168 6 90 8 9 6 102 119 178
6 123 6 91 7 236 6 87 119 179
6 123 6 91 7 233 6 121 119 180
6 128 6 91 8 99 6 136 119 181
6 170 6 91 8 51 6 136 119 181
6 147 6 91 8 51 6 149 119 182
6 166 6 91 8 84 6 144 119 183
6 153 6 91 8 51 6 136 119 184
6 153 6 91 8 125 6 143 119 185
6 128 6 91 8 4 6 141 119 186
6 133 6 91 7 197 6 141 119 186
6 140 6 91 7 197 6 149 119 187
6 134 6 91 7 223 6 152 119 188
6 134 6 91 8 64 6 151 119 189
6 136 6 90 8 23 6 143 119 190
6 169 6 91 7 232 6 147 119 191
6 123 6 91 7 239 6 147 119 191
6 134 6 91 7 239 6 146 119 192
6 132 6 91 8 18 6 139 119 193
6 149 6 91 8 99 6 146 119 194
6 149 6 91 8 9 6 148 119 195
6 179 6 91 8 1 6 164 119 196
6 190 6 91 8 88 6 153 119 197
6 120 6 91 8 43 6 153 119 197
6 206 6 91 8 106 6 152 119 198
6 195 6 92 8 106 6 149 119 199
6 167 6 91 8 111 6 163 119 200
6 141 6 91 7 247 6 155 119 202
6 169 6 91 7 250 6 172 119 203
6 144 6 92 7 209 6 171 119 204
6 172 6 92 7 232 6 157 119 205
6 106 6 91 8 22 6 143 119 206
6 106 6 91 7 248 6 173 119 207
6 110 6 91 7 228 6 194 119 209
6 121 6 91 8 0 6 186 119 210
6 77 6 91 7 183 6 160 119 211
6 106 6 91 8 75 6 152 119 212
6 164 6 91 8 53 6 166 119 213
6 94 6 91 8 155 6 144 119 215
6 172 6 91 8 41 6 143 119 216
6 179 6 91 7 186 6 167 119 217
6 162 6 91 7 197 6 174 119 218
6 172 6 91 7 204 6 159 119 219
6 115 6 92 7 226 6 146 119 220
6 145 6 91 8 119 6 132 119 221
6 179 6 91 8 93 6 146 119 223
6 175 6 92 8 8 6 149 119 224
6 163 6 92 7 247 6 177 119 225
6 145 6 92 7 237 6 171 119 226
6 107 6 92 8 92 6 178 119 227
6 101 6 92 8 51 6 176 119 228
6 143 6 91 7 224 6 167 119 230
6 105 6 92 8 7 6 182 119 231
6 112 6 92 7 217 6 184 119 232
6 144 6 92 7 221 6 166 119 233
6 116 6 92 8 25 6 146 119 234
6 150 6 92 8 80 6 155 119 235
6 123 6 91 8 44 6 155 119 236
6 111 6 92 8 49 6 172 119 238
6 147 6 92 7 251 6 182 119 239
6 130 6 92 8 3 6 174 119 240
6 119 6 92 8 67 6 187 119 241
6 110 6 92 8 2 6 179 119 242
6 112 6 92 8 28 6 155 119 243
6 130 6 92 8 31 6 170 119 244
6 117 6 92 8 80 6 158 119 245
6 138 6 92 7 213 6 159 119 246
6 96 6 92 7 243 6 167 119 248
6 114 6 92 8 102 6 184 119 249
6 104 6 92 8 57 6 175 119 250
6 116 6 92 7 212 6 158 119 251
6 73 6 92 7 250 6 169 119 252
6 92 6 91 7 174 6 141 119 253
6 71 6 91 8 131 6 154 119 254
6 108 6 92 8 86 6 143 120 0
6 108 6 92 8 99 6 147 120 1
6 132 6 92 8 53 6 138 120 2
6 107 6 92 7 220 6 122 120 3
6 137 6 92 7 227 6 126 120 4
6 115 6 92 8 59 6 131 120 5
6 132 6 92 8 69 6 147 120 6
6 157 6 92 8 32 6 161 120 7
6 153 6 92 8 81 6 148 120 8
6 141 6 92 8 10 6 122 120 9
6 143 6 91 7 253 6 138 120 10
6 121 6 91 7 235 6 143 120 11
6 91 6 92 7 235 6 145 120 12
6 148 6 92 8 72 6 155 120 13
6 111 6 92 8 38 6 151 120 14
6 111 6 92 8 32 6 151 120 15
6 131 6 91 8 27 6 151 120 16
6 129 6 92 7 185 6 133 120 17
6 116 6 91 7 186 6 129 120 18
6 90 6 92 8 48 6 129 120 18
6 149 6 91 8 62 6 132 120 19
6 151 6 92 8 62 6 134 120 20
6 116 6 92 8 29 6 142 120 21
6 116 6 92 7 186 6 146 120 22
6 147 6 91 8 56 6 138 120 23
6 157 6 92 8 22 6 138 120 24
6 133 6 92 7 245 6 143 120 24
6 149 6 92 8 50 6 139 120 25
6 169 6 92 8 50 6 136 120 26
6 177 6 92 8 17 6 148 120 27
6 128 6 92 7 244 6 146 120 28
6 181 6 92 7 233 6 146 120 29
6 181 6 92 8 56 6 148 120 30
6 174 6 92 8 3 6 140 120 31
6 158 6 92 8 19 6 140 120 31
6 191 6 92 8 19 6 147 120 32
6 213 6 92 8 12 6 164 120 33
6 156 6 92 7 193 6 178 120 34
6 154 6 92 8 192 6 175 120 35
6 133 6 92 8 6 6 185 120 36
6 115 6 92 7 211 6 177 120 37
6 155 6 92 7 196 6 174 120 38
6 154 6 92 7 195 6 174 120 39
6 150 6 92 7 67 6 175 120 40
6 142 6 92 7 241 6 171 120 41
6 110 6 92 7 241 6 169 120 42
6 94 6 92 7 181 6 175 120 43
6 139 6 92 8 121 6 168 120 44
6 128 6 92 8 4 6 163 120 45
6 132 6 92 7 211 6 169 120 46
6 135 6 92 8 107 6 187 120 47
6 133 6 92 8 54 6 174 120 48
6 147 6 93 8 9 6 164 120 49
6 170 6 92 7 224 6 151 120 50
6 94 6 92 7 213 6 148 120 51
6 141 6 93 8 18 6 179 120 52
6 106 6 92 8 16 6 178 120 53
6 101 6 92 8 33 6 172 120 54
6 133 6 92 8 46 6 189 120 55
6 112 6 92 7 207 6 179 120 56
6 136 6 92 8 9 6 176 120 57
6 133 6 92 8 88 6 160 120 58
6 135 6 92 7 213 6 163 120 60
6 118 6 92 8 44 6 183 120 61
6 85 6 92 8 78 6 183 120 62
6 122 6 92 8 55 6 182 120 63
6 85 6 92 8 53 6 185 120 64
6 152 6 92 8 2 6 189 120 65
6 138 6 92 7 239 6 167 120 66
6 137 6 92 7 227 6 164 120 67
6 120 6 92 7 238 6 174 120 68
6 148 6 92 7 219 6 153 120 69
6 140 6 92 8 22 6 158 120 70
6 132 6 92 7 238 6 164 120 71
6 132 6 92 8 16 6 145 120 72
6 127 6 92 8 41 6 142 120 73
6 141 6 93 8 32 6 155 120 74
6 109 6 93 7 251 6 173 120 75
6 174 6 92 7 253 6 169 120 76
6 152 6 92 8 48 6 155 120 77
6 151 6 93 7 223 6 160 120 78
6 131 6 92 7 200 6 152 120 79
6 110 6 92 8 23 6 153 120 80
6 121 6 92 8 85 6 153 120 81
6 92 6 93 8 14 6 144 120 82
6 139 6 93 8 32 6 151 120 83
6 144 6 93 8 61 6 153 120 84
6 110 6 93 8 10 6 151 120 85
6 143 6 93 8 34 6 162 120 86
6 100 6 92 7 241 6 144 120 88
6 104 6 92 8 33 6 125 120 89
6 124 6 92 8 11 6 120 120 90
6 119 6 92 8 31 6 123 120 91
6 147 6 92 8 30 6 121 120 92
6 155 6 93 8 26 6 139 120 93
6 160 6 92 8 16 6 138 120 95
6 176 6 92 7 230 6 124 120 96
6 145 6 93 7 208 6 133 120 97
6 141 6 92 8 70 6 115 120 98
6 151 6 93 8 105 6 114 120 99
6 151 6 92 7 255 6 140 120 100
6 174 6 92 8 83 6 150 120 101
6 204 6 93 8 20 6 137 120 102
6 161 6 93 7 250 6 121 120 103
6 127 6 92 7 250 6 109 120 104
6 172 6 93 8 51 6 119 120 105
6 168 6 93 8 19 6 119 120 106
6 182 6 92 8 112 6 146 120 107
6 161 6 92 8 8 6 146 120 108
6 169 6 93 8 8 6 159 120 109
6 167 6 93 7 231 6 144 120 110
6 129 6 93 7 232 6 138 120 111
6 138 6 93 8 27 6 147 120 112
6 151 6 94 8 127 6 132 120 113
6 154 6 93 8 82 6 145 120 114
6 174 6 93 7 240 6 156 120 115
6 148 6 93 7 238 6 158 120 116
6 150 6 93 8 51 6 145 120 117
6 150 6 94 8 25 6 135 120 118
6 194 6 94 8 50 6 129 120 122
6 167 6 94 7 231 6 139 120 123
6 184 6 94 8 49 6 164 120 124
6 174 6 94 8 45 6 171 120 125
6 165 6 93 8 1 6 153 120 126
6 166 6 94 7 253 6 165 120 128
6 163 6 94 7 225 6 167 120 129
6 156 6 94 8 19 6 177 120 131
6 163 6 94 8 104 6 165 120 132
6 137 6 94 8 67 6 155 120 133
6 154 6 94 8 5 6 171 120 134
6 165 6 94 8 33 6 175 120 136
6 129 6 94 8 7 6 156 120 137
6 179 6 94 7 238 6 171 120 138
6 166 6 94 8 10 6 185 120 139
6 139 6 94 8 28 6 162 120 140
6 103 6 94 8 28 6 173 120 141
6 133 6 94 8 50 6 190 120 142
6 127 6 94 7 192 6 178 120 143
6 150 6 94 7 178 6 168 120 145
6 105 6 95 8 100 6 171 120 146
6 180 6 95 8 95 6 186 120 147
6 152 6 94 7 238 6 186 120 148
6 124 6 94 7 152 6 182 120 149
6 125 6 94 7 237 6 198 120 150
6 132 6 94 7 239 6 193 120 151
6 161 6 94 7 252 6 170 120 152
6 147 6 94 8 50 6 197 120 154
6 116 6 94 8 8 6 195 120 155
6 138 6 95 8 2 6 183 120 156
6 130 6 94 8 16 6 185 120 157
6 172 6 94 7 221 6 199 120 158
6 121 6 94 8 20 6 184 120 159
6 182 6 95 8 47 6 188 120 160
6 147 6 95 8 66 6 198 120 161
6 183 6 95 7 242 6 172 120 163
6 145 6 95 8 7 6 158 120 164
6 118 6 94 7 221 6 153 120 165
6 152 6 95 8 32 6 175 120 166
6 190 6 95 8 41 6 198 120 167
6 190 6 95 7 229 6 197 120 168
6 183 6 95 8 25 6 194 120 170
6 165 6 95 8 32 6 196 120 171
6 176 6 95 8 56 6 181 120 172
6 153 6 95 8 5 6 169 120 173
6 160 6 94 8 65 6 199 120 174
6 150 6 95 7 235 6 216 120 175
6 164 6 94 7 196 6 213 120 177
6 166 6 95 8 104 6 181 120 178
6 163 6 96 8 25 6 183 120 179
6 135 6 95 7 218 6 204 120 180
6 187 6 95 7 205 6 204 120 181
6 167 6 95 7 231 6 211 120 182
6 189 6 95 8 24 6 215 120 183
6 116 6 95 8 12 6 186 120 185
6 130 6 95 7 249 6 189 120 186
6 145 6 95 7 227 6 197 120 187
6 120 6 95 7 209 6 192 120 188
6 156 6 95 8 65 6 190 120 189
6 183 6 95 8 99 6 191 120 190
6 168 6 96 7 227 6 201 120 191
6 150 6 95 7 220 6 209 120 192
6 147 6 96 8 22 6 204 120 194
6 160 6 96 8 42 6 195 120 195
6 162 6 96 8 48 6 205 120 196
6 179 6 96 8 57 6 210 120 197
6 112 6 95 7 175 6 218 120 198
6 150 6 96 7 211 6 208 120 199
6 154 6 96 8 38 6 193 120 200
6 144 6 96 8 68 6 200 120 201
6 143 6 97 8 38 6 213 120 202
6 183 6 96 7 208 6 205 120 203
6 117 6 96 7 211 6 199 120 204
6 127 6 96 8 47 6 194 120 205
6 158 6 96 8 53 6 199 120 206
6 112 6 96 7 206 6 197 120 207
6 109 6 96 7 244 6 195 120 208
6 133 6 96 8 39 6 195 120 209
6 157 6 96 8 101 6 197 120 210
6 150 6 96 8 57 6 193 120 211
6 149 6 96 7 159 6 189 120 212
6 117 6 96 7 203 6 187 120 213
6 140 6 96 8 116 6 197 120 215
6 139 6 96 8 8 6 184 120 216
6 118 6 96 7 225 6 184 120 216
6 111 6 96 7 199 6 173 120 217
6 108 6 96 7 199 6 179 120 218
6 124 6 96 8 14 6 186 120 219
6 129 6 95 8 126 6 178 120 220
6 116 6 95 7 219 6 174 120 221
6 131 6 96 7 244 6 183 120 223
6 144 6 96 8 23 6 183 120 223
6 146 6 96 8 101 6 174 120 224
6 177 6 96 8 28 6 176 120 226
6 155 6 96 7 123 6 186 120 227
6 207 6 96 8 31 6 191 120 228
6 148 6 96 8 245 6 198 120 229
6 148 6 96 8 10 6 187 120 230
6 164 6 96 7 146 6 190 120 231
6 131 6 96 8 105 6 182 120 232
6 166 6 96 8 124 6 186 120 233
6 178 6 97 7 236 6 188 120 234
6 132 6 96 8 32 6 198 120 235
6 153 6 96 8 9 6 201 120 236
6 173 6 97 8 54 6 198 120 237
6 196 6 96 8 101 6 194 120 238
6 200 6 97 8 22 6 178 120 240
6 164 6 97 7 240 6 197 120 240
6 154 6 96 7 219 6 194 120 241
6 130 6 97 7 149 6 196 120 243
6 137 6 96 8 5 6 203 120 244
6 185 6 97 7 117 6 207 120 248
6 157 6 97 8 186 6 201 120 249
6 185 6 97 8 133 6 221 120 250
6 163 6 96 7 166 6 219 120 251
6 117 6 97 7 181 6 228 120 252
6 145 6 97 8 42 6 241 120 253
6 183 6 97 8 125 6 224 120 254
6 202 6 97 8 51 6 234 120 255
6 181 6 97 8 84 6 228 121 0
6 151 6 97 7 161 6 220 121 1
6 181 6 97 7 215 6 214 121 2
6 132 6 97 8 23 6 218 121 3
6 140 6 97 8 1 6 226 121 4
6 161 6 97 8 94 6 235 121 5
6 167 6 97 8 73 6 229 121 6
6 156 6 97 8 25 6 227 121 7
6 163 6 97 7 187 6 215 121 8
6 160 6 98 8 6 6 228 121 9
6 183 6 97 8 58 6 229 121 10
6 136 6 97 8 45 6 234 121 11
6 126 6 98 7 202 6 251 121 12
6 154 6 98 8 18 6 254 121 13
6 137 6 98 7 248 6 239 121 14
6 116 6 97 8 118 6 245 121 15
6 133 6 97 7 251 6 250 121 16
6 127 6 97 8 62 6 249 121 17
6 132 6 98 8 65 6 247 121 18
6 125 6 98 7 205 6 232 121 19
6 145 6 98 8 13 6 225 121 20
6 136 6 98 7 225 6 223 121 21
6 148 6 98 8 16 6 215 121 22
6 149 6 98 8 30 6 210 121 23
6 101 6 98 8 26 6 216 121 24
6 174 6 98 8 43 6 225 121 25
6 141 6 98 7 189 6 218 121 27
6 177 6 98 7 245 6 225 121 28
6 142 6 98 8 11 6 232 121 29
6 133 6 98 8 28 6 238 121 30
6 141 6 98 8 79 6 238 121 30
6 173 6 98 8 65 6 225 121 31
6 142 6 98 8 65 6 214 121 32
6 142 6 98 8 42 6 214 121 33
6 163 6 98 8 15 6 226 121 34
6 127 6 98 7 243 6 217 121 35
6 127 6 97 8 30 6 220 121 36
6 156 6 98 7 220 6 226 121 37
6 146 6 98 7 252 6 227 121 38
6 168 6 98 7 254 6 227 121 38
6 121 6 98 7 254 6 226 121 39
6 195 6 98 8 49 6 221 121 40
6 195 6 98 8 69 6 224 121 41
6 144 6 98 7 249 6 211 121 42
6 206 6 98 8 70 6 228 121 43
6 188 6 98 7 200 6 232 121 44
6 124 6 98 8 28 6 232 121 44
6 129 6 98 8 28 6 246 121 45
6 165 6 98 7 203 6 236 121 46
6 151 6 98 8 117 6 217 121 47
6 140 6 99 7 207 6 223 121 48
6 140 6 98 7 227 6 221 121 49
6 144 6 98 7 201 6 214 121 50
6 138 6 98 8 93 6 221 121 51
6 124 6 98 8 105 6 226 121 52
6 158 6 98 8 4 6 220 121 53
6 158 6 98 7 246 6 223 121 54
6 109 6 98 7 219 6 207 121 55
6 113 6 98 7 238 6 213 121 56
6 116 6 98 7 229 6 211 121 57
6 136 6 98 8 96 6 218 121 58
6 160 6 98 8 88 6 220 121 59
6 136 6 98 8 11 6 210 121 60
6 156 6 98 7 213 6 200 121 61
6 145 6 98 7 235 6 198 121 62
6 159 6 98 8 120 6 206 121 63
6 127 6 99 8 99 6 226 121 64
6 126 6 99 7 230 6 234 121 65
6 132 6 98 7 160 6 234 121 66
6 131 6 98 7 229 6 200 121 67
6 119 6 98 8 82 6 214 121 68
6 113 6 99 8 65 6 220 121 69
6 145 6 98 7 238 6 225 121 70
6 129 6 99 7 223 6 216 121 71
6 129 6 98 8 59 6 192 121 72
6 158 6 98 8 81 6 202 121 73
6 148 6 98 7 252 6 209 121 74
6 148 6 98 7 222 6 219 121 75
6 148 6 99 7 240 6 220 121 76
6 164 6 98 8 149 6 213 121 77
6 153 6 99 8 54 6 218 121 78
6 141 6 99 7 241 6 214 121 79
6 106 6 99 7 184 6 208 121 80
6 90 6 99 7 197 6 213 121 81
6 101 6 98 8 104 6 203 121 82
6 154 6 98 8 112 6 208 121 83
6 158 6 98 8 102 6 209 121 84
6 146 6 99 8 42 6 190 121 85
6 130 6 98 7 223 6 197 121 86
6 127 6 98 7 243 6 196 121 87
6 108 6 99 7 245 6 193 121 88
6 108 6 98 7 243 6 192 121 89
6 130 6 98 8 86 6 193 121 90
6 140 6 98 8 107 6 200 121 91
6 113 6 99 7 164 6 207 121 93
6 124 6 98 7 224 6 207 121 94
6 75 6 98 8 20 6 201 121 94
6 132 6 98 8 160 6 183 121 95
6 142 6 99 8 46 6 186 121 96
6 140 6 98 8 220 6 199 121 97
6 131 6 98 7 216 6 204 121 98
6 120 6 98 8 31 6 216 121 100
6 138 6 99 8 121 6 190 121 101
6 113 6 98 8 68 6 176 121 102
6 105 6 98 7 191 6 183 121 103
6 112 6 98 8 2 6 180 121 104
6 103 6 98 8 119 6 173 121 106
6 118 6 99 8 55 6 186 121 107
6 114 6 98 7 235 6 177 121 108
6 118 6 98 7 223 6 177 121 109
6 146 6 98 8 54 6 183 121 110
6 140 6 98 8 49 6 178 121 111
6 135 6 98 8 9 6 169 121 112
6 131 6 98 8 8 6 169 121 113
6 132 6 98 7 229 6 173 121 115
6 127 6 98 8 13 6 178 121 116
6 108 6 98 7 240 6 180 121 117
6 104 6 98 8 19 6 167 121 118
6 149 6 98 8 129 6 177 121 119
6 139 6 98 8 35 6 163 121 121
6 121 6 98 7 199 6 164 121 122
6 121 6 98 7 232 6 173 121 123
6 129 6 98 8 84 6 173 121 123
6 131 6 98 8 19 6 170 121 124
6 115 6 98 8 19 6 167 121 125
6 133 6 98 8 5 6 170 121 126
6 112 6 98 8 73 6 164 121 127
6 125 6 98 7 239 6 170 121 128
6 125 6 98 7 204 6 191 121 129
6 140 6 98 8 110 6 182 121 130
6 118 6 99 8 41 6 179 121 131
6 135 6 98 7 243 6 189 121 132
6 135 6 98 7 201 6 192 121 133
6 124 6 98 8 4 6 175 121 134
6 106 6 98 8 0 6 167 121 135
6 145 6 98 8 32 6 167 121 136
6 134 6 98 8 64 6 156 121 137
6 149 6 98 8 77 6 156 121 137
6 129 6 98 8 77 6 149 121 138
6 114 6 98 7 231 6 165 121 139
6 122 6 98 7 240 6 180 121 140
6 116 6 98 7 254 6 179 121 141
6 116 6 98 8 49 6 187 121 142
6 108 6 98 7 226 6 176 121 143
6 126 6 98 8 6 6 158 121 144
6 109 6 98 8 28 6 164 121 145
6 90 6 98 7 255 6 164 121 145
6 105 6 98 7 140 6 160 121 146
6 124 6 98 8 173 6 155 121 147
6 128 6 98 8 46 6 151 121 149
6 154 6 98 7 186 6 151 121 149
6 122 6 98 7 212 6 156 121 150
6 115 6 98 8 64 6 160 121 151
6 118 6 98 8 13 6 177 121 153
6 116 6 98 8 4 6 157 121 154
6 151 6 98 7 244 6 153 121 155
6 176 6 98 8 132 6 149 121 156
6 141 6 97 8 61 6 130 121 157
6 140 6 98 7 215 6 146 121 158
6 115 6 98 7 247 6 146 121 159
6 119 6 98 7 233 6 160 121 160
6 104 6 98 7 211 6 156 121 162
6 119 6 98 7 223 6 153 121 163
6 127 6 98 8 153 6 157 121 164
6 133 6 98 7 227 6 151 121 165
6 115 6 99 7 153 6 138 121 166
6 136 6 98 8 34 6 138 121 167
6 144 6 98 8 36 6 125 121 168
6 135 6 98 7 203 6 133 121 169
6 139 6 98 8 131 6 117 121 171
6 171 6 98 8 5 6 147 121 172
6 172 6 98 7 234 6 154 121 173
6 154 6 98 8 33 6 149 121 174
6 156 6 98 8 85 6 131 121 175
6 129 6 98 7 197 6 138 121 176
6 137 6 98 8 15 6 133 121 177
6 128 6 99 8 129 6 131 121 179
6 155 6 99 8 59 6 123 121 180
6 151 6 99 8 17 6 131 121 181
6 148 6 98 7 213 6 142 121 182
6 135 6 98 7 172 6 141 121 183
6 151 6 98 7 114 6 161 121 184
6 153 6 99 8 55 6 146 121 185
6 160 6 99 7 217 6 129 121 187
6 161 6 99 7 237 6 134 121 188
6 170 6 99 8 50 6 144 121 189
6 152 6 99 8 39 6 144 121 190
6 174 6 98 7 240 6 135 121 191
6 156 6 99 7 250 6 144 121 192
6 185 6 99 7 248 6 132 121 193
6 185 6 99 8 46 6 127 121 194
6 206 6 99 8 116 6 132 121 196
6 190 6 99 8 19 6 144 121 197
6 178 6 99 8 2 6 139 121 198
6 144 6 99 7 180 6 140 121 199
6 133 6 99 7 192 6 151 121 200
6 165 6 99 8 119 6 149 121 201
6 150 6 99 7 255 6 155 121 202
6 161 6 99 7 244 6 153 121 203
6 155 6 100 8 19 6 139 121 205
6 134 6 99 7 196 6 142 121 206
6 170 6 99 8 143 6 144 121 207
6 158 6 99 7 232 6 148 121 208
6 187 6 99 7 234 6 157 121 209
6 139 6 99 7 241 6 165 121 210
6 142 6 99 7 239 6 163 121 211
6 156 6 99 8 0 6 163 121 212
6 183 6 99 8 93 6 164 121 213
6 183 6 100 8 46 6 156 121 214
6 168 6 100 7 255 6 151 121 215
6 178 6 99 8 25 6 151 121 215
6 140 6 99 8 25 6 157 121 216
6 173 6 99 8 9 6 168 121 217
6 168 6 99 7 222 6 182 121 218
6 168 6 100 8 16 6 175 121 219
6 180 6 100 8 102 6 164 121 220
6 142 6 100 8 54 6 164 121 220
6 162 6 100 8 79 6 158 121 224
6 177 6 100 7 208 6 156 121 225
6 156 6 100 7 208 6 156 121 226
6 166 6 100 7 235 6 142 121 227
6 147 6 100 7 247 6 142 121 227
6 163 6 100 8 92 6 138 121 228
6 175 6 100 8 94 6 143 121 229
6 148 6 100 8 94 6 150 121 230
6 143 6 100 7 241 6 154 121 231
6 160 6 100 8 7 6 163 121 232
6 159 6 99 7 255 6 165 121 233
6 134 6 100 7 236 6 150 121 234
6 175 6 100 7 216 6 141 121 235
6 175 6 100 8 172 6 163 121 236
6 199 6 101 8 59 6 170 121 237
6 164 6 100 7 238 6 170 121 237
6 177 6 101 7 242 6 153 121 239
6 165 6 101 7 216 6 141 121 240
6 137 6 101 7 228 6 139 121 241
6 137 6 100 7 239 6 135 121 242
6 143 6 100 8 121 6 146 121 243
6 145 6 100 7 243 6 143 121 244
6 142 6 100 7 243 6 139 121 245
6 123 6 101 8 12 6 129 121 246
6 123 6 101 8 67 6 139 121 247
6 144 6 101 7 250 6 147 121 248
6 148 6 100 8 0 6 141 121 249
6 133 6 100 8 50 6 143 121 250
6 121 6 100 8 4 6 140 121 251
6 132 6 100 7 230 6 140 121 252
6 140 6 100 8 74 6 135 121 252
6 154 6 101 7 247 6 126 121 254
6 155 6 101 8 6 6 117 121 255
6 150 6 100 8 37 6 147 122 0
6 156 6 101 8 52 6 167 122 1
6 148 6 101 7 248 6 153 122 2
6 173 6 101 8 39 6 161 122 3
6 171 6 100 7 224 6 150 122 4
6 165 6 101 8 17 6 149 122 5
6 171 6 101 8 38 6 149 122 5
6 183 6 100 8 36 6 140 122 6
6 160 6 100 8 26 6 142 122 7
6 165 6 100 8 198 6 147 122 8
6 165 6 101 7 198 6 154 122 9
6 166 6 100 7 253 6 157 122 10
6 162 6 101 8 91 6 172 122 11
6 147 6 101 8 2 6 169 122 12
6 148 6 101 7 244 6 157 122 13
6 171 6 101 7 250 6 156 122 14
6 182 6 101 8 62 6 138 122 15
6 147 6 101 8 55 6 135 122 16
6 183 6 101 7 241 6 132 122 17
6 192 6 101 8 11 6 144 122 18
6 153 6 101 7 234 6 138 122 19
6 169 6 101 8 27 6 143 122 20
6 169 6 101 8 39 6 140 122 21
6 156 6 101 7 225 6 139 122 22
6 172 6 102 8 80 6 148 122 23
6 165 6 101 8 34 6 156 122 24
6 135 6 101 8 3 6 170 122 25
6 134 6 101 7 213 6 150 122 26
6 143 6 102 7 248 6 147 122 27
6 123 6 101 8 75 6 151 122 28
6 120 6 101 8 31 6 155 122 29
6 130 6 102 7 247 6 150 122 30
6 131 6 102 7 228 6 136 122 31
6 148 6 101 8 92 6 135 122 32
6 134 6 101 7 238 6 133 122 33
6 147 6 101 7 255 6 147 122 34
6 136 6 101 8 8 6 139 122 35
6 140 6 101 8 14 6 139 122 36
6 144 6 101 7 248 6 133 122 36
6 171 6 102 8 100 6 145 122 37
6 148 6 101 7 252 6 140 122 38
6 158 6 101 7 252 6 138 122 39
6 187 6 101 7 239 6 128 122 40
6 178 6 101 8 36 6 126 122 41
6 158 6 102 8 25 6 133 122 42
6 163 6 102 7 239 6 149 122 43
6 165 6 101 8 59 6 153 122 44
6 163 6 101 7 255 6 161 122 45
6 177 6 102 8 62 6 150 122 46
6 184 6 101 8 87 6 154 122 47
6 189 6 101 8 14 6 156 122 48
6 189 6 102 7 220 6 178 122 49
6 197 6 102 8 59 6 181 122 50
6 178 6 102 8 13 6 181 122 51
6 183 6 102 8 27 6 181 122 51
6 166 6 102 8 27 6 166 122 52
6 162 6 102 7 252 6 154 122 53
6 178 6 102 7 231 6 160 122 54
6 158 6 102 8 19 6 174 122 55
6 161 6 102 7 232 6 170 122 56
6 146 6 102 8 25 6 153 122 57
6 140 6 102 7 190 6 156 122 58
6 169 6 102 8 116 6 153 122 59
6 160 6 103 7 210 6 147 122 60
6 160 6 102 8 98 6 146 122 61
6 207 6 102 8 51 6 163 122 62
6 198 6 102 7 225 6 185 122 63
6 203 6 103 8 3 6 175 122 64
6 225 6 102 8 59 6 175 122 64
6 184 6 103 8 59 6 168 122 65
6 196 6 103 8 50 6 182 122 66
6 186 6 103 7 251 6 193 122 67
6 186 6 103 7 235 6 193 122 68
6 166 6 102 7 240 6 197 122 69
6 160 6 103 8 5 6 197 122 69
6 130 6 103 8 5 6 192 122 70
6 146 6 103 8 37 6 195 122 71
6 149 6 102 7 239 6 186 122 72
6 147 6 103 8 11 6 179 122 73
6 147 6 103 8 66 6 176 122 74
6 147 6 103 8 7 6 181 122 75
6 161 6 103 7 209 6 179 122 76
6 150 6 102 8 27 6 175 122 77
6 140 6 103 8 36 6 170 122 78
6 138 6 103 8 2 6 174 122 79
6 156 6 103 8 14 6 160 122 80
6 158 6 103 8 36 6 160 122 82
6 157 6 103 8 2 6 152 122 83
6 175 6 103 8 27 6 155 122 84
6 156 6 103 8 30 6 177 122 86
6 123 6 102 8 23 6 187 122 87
6 146 6 104 7 239 6 174 122 88
6 144 6 103 8 24 6 181 122 89
6 140 6 103 7 246 6 186 122 90
6 145 6 103 8 0 6 169 122 91
6 135 6 103 8 80 6 174 122 92
6 151 6 103 7 234 6 162 122 93
6 144 6 103 7 206 6 159 122 95
6 169 6 103 8 17 6 155 122 96
6 174 6 103 8 62 6 165 122 97
6 150 6 104 8 17 6 154 122 98
6 139 6 103 7 205 6 133 122 99
6 142 6 103 8 4 6 155 122 100
6 134 6 103 8 57 6 161 122 101
6 152 6 104 8 81 6 166 122 102
6 154 6 103 7 252 6 166 122 103
6 157 6 103 8 18 6 166 122 103
6 145 6 103 8 11 6 154 122 104
6 145 6 103 7 233 6 142 122 105
6 138 6 103 7 42 6 136 122 106
6 132 6 103 8 42 6 134 122 107
6 174 6 104 7 255 6 138 122 108
6 136 6 103 8 36 6 130 122 109
6 164 6 104 7 255 6 137 122 110
6 146 6 103 8 78 6 141 122 111
6 161 6 104 8 26 6 156 122 112
6 178 6 104 7 210 6 161 122 113
6 151 6 103 8 35 6 153 122 114
6 148 6 104 8 31 6 164 122 115
6 165 6 104 8 5 6 166 122 116
6 146 6 104 8 18 6 169 122 117
6 146 6 104 8 1 6 159 122 118
6 162 6 104 7 200 6 145 122 119
6 163 6 104 8 86 6 149 122 120
6 172 6 104 8 43 6 137 122 121
6 167 6 104 8 8 6 152 122 122
6 143 6 104 7 200 6 164 122 123
6 142 6 104 7 231 6 164 122 123
6 134 6 104 8 72 6 164 122 124
6 133 6 103 8 39 6 144 122 126
6 159 6 103 8 39 6 153 122 127
6 145 6 104 7 237 6 153 122 128
6 153 6 104 7 237 6 152 122 129
6 165 6 104 8 52 6 150 122 130
6 163 6 104 7 246 6 154 122 131
6 146 6 104 8 4 6 171 122 132
6 165 6 104 7 224 6 175 122 133
6 167 6 103 8 3 6 165 122 134
6 152 6 104 7 245 6 160 122 135
6 154 6 104 8 20 6 175 122 136
6 154 6 103 8 89 6 173 122 137
6 197 6 103 8 26 6 179 122 138
6 167 6 104 8 20 6 160 122 139
6 163 6 103 7 200 6 176 122 140
6 175 6 104 8 6 6 159 122 141
6 175 6 104 7 206 6 155 122 142
6 159 6 104 8 126 6 145 122 143
6 158 6 104 8 20 6 137 122 144
6 180 6 104 8 16 6 147 122 145
6 190 6 104 8 6 6 150 122 146
6 191 6 104 8 15 6 150 122 146
6 172 6 104 8 0 6 161 122 147
6 178 6 105 7 238 6 167 122 148
6 169 6 105 7 238 6 180 122 149
6 168 6 104 8 33 6 186 122 150
6 177 6 104 8 59 6 168 122 151
6 168 6 104 8 28 6 161 122 152
6 168 6 105 7 208 6 171 122 153
6 181 6 105 8 9 6 170 122 154
6 180 6 104 7 251 6 177 122 155
6 159 6 104 8 109 6 177 122 155
6 174 6 105 8 61 6 176 122 156
6 173 6 105 8 61 6 168 122 157
6 184 6 104 8 49 6 165 122 158
6 184 6 104 7 229 6 171 122 159
6 184 6 106 8 7 6 175 122 160
6 171 6 105 8 18 6 169 122 161
6 167 6 105 7 227 6 175 122 162
6 176 6 105 7 223 6 171 122 163
6 161 6 105 8 15 6 161 122 164
6 158 6 105 7 236 6 167 122 165
6 169 6 105 8 49 6 148 122 166
6 186 6 105 8 68 6 164 122 167
6 186 6 105 8 79 6 164 122 168
6 188 6 105 8 42 6 178 122 169
6 193 6 105 7 242 6 156 122 171
6 163 6 105 8 6 6 159 122 172
6 182 6 105 8 26 6 169 122 173
6 171 6 106 8 16 6 157 122 174
6 157 6 106 7 233 6 157 122 175
6 160 6 105 7 245 6 156 122 175
6 143 6 105 8 50 6 163 122 176
6 164 6 105 8 82 6 156 122 178
6 175 6 105 8 13 6 159 122 179
6 164 6 105 7 229 6 166 122 180
6 190 6 105 7 254 6 146 122 181
6 180 6 105 8 25 6 152 122 182
6 176 6 106 8 8 6 140 122 183
6 160 6 106 8 42 6 141 122 184
6 171 6 106 7 222 6 162 122 185
6 161 6 106 8 34 6 181 122 186
6 168 6 106 8 67 6 181 122 186
6 189 6 106 8 5 6 167 122 187
6 169 6 106 8 45 6 160 122 188
6 168 6 105 7 232 6 173 122 189
6 193 6 106 7 232 6 181 122 190
6 167 6 105 8 22 6 182 122 191
6 134 6 106 7 244 6 178 122 192
6 147 6 106 8 4 6 164 122 193
6 133 6 106 8 12 6 159 122 194
6 154 6 106 8 255 6 143 122 195
6 150 6 106 7 255 6 157 122 196
6 143 6 106 8 4 6 161 122 197
6 135 6 106 8 23 6 166 122 198
6 125 6 106 8 23 6 171 122 199
6 152 6 106 8 32 6 169 122 200
6 144 6 106 8 27 6 159 122 201
6 130 6 106 7 218 6 148 122 202
6 134 6 106 7 240 6 159 122 203
6 141 6 106 7 255 6 153 122 204
6 139 6 106 8 28 6 152 122 205
6 123 6 106 7 253 6 153 122 206
6 123 6 106 8 37 6 140 122 207
6 135 6 106 7 253 6 157 122 208
6 134 6 106 7 255 6 151 122 209
6 134 6 106 8 7 6 141 122 210
6 124 6 106 8 23 6 154 122 211
6 134 6 106 8 89 6 167 122 212
6 123 6 106 8 38 6 167 122 212
6 157 6 106 7 225 6 151 122 213
6 153 6 106 8 9 6 139 122 214
6 148 6 105 8 47 6 150 122 215
6 129 6 106 8 47 6 159 122 216
6 158 6 106 8 7 6 157 122 217
6 150 6 106 8 41 6 157 122 218
6 105 6 105 8 6 6 147 122 219
6 137 6 105 7 201 6 151 122 220
6 157 6 106 7 241 6 162 122 221
6 128 6 106 8 15 6 154 122 222
6 161 6 106 8 38 6 147 122 224
6 161 6 106 7 237 6 145 122 225
6 161 6 106 8 4 6 164 122 226
6 175 6 106 8 22 6 157 122 227
6 150 6 106 8 4 6 152 122 228
6 152 6 106 8 4 6 165 122 229
6 137 6 106 8 24 6 171 122 230
6 139 6 106 7 253 6 153 122 231
6 165 6 106 8 0 6 152 122 232
6 139 6 106 8 25 6 149 122 233
6 158 6 106 8 9 6 153 122 234
6 148 6 106 7 239 6 152 122 235
6 162 6 106 8 56 6 137 122 236
6 151 6 106 7 233 6 133 122 237
6 166 6 106 8 45 6 154 122 238
6 132 6 107 8 15 6 154 122 238
6 151 6 106 8 56 6 157 122 239
6 139 6 107 8 56 6 155 122 240
6 175 6 107 7 216 6 167 122 241
6 175 6 106 8 36 6 159 122 242
6 168 6 106 7 241 6 165 122 243
6 152 6 106 8 8 6 165 122 243
6 156 6 106 8 8 6 147 122 244
6 166 6 106 8 3 6 150 122 245
6 182 6 107 7 219 6 155 122 246
6 182 6 106 8 101 6 153 122 247
6 180 6 106 8 11 6 141 122 248
6 173 6 106 8 51 6 141 122 248
6 181 6 106 7 245 6 140 122 249
6 183 6 106 7 245 6 139 122 250
6 188 6 106 7 233 6 152 122 251
6 175 6 106 8 0 6 149 122 252
6 169 6 107 8 29 6 150 122 253
6 179 6 107 7 226 6 170 122 254
6 189 6 107 8 37 6 184 123 2
6 179 6 107 7 237 6 187 123 3
6 173 6 107 7 254 6 178 123 4
6 177 6 107 8 23 6 170 123 5
6 183 6 107 8 26 6 186 123 7
6 196 6 107 8 21 6 178 123 8
6 185 6 107 8 6 6 151 123 9
6 196 6 107 8 4 6 144 123 10
6 205 6 108 7 228 6 164 123 11
6 229 6 107 8 28 6 158 123 12
6 241 6 107 8 74 6 154 123 13
6 193 6 107 8 25 6 163 123 14
6 220 6 108 8 15 6 181 123 15
6 201 6 107 8 15 6 176 123 16
6 197 6 107 8 28 6 183 123 17
6 211 6 108 8 42 6 183 123 18
6 193 6 108 7 246 6 189 123 19
6 188 6 108 8 22 6 158 123 21
6 169 6 108 7 221 6 172 123 22
6 190 6 108 8 37 6 170 123 23
6 181 6 108 7 225 6 162 123 24
6 204 6 108 8 63 6 162 123 25
6 195 6 108 8 58 6 163 123 26
6 211 6 108 8 20 6 153 123 27
6 187 6 108 8 25 6 146 123 28
6 147 6 108 8 11 6 141 123 29
6 180 6 108 8 48 6 161 123 30
6 170 6 108 7 243 6 183 123 31
6 152 6 109 8 29 6 180 123 32
6 164 6 108 8 5 6 175 123 33
6 169 6 109 7 255 6 150 123 34
6 142 6 108 7 244 6 146 123 35
6 150 6 108 7 246 6 165 123 36
6 169 6 109 7 253 6 157 123 37
6 166 6 109 8 49 6 154 123 38
6 152 6 108 8 13 6 151 123 39
6 155 6 108 7 254 6 141 123 40
6 116 6 108 8 6 6 141 123 41
6 144 6 108 8 3 6 140 123 42
6 155 6 108 8 16 6 127 123 43
6 152 6 108 7 247 6 148 123 44
6 154 6 109 8 35 6 135 123 45
6 122 6 109 8 39 6 138 123 46
6 124 6 108 7 179 6 125 123 47
6 141 6 108 8 56 6 139 123 48
6 134 6 108 8 0 6 141 123 49
6 155 6 109 8 10 6 121 123 50
6 129 6 109 8 16 6 129 123 51
6 136 6 109 8 39 6 140 123 52
6 146 6 108 8 1 6 139 123 53
6 192 6 109 8 31 6 147 123 58
6 150 6 109 7 245 6 137 123 59
6 181 6 109 8 24 6 133 123 60
6 177 6 108 8 46 6 138 123 61
6 170 6 109 7 239 6 127 123 62
6 170 6 109 8 22 6 135 123 63
6 150 6 109 8 22 6 139 123 64
6 182 6 109 7 244 6 125 123 65
6 177 6 109 7 237 6 141 123 66
6 149 6 109 8 24 6 126 123 67
6 182 6 109 8 0 6 119 123 68
6 182 6 109 8 35 6 130 123 69
6 191 6 109 7 239 6 134 123 70
6 176 6 109 8 47 6 123 123 71
6 195 6 110 8 28 6 140 123 72
6 197 6 109 8 17 6 157 123 73
6 164 6 109 8 10 6 156 123 74
6 168 6 109 8 14 6 156 123 74
6 157 6 109 7 252 6 148 123 75
6 179 6 109 8 17 6 132 123 76
6 186 6 109 8 17 6 139 123 77
6 185 6 110 7 238 6 141 123 78
6 191 6 110 7 226 6 136 123 79
6 200 6 110 8 52 6 136 123 80
6 195 6 110 8 56 6 125 123 81
6 233 6 109 8 22 6 128 123 82
6 233 6 110 8 2 6 138 123 83
6 215 6 110 8 21 6 159 123 84
6 196 6 110 8 47 6 159 123 84
6 208 6 109 8 33 6 164 123 85
6 220 6 110 8 33 6 172 123 86
6 200 6 110 8 14 6 187 123 87
6 200 6 110 7 244 6 186 123 88
6 173 6 110 8 30 6 199 123 89
6 196 6 110 8 7 6 188 123 90
6 178 6 110 8 12 6 205 123 91
6 185 6 110 8 45 6 185 123 92
6 191 6 110 8 5 6 193 123 93
6 195 6 110 7 252 6 173 123 95
6 218 6 110 8 26 6 175 123 96
6 217 6 111 8 54 6 183 123 97
6 205 6 110 7 230 6 199 123 98
6 188 6 110 7 237 6 187 123 99
6 190 6 110 8 19 6 196 123 100
6 200 6 111 8 23 6 201 123 101
6 197 6 111 8 67 6 194 123 102
6 211 6 111 8 7 6 189 123 104
6 216 6 111 8 20 6 182 123 105
6 213 6 111 8 10 6 192 123 106
6 204 6 111 7 244 6 191 123 107
6 205 6 111 8 32 6 187 123 108
6 206 6 111 8 16 6 203 123 109
6 199 6 112 8 14 6 211 123 110
6 203 6 112 7 236 6 220 123 111
6 203 6 112 7 243 6 223 123 112
6 195 6 112 7 234 6 207 123 113
6 188 6 111 8 30 6 187 123 114
6 185 6 111 8 22 6 188 123 115
6 189 6 112 8 19 6 199 123 116
6 186 6 111 8 17 6 204 123 117
6 189 6 112 8 16 6 198 123 118
6 183 6 112 8 3 6 195 123 119
6 175 6 112 7 253 6 199 123 120
6 170 6 112 8 13 6 195 123 121
6 163 6 112 8 34 6 173 123 122
6 158 6 112 8 13 6 173 123 123
6 154 6 112 7 247 6 187 123 124
6 154 6 111 8 30 6 196 123 125
6 159 6 112 8 40 6 194 123 126
6 161 6 112 8 37 6 178 123 127
6 157 6 112 8 7 6 191 123 128
6 157 6 112 8 19 6 191 123 129
6 156 6 112 8 33 6 198 123 130
6 157 6 112 8 24 6 193 123 131
6 155 6 112 8 33 6 190 123 132
6 157 6 112 7 246 6 207 123 133
6 152 6 112 7 236 6 192 123 134
6 154 6 113 8 34 6 177 123 135
6 150 6 112 8 0 6 180 123 136
6 157 6 112 8 24 6 188 123 137
6 153 6 112 8 37 6 179 123 138
6 156 6 112 7 242 6 192 123 139
6 157 6 112 8 29 6 193 123 140
6 158 6 112 8 11 6 205 123 141
6 152 6 112 8 4 6 205 123 142
6 151 6 112 8 7 6 202 123 143
6 154 6 112 8 13 6 209 123 144
6 163 6 112 8 18 6 192 123 145
6 144 6 112 8 16 6 200 123 146
6 143 6 112 8 22 6 202 123 147
6 145 6 112 8 23 6 196 123 148
6 141 6 113 8 19 6 208 123 150
6 156 6 113 8 13 6 212 123 151
6 165 6 112 8 0 6 213 123 152
6 158 6 112 7 250 6 206 123 153
6 157 6 112 7 247 6 189 123 154
6 158 6 112 8 24 6 191 123 155
6 158 6 112 8 6 6 203 123 156
6 153 6 112 8 4 6 203 123 157
6 149 6 112 7 241 6 198 123 158
6 149 6 112 8 2 6 217 123 159
6 151 6 112 8 40 6 218 123 160
6 143 6 112 8 40 6 217 123 161
6 145 6 112 8 0 6 224 123 162
6 137 6 112 8 17 6 211 123 163
6 127 6 112 8 11 6 211 123 163
6 143 6 112 8 4 6 216 123 164
6 152 6 112 8 4 6 211 123 165
6 144 6 113 8 10 6 196 123 166
6 154 6 113 8 20 6 201 123 167
6 154 6 112 7 244 6 198 123 168
6 162 6 112 8 40 6 212 123 169
6 157 6 112 8 10 6 212 123 169
6 161 6 112 8 25 6 217 123 170
6 159 6 112 8 25 6 203 123 171
6 147 6 112 8 0 6 187 123 172
6 147 6 112 7 241 6 186 123 173
6 154 6 113 8 27 6 185 123 174
6 149 6 113 8 38 6 212 123 175
6 166 6 112 8 14 6 212 123 175
6 157 6 112 8 27 6 208 123 177
6 145 6 112 8 25 6 208 123 177
6 152 6 113 8 25 6 208 123 178
6 154 6 113 8 24 6 197 123 179
6 146 6 113 8 19 6 203 123 180
6 146 6 112 8 44 6 198 123 181
6 153 6 112 8 31 6 211 123 182
6 144 6 112 8 9 6 203 123 183
6 146 6 113 8 19 6 194 123 184
6 142 6 113 8 8 6 185 123 185
6 158 6 113 8 5 6 184 123 186
6 152 6 113 8 12 6 172 123 187
6 150 6 113 7 251 6 186 123 188
6 155 6 112 8 26 6 184 123 189
6 151 6 113 8 28 6 175 123 190
6 152 6 113 8 16 6 199 123 192
6 149 6 113 8 18 6 185 123 193
6 140 6 112 8 14 6 171 123 194
6 132 6 112 8 23 6 185 123 195
6 133 6 113 8 25 6 185 123 196
6 153 6 113 8 13 6 175 123 196
6 161 6 113 8 24 6 176 123 197
6 166 6 113 8 13 6 186 123 198
6 139 6 113 8 13 6 199 123 199
6 140 6 112 8 14 6 196 123 200
6 162 6 113 8 11 6 175 123 201
6 156 6 113 8 10 6 165 123 205
6 149 6 112 8 13 6 175 123 206
6 142 6 112 8 18 6 175 123 206
6 166 6 113 8 7 6 162 123 208
6 150 6 113 8 6 6 170 123 209
6 140 6 113 8 16 6 170 123 209
6 156 6 113 8 8 6 165 123 211
6 152 6 113 8 14 6 156 123 212
6 165 6 113 8 10 6 156 123 213
6 167 6 113 8 3 6 174 123 214
6 144 6 113 8 32 6 178 123 215
6 147 6 113 8 2 6 177 123 216
6 153 6 112 8 20 6 185 123 217
6 159 6 113 8 21 6 175 123 218
6 155 6 113 8 13 6 166 123 219
6 148 6 112 8 26 6 163 123 220
6 152 6 113 7 255 6 172 123 221
6 153 6 113 8 23 6 168 123 222
6 146 6 113 8 31 6 156 123 223
6 150 6 113 7 250 6 172 123 224
6 153 6 113 8 21 6 178 123 225
6 153 6 113 7 249 6 177 123 226
6 148 6 113 8 20 6 181 123 227
6 143 6 113 8 7 6 175 123 228
6 144 6 113 8 14 6 155 123 229
6 146 6 113 8 16 6 168 123 230
6 156 6 113 8 16 6 158 123 231
6 146 6 113 8 8 6 163 123 232
6 153 6 112 8 14 6 176 123 233
6 153 6 113 8 14 6 171 123 234
6 141 6 113 8 20 6 162 123 235
6 163 6 113 8 9 6 178 123 236
6 157 6 112 8 9 6 178 123 237
6 156 6 113 8 14 6 165 123 238
6 151 6 113 8 16 6 158 123 239
6 140 6 113 8 16 6 175 123 240
6 147 6 113 8 21 6 169 123 242
6 162 6 113 8 10 6 171 123 243
6 163 6 113 8 18 6 178 123 244
6 158 6 113 8 21 6 161 123 245
6 141 6 113 8 19 6 161 123 245
6 142 6 113 8 25 6 163 123 246
6 157 6 113 8 18 6 173 123 247
6 160 6 113 8 18 6 178 123 248
6 158 6 113 8 17 6 188 123 249
6 167 6 113 8 1 6 183 123 250
6 167 6 113 8 38 6 181 123 251
6 156 6 113 8 15 6 182 123 252
6 168 6 112 8 19 6 182 123 252
6 154 6 113 8 18 6 178 123 253
6 152 6 113 8 13 6 166 123 254
6 163 6 113 8 13 6 175 123 255
6 153 6 113 8 3 6 179 124 0
6 152 6 113 7 254 6 183 124 1
6 152 6 112 8 39 6 175 124 2
6 147 6 112 8 1 6 162 124 3
6 150 6 113 8 32 6 162 124 3
6 147 6 113 8 22 6 165 124 4
6 155 6 113 8 22 6 164 124 5
6 149 6 113 8 24 6 164 124 6
6 149 6 113 8 27 6 155 124 7
6 154 6 113 8 43 6 174 124 8
6 154 6 113 8 29 6 172 124 9
6 153 6 112 8 26 6 170 124 10
6 138 6 113 8 22 6 170 124 10
6 138 6 112 8 17 6 173 124 11
6 150 6 113 8 17 6 183 124 12
6 154 6 112 8 29 6 179 124 13
6 152 6 113 8 21 6 171 124 14
6 152 6 113 8 14 6 158 124 15
6 151 6 113 8 28 6 166 124 16
6 150 6 113 8 22 6 163 124 17
6 152 6 113 8 21 6 158 124 18
6 149 6 112 8 21 6 158 124 19
6 162 6 113 8 21 6 158 124 20
6 152 6 113 8 14 6 187 124 22
6 154 6 113 8 25 6 184 124 23
6 150 6 113 8 3 6 173 124 24
6 151 6 114 8 34 6 167 124 25
6 153 6 113 8 35 6 161 124 26
6 153 6 113 8 17 6 163 124 27
6 145 6 113 8 16 6 191 124 28
6 147 6 113 8 21 6 177 124 29
6 140 6 113 8 21 6 173 124 30
6 161 6 113 8 7 6 176 124 31
6 157 6 113 8 11 6 167 124 32
6 147 6 113 8 11 6 163 124 34
6 135 6 113 8 15 6 166 124 35
6 151 6 113 7 254 6 177 124 36
6 151 6 113 8 31 6 191 124 37
6 148 6 113 8 16 6 186 124 38
6 157 6 113 8 39 6 174 124 39
6 158 6 113 8 3 6 158 124 40
6 158 6 113 8 11 6 174 124 41
6 152 6 113 8 0 6 175 124 42
6 154 6 113 7 253 6 169 124 43
6 152 6 113 8 38 6 183 124 44
6 157 6 113 7 249 6 185 124 45
6 153 6 113 7 254 6 173 124 46
6 152 6 114 8 22 6 167 124 47
6 153 6 114 8 1 6 174 124 48
6 155 6 113 8 12 6 181 124 49
6 154 6 113 8 12 6 186 124 50
6 152 6 114 8 7 6 172 124 51
6 157 6 114 8 6 6 166 124 52
6 147 6 113 8 8 6 164 124 53
6 144 6 113 8 24 6 164 124 54
6 152 6 113 8 14 6 163 124 54
6 155 6 114 8 14 6 157 124 55
6 147 6 113 8 15 6 174 124 57
6 146 6 113 8 4 6 174 124 57
6 150 6 113 8 15 6 172 124 58
6 152 6 113 8 22 6 188 124 59
6 154 6 114 8 16 6 183 124 60
6 156 6 113 8 16 6 180 124 61
6 155 6 113 8 20 6 165 124 62
6 152 6 114 8 13 6 161 124 63
6 153 6 113 8 16 6 149 124 64
6 149 6 113 7 252 6 162 124 65
6 151 6 114 7 230 6 161 124 66
6 152 6 113 8 18 6 172 124 67
6 158 6 114 8 13 6 168 124 68
6 158 6 114 8 15 6 179 124 69
6 156 6 113 8 15 6 161 124 70
6 149 6 114 8 3 6 160 124 71
6 148 6 113 8 12 6 163 124 72
6 154 6 113 8 11 6 153 124 73
6 154 6 113 8 11 6 165 124 74
6 141 6 113 8 17 6 165 124 74
6 155 6 114 8 11 6 176 124 75
6 157 6 114 8 20 6 168 124 76
6 158 6 113 8 15 6 172 124 77
6 147 6 113 8 15 6 180 124 78
6 157 6 113 8 18 6 170 124 79
6 157 6 113 7 242 6 163 124 80
6 156 6 113 8 7 6 167 124 81
6 152 6 114 8 9 6 167 124 82
6 148 6 113 8 16 6 175 124 82
6 157 6 114 8 16 6 165 124 83
6 157 6 113 8 17 6 172 124 88
6 157 6 113 7 239 6 168 124 89
6 156 6 114 7 252 6 159 124 90
6 152 6 114 8 17 6 174 124 94
6 152 6 113 8 15 6 169 124 95
6 153 6 114 8 13 6 169 124 96
6 152 6 114 8 16 6 176 124 96
6 145 6 114 8 16 6 177 124 97
6 144 6 114 8 10 6 186 124 98
6 153 6 113 8 17 6 172 124 99
6 151 6 113 8 9 6 180 124 100
6 156 6 114 7 255 6 171 124 101
6 156 6 113 8 13 6 175 124 102
6 154 6 114 7 246 6 182 124 103
6 155 6 114 8 10 6 159 124 104
6 151 6 113 8 20 6 159 124 104
6 147 6 113 8 20 6 174 124 105
6 154 6 114 8 17 6 178 124 106
6 149 6 114 8 18 6 170 124 107
6 150 6 114 8 17 6 170 124 108
6 152 6 114 8 15 6 169 124 109
6 150 6 113 8 16 6 176 124 110
6 156 6 114 8 22 6 180 124 111
6 151 6 114 8 2 6 169 124 113
6 147 6 113 8 23 6 153 124 114
6 148 6 114 8 20 6 167 124 115
6 156 6 114 8 23 6 170 124 116
6 155 6 113 8 29 6 181 124 117
6 145 6 114 8 16 6 175 124 118
6 158 6 114 8 4 6 188 124 119
6 149 6 114 8 18 6 188 124 120
6 156 6 114 8 11 6 180 124 120
6 147 6 113 8 32 6 175 124 121
6 157 6 114 8 16 6 187 124 122
6 154 6 113 8 12 6 189 124 123
6 156 6 113 8 9 6 182 124 124
6 160 6 113 8 11 6 179 124 126
6 157 6 114 8 18 6 179 124 126
6 154 6 114 8 21 6 173 124 127
6 156 6 113 8 9 6 176 124 128
6 145 6 114 8 12 6 184 124 129
6 140 6 114 8 13 6 196 124 130
6 154 6 114 8 8 6 188 124 131
6 156 6 114 8 22 6 167 124 132
6 148 6 114 8 20 6 166 124 133
6 150 6 114 8 20 6 170 124 134
6 146 6 114 8 16 6 172 124 135
6 153 6 113 8 11 6 169 124 136
6 156 6 113 8 23 6 172 124 137
6 156 6 114 8 1 6 184 124 138
6 156 6 114 8 10 6 173 124 139
6 161 6 114 8 8 6 192 124 140
6 154 6 114 8 8 6 191 124 141
6 152 6 114 7 249 6 170 124 142
6 153 6 114 8 4 6 174 124 143
6 148 6 114 8 11 6 176 124 144
6 156 6 114 8 8 6 177 124 145
6 155 6 114 8 8 6 189 124 146
6 150 6 114 8 18 6 184 124 147
6 151 6 114 8 16 6 194 124 148
6 151 6 114 8 17 6 191 124 150
6 153 6 114 8 15 6 202 124 151
6 153 6 114 8 15 6 196 124 152
6 155 6 114 8 19 6 188 124 154
6 161 6 114 8 15 6 179 124 155
6 153 6 114 8 2 6 165 124 156
6 153 6 114 8 17 6 167 124 157
6 154 6 114 8 2 6 185 124 158
6 158 6 114 8 26 6 175 124 159
6 155 6 114 7 243 6 158 124 160
6 156 6 114 8 21 6 181 124 161
6 161 6 114 8 9 6 187 124 162
6 140 6 114 8 19 6 188 124 163
6 155 6 114 8 16 6 167 124 165
6 149 6 114 8 13 6 170 124 166
6 150 6 114 8 26 6 172 124 167
6 156 6 114 8 13 6 172 124 168
6 157 6 114 8 18 6 186 124 169
6 153 6 114 8 12 6 193 124 170
6 150 6 114 8 9 6 182 124 171
6 151 6 114 8 5 6 175 124 172
6 150 6 114 8 9 6 177 124 174
6 146 6 114 8 8 6 164 124 175
6 152 6 114 8 17 6 180 124 176
6 140 6 114 8 20 6 180 124 177
6 158 6 114 8 10 6 180 124 177
6 155 6 114 8 20 6 189 124 178
6 158 6 114 8 3 6 171 124 180
6 157 6 114 8 8 6 189 124 181
6 153 6 114 8 1 6 181 124 182
6 155 6 114 8 11 6 171 124 183
6 155 6 114 8 13 6 179 124 184
6 155 6 114 8 14 6 177 124 185
6 164 6 114 8 7 6 172 124 186
6 151 6 114 8 19 6 172 124 186
6 150 6 114 8 15 6 182 124 187
6 153 6 115 8 15 6 187 124 188
6 148 6 114 8 4 6 178 124 189
6 145 6 114 8 4 6 170 124 190
6 145 6 114 8 22 6 188 124 191
6 152 6 114 8 16 6 198 124 192
6 155 6 114 8 2 6 191 124 193
6 158 6 114 8 32 6 191 124 194
6 159 6 114 7 254 6 184 124 195
6 158 6 114 8 18 6 183 124 196
6 161 6 114 8 20 6 177 124 197
6 155 6 114 8 21 6 174 124 198
6 155 6 114 8 13 6 192 124 199
6 143 6 114 8 3 6 191 124 200
6 160 6 114 8 5 6 191 124 201
6 154 6 115 8 13 6 185 124 202
6 158 6 114 8 13 6 180 124 203
6 160 6 115 8 15 6 178 124 204
6 153 6 114 8 6 6 167 124 206
6 149 6 114 8 20 6 178 124 207
6 150 6 114 8 25 6 174 124 208
6 152 6 114 8 21 6 178 124 209
6 154 6 114 8 16 6 171 124 210
6 157 6 114 8 7 6 186 124 211
6 156 6 115 8 10 6 183 124 212
6 154 6 114 8 18 6 183 124 213
6 155 6 115 8 22 6 175 124 214
6 148 6 114 8 22 6 192 124 215
6 149 6 114 8 11 6 185 124 217
6 146 6 114 8 21 6 191 124 218
6 157 6 114 7 255 6 201 124 219
6 153 6 114 8 25 6 192 124 220
6 151 6 114 8 17 6 177 124 221
6 161 6 114 8 17 6 188 124 222
6 156 6 114 8 19 6 176 124 223
6 149 6 115 8 17 6 172 124 225
6 155 6 114 8 12 6 180 124 226
6 152 6 114 8 23 6 170 124 227
6 159 6 114 8 19 6 175 124 228
6 153 6 115 8 35 6 193 124 229
6 152 6 115 8 9 6 186 124 230
6 148 6 115 8 13 6 183 124 231
6 154 6 115 8 16 6 174 124 233
6 155 6 115 8 14 6 176 124 234
6 154 6 114 8 12 6 186 124 235
6 153 6 115 8 10 6 185 124 236
6 157 6 115 8 11 6 178 124 237
6 152 6 114 8 9 6 176 124 238
6 152 6 114 8 15 6 165 124 240
6 158 6 115 8 4 6 171 124 241
6 156 6 115 8 4 6 176 124 242
6 154 6 115 8 13 6 183 124 243
6 153 6 115 8 16 6 180 124 244
6 157 6 114 8 17 6 169 124 245
6 154 6 115 8 19 6 179 124 246
6 151 6 115 8 8 6 179 124 248
6 153 6 115 8 7 6 160 124 249
6 156 6 115 8 7 6 166 124 250
6 154 6 114 8 15 6 184 124 251
6 152 6 115 8 18 6 190 124 252
6 149 6 114 8 25 6 186 124 253
6 154 6 115 8 16 6 167 124 254
6 155 6 115 8 13 6 183 124 255
6 161 6 115 7 254 6 169 125 1
6 152 6 114 8 16 6 183 125 2
6 154 6 115 8 9 6 183 125 3
6 148 6 115 7 253 6 188 125 4
6 156 6 115 8 14 6 189 125 5
6 157 6 115 8 23 6 195 125 6
6 151 6 115 8 24 6 173 125 7
6 153 6 115 8 14 6 195 125 8
6 155 6 115 8 13 6 190 125 9
6 153 6 114 8 11 6 179 125 10
6 152 6 115 8 30 6 161 125 11
6 155 6 115 8 20 6 172 125 12
6 159 6 115 8 20 6 186 125 13
6 155 6 115 8 20 6 198 125 14
6 149 6 115 8 21 6 192 125 15
6 153 6 115 8 10 6 200 125 16
6 153 6 114 8 11 6 195 125 17
6 153 6 114 8 15 6 195 125 18
6 159 6 115 8 6 6 200 125 19
6 157 6 114 8 14 6 179 125 20
6 156 6 115 8 11 6 179 125 21
6 158 6 114 8 2 6 177 125 21
6 150 6 115 8 11 6 170 125 22
6 160 6 115 8 11 6 185 125 24
6 145 6 115 8 17 6 200 125 25
6 147 6 115 8 17 6 201 125 26
6 151 6 115 8 4 6 207 125 27
6 151 6 115 8 18 6 183 125 28
6 153 6 115 8 14 6 187 125 29
6 151 6 115 8 10 6 199 125 30
6 152 6 115 8 19 6 190 125 31
6 154 6 115 8 17 6 188 125 32
6 159 6 115 8 11 6 183 125 33
6 158 6 115 8 17 6 181 125 34
6 153 6 115 8 18 6 166 125 35
6 152 6 115 8 10 6 172 125 37
6 144 6 115 8 25 6 171 125 38
6 157 6 115 8 19 6 178 125 39
6 151 6 115 8 21 6 185 125 40
6 153 6 115 8 11 6 174 125 41
6 152 6 115 8 35 6 178 125 42
6 152 6 115 8 4 6 164 125 43
6 152 6 115 8 16 6 172 125 44
6 153 6 115 8 10 6 182 125 45
6 156 6 115 7 243 6 171 125 46
6 151 6 115 8 13 6 161 125 47
6 154 6 115 8 17 6 172 125 48
6 153 6 115 8 12 6 180 125 50
6 157 6 115 8 16 6 189 125 51
6 153 6 115 8 3 6 168 125 52
6 150 6 115 8 7 6 176 125 53
6 151 6 115 8 15 6 171 125 54
6 151 6 115 8 6 6 172 125 55
6 147 6 115 8 10 6 187 125 57
6 151 6 116 8 9 6 172 125 58
6 152 6 115 8 19 6 179 125 59
6 153 6 115 8 13 6 181 125 60
6 153 6 115 8 8 6 186 125 61
6 157 6 115 8 12 6 188 125 62
6 155 6 115 8 23 6 179 125 63
6 158 6 115 8 12 6 181 125 65
6 152 6 115 8 10 6 188 125 66
6 146 6 114 8 19 6 185 125 67
6 151 6 115 8 9 6 173 125 68
6 157 6 115 8 5 6 177 125 69
6 151 6 115 8 16 6 171 125 70
6 151 6 115 8 16 6 189 125 71
6 158 6 115 8 6 6 191 125 72
6 144 6 115 8 14 6 172 125 74
6 147 6 115 8 8 6 168 125 75
6 152 6 116 8 10 6 182 125 76
6 150 6 115 8 7 6 175 125 77
6 151 6 115 8 6 6 170 125 82
6 157 6 115 8 15 6 171 125 83
6 159 6 115 8 26 6 158 125 84
6 153 6 115 7 254 6 168 125 85
6 153 6 115 8 6 6 183 125 86
6 151 6 115 8 34 6 183 125 87
6 157 6 115 8 10 6 172 125 88
6 152 6 116 8 7 6 176 125 89
6 148 6 116 8 11 6 185 125 90
6 144 6 115 8 13 6 196 125 92
6 149 6 115 8 19 6 192 125 93
6 150 6 115 8 16 6 184 125 94
6 165 6 115 8 15 6 159 125 95
6 152 6 116 8 10 6 159 125 96
6 159 6 116 8 19 6 172 125 96
6 160 6 115 8 14 6 176 125 97
6 155 6 115 8 19 6 169 125 98
6 160 6 116 8 19 6 170 125 99
6 155 6 116 8 11 6 170 125 100
6 155 6 115 8 23 6 184 125 101
6 153 6 115 8 4 6 200 125 102
6 153 6 115 8 15 6 205 125 103
6 153 6 115 8 6 6 189 125 104
6 151 6 116 8 15 6 194 125 105
6 165 6 116 8 4 6 181 125 106
6 161 6 115 8 17 6 181 125 106
6 158 6 115 8 15 6 175 125 107
6 148 6 116 8 15 6 178 125 108
6 151 6 115 8 19 6 182 125 109
6 151 6 116 8 5 6 171 125 110
6 154 6 116 8 16 6 176 125 111
6 148 6 115 8 5 6 176 125 112
6 148 6 115 7 246 6 176 125 113
6 152 6 116 8 9 6 183 125 114
6 150 6 116 8 3 6 191 125 115
6 152 6 116 8 13 6 187 125 116
6 150 6 115 8 21 6 196 125 117
6 160 6 115 8 2 6 196 125 118
6 158 6 116 8 21 6 180 125 118
6 166 6 115 8 6 6 179 125 119
6 155 6 115 8 10 6 193 125 121
6 158 6 115 8 12 6 184 125 122
6 152 6 115 7 248 6 168 125 123
6 149 6 116 8 12 6 166 125 124
6 149 6 116 8 16 6 175 125 125
6 150 6 116 8 3 6 190 125 126
6 149 6 115 8 11 6 178 125 128
6 145 6 116 8 16 6 169 125 129
6 157 6 115 8 25 6 179 125 130
6 153 6 115 8 7 6 179 125 131
6 153 6 116 7 252 6 176 125 132
6 154 6 115 8 5 6 184 125 133
6 151 6 115 8 45 6 178 125 134
6 152 6 116 8 31 6 171 125 135
6 151 6 115 8 14 6 183 125 136
6 160 6 115 8 16 6 188 125 137
6 158 6 116 8 18 6 182 125 139
6 152 6 116 8 18 6 169 125 140
6 156 6 116 8 7 6 177 125 142
6 150 6 116 8 9 6 172 125 143
6 151 6 115 7 250 6 169 125 144
6 159 6 116 8 10 6 172 125 145
6 156 6 116 8 12 6 194 125 146
6 150 6 115 8 21 6 197 125 148
6 159 6 116 8 18 6 182 125 149
6 154 6 116 8 20 6 185 125 150
6 156 6 115 8 10 6 196 125 151
6 154 6 116 8 8 6 177 125 152
6 144 6 116 8 16 6 177 125 152
6 160 6 116 8 7 6 168 125 153
6 145 6 115 8 9 6 180 125 154
6 151 6 115 8 9 6 189 125 155
6 145 6 116 8 8 6 190 125 156
6 153 6 116 8 12 6 178 125 157
6 146 6 116 8 26 6 174 125 158
6 154 6 116 8 52 6 180 125 159
6 154 6 116 8 42 6 179 125 160
6 154 6 116 8 11 6 182 125 161
6 154 6 116 8 10 6 196 125 162
6 159 6 116 8 13 6 196 125 163
6 157 6 115 8 5 6 191 125 164
6 157 6 116 8 5 6 177 125 165
6 151 6 116 8 37 6 173 125 166
6 156 6 116 8 16 6 171 125 167
6 151 6 115 8 23 6 163 125 168
6 157 6 116 8 14 6 165 125 169
6 151 6 116 8 22 6 165 125 170
6 164 6 116 8 2 6 176 125 171
6 165 6 116 8 8 6 190 125 172
6 154 6 116 8 1 6 188 125 173
6 153 6 116 8 6 6 193 125 174
6 140 6 116 8 16 6 181 125 175
6 142 6 116 8 26 6 184 125 176
6 162 6 116 8 10 6 176 125 177
6 144 6 115 8 27 6 176 125 178
6 159 6 116 8 3 6 184 125 178
6 152 6 116 8 4 6 184 125 180
6 155 6 116 8 13 6 183 125 180
6 145 6 116 8 21 6 169 125 181
6 141 6 116 8 27 6 174 125 182
6 155 6 116 8 14 6 182 125 183
6 149 6 115 8 8 6 187 125 184