0 0 0 0
0 0 0 0
0 0 0 0
0 0 0 0
0 0 0 0
0 0 0 0
0 0 0 0
0 0 0 0
0 0 0 0
0 0 0 0
0 0 0 0
0 0 0 0
0 0 0 0
0 0 0 0
0 0 0 0
0 0 0 0
0 0 0 0
0 0 0 0
0 0 0 0
0 0 0 0
0 0 0 0
0 0 0 0
0 0 0 0
0 0 0 0
0 0 0 0
0 0 0 0
0 0 0 0
0 0 0 0
0 0 0 0
0 0 0 0
0 0 0 0
0 0 0 0
0 0 0 0
0 0 0 0
0 0 0 0
0 0 0 0
0 0 0 0
0 0 0 0
0 0 0 0
0 0 0 0
0 0 0 0
0 0 0 0
0 0 0 0
0 0 0 0
0 0 0 0
0 0 0 0
0 0 0 0
0 0 0 0
0 0 0 0
0 0 0 0
0 0 0 0
0 0 0 0
0 0 0 0
0 0 0 0
0 0 0 0
0 0 0 0
0 0 0 0
0 0 0 0
0 0 0 0
0 0 0 0
0 0 0 0
0 0 0 0
0 0 0 0
0 0 0 0
0 0 0 0
0 0 0 0
0 0 0 0
0 0 0 0
0 0 0 0
0 0 0 0
0 0 0 0
0 0 0 0
0 0 0 0
0 0 0 0
0 0 0 0
0 0 0 0
0 0 0 0
0 0 0 0
0 0 0 0
0 0 0 0
0 0 0 0
0 0 0 0
0 0 0 0
0 0 0 0
0 0 0 0
0 0 0 0
0 0 0 0
0 0 0 0
0 0 0 0
0 0 0 0
0 0 0 0
0 0 0 0
0 0 0 0
0 0 0 0
0 0 0 0
0 0 0 0
0 0 0 0
0 0 0 0
0 0 0 0
0 0 0 0
0 0 0 0
0 0 0 0
0 0 0 0
0 0 0 0
0 0 0 0
0 0 0 0
0 0 0 0
0 0 0 0
0 0 0 0
0 0 0 0
0 0 0 0
0 0 0 0
0 0 0 0
0 0 0 0
0 0 0 0
0 0 0 0
0 0 0 0
0 0 0 0
0 0 0 0
0 0 0 0
0 0 0 0
0 0 0 0
0 0 0 0
0 0 0 0
0 0 0 0
0 0 0 0
0 0 0 0
0 0 0 0
0 0 0 0
0 0 0 0
0 0 0 0
0 0 0 0
0 0 0 0
0 0 0 0
0 0 0 0
0 0 0 0
0 0 0 0
0 0 0 0
0 0 0 0
0 0 0 0
0 0 0 0
0 0 0 0
0 0 0 0
0 0 0 0
0 0 0 0
0 0 0 0
0 0 0 0
0 0 0 0
0 0 0 0
0 0 0 0
0 0 0 0
0 0 0 0
0 0 0 0
0 0 0 0
0 0 0 0
0 0 0 0
0 0 0 0
0 0 0 0
0 0 0 0
0 0 0 0
0 0 0 0
0 0 0 0
0 0 0 0
0 0 0 0
0 0 0 0
0 0 0 0
0 0 0 0
0 0 0 0
0 0 0 0
0 0 0 0
0 0 0 0
0 0 0 0
0 0 0 0
0 0 0 0
0 0 0 0
0 0 0 0
0 0 0 0
0 0 0 0
0 0 0 0
0 0 0 0
0 0 0 0
0 0 0 0
0 0 0 0
0 0 0 0
0 0 0 0
0 0 0 0
0 0 0 0
0 0 0 0
0 0 0 0
0 0 0 0
0 0 0 0
0 0 0 0
0 0 0 0
0 0 0 0
0 0 0 0
0 0 0 0
0 0 0 0
0 0 0 0
0 0 0 0
0 0 0 0
0 0 0 0
0 0 0 0
0 0 0 0
0 0 0 0
0 0 0 0
0 0 0 0
0 0 0 0
0 0 0 0
0 0 0 0
255 2 0 0
255 2 0 0
255 2 0 0
255 2 0 0
255 2 0 0
255 2 0 0
255 2 0 0
255 2 0 0
255 2 0 0
255 2 0 0
255 2 0 0
255 2 0 0
255 2 0 0
255 2 0 0
1 6 0 0
1 6 0 0
1 6 0 0
1 6 0 0
1 6 0 0
1 6 0 0
1 6 0 0
1 6 0 0
1 6 0 0
1 6 0 0
1 6 0 0
1 6 0 0
1 6 0 0
10 7 0 0
10 7 0 0
10 7 0 0
10 7 0 0
10 7 0 0
10 7 0 0
10 7 0 0
10 7 0 0
10 7 0 0
10 7 0 0
10 7 0 0
10 7 0 0
10 7 0 0
10 7 0 0
12 9 253 1
12 9 253 1
12 9 253 1
12 9 253 1
12 9 253 1
12 9 253 1
12 9 253 1
12 9 253 1
12 9 253 1
12 9 253 1
12 9 253 1
12 9 253 1
12 9 253 1
12 9 253 1
12 9 253 1
13 9 255 1
13 9 255 1
13 9 255 1
13 9 255 1
13 9 255 1
13 9 255 1
13 9 255 1
13 9 255 1
13 9 255 1
13 9 255 1
13 9 255 1
13 9 255 1
13 9 255 1
13 9 255 1
13 9 255 1
15 10 0 0
15 10 0 0
15 10 0 0
15 10 0 0
15 10 0 0
15 10 0 0
15 10 0 0
15 10 0 0
15 10 0 0
15 10 0 0
15 10 0 0
15 10 0 0
15 10 0 0
15 10 0 0
15 10 0 0
15 10 0 0
16 9 254 1
16 9 254 1
16 9 254 1
16 9 254 1
16 9 254 1
16 9 254 1
16 9 254 1
16 9 254 1
16 9 254 1
16 9 254 1
16 9 254 1
16 9 254 1
16 9 254 1
14 8 0 0
14 8 0 0
14 8 0 0
14 8 0 0
14 8 0 0
14 8 0 0
14 8 0 0
14 8 0 0
14 8 0 0
14 8 0 0
14 8 0 0
14 8 0 0
14 8 0 0
14 8 0 0
16 9 255 0
16 9 255 0
16 9 255 0
16 9 255 0
16 9 255 0
16 9 255 0
16 9 255 0
16 9 255 0
16 9 255 0
16 9 255 0
16 9 255 0
16 9 255 0
16 9 255 0
16 9 255 0
16 9 255 0
16 9 255 0
16 9 255 0
15 8 254 255
15 8 254 255
15 8 254 255
15 8 254 255
15 8 254 255
15 8 254 255
15 8 254 255
15 8 254 255
15 8 254 255
15 8 254 255
15 8 254 255
15 8 254 255
15 8 254 255
15 8 254 255
15 8 254 255
15 8 254 255
15 8 254 255
15 7 252 255
15 7 252 255
15 7 252 255
15 7 252 255
15 7 252 255
15 7 252 255
15 7 252 255
15 7 252 255
15 7 252 255
15 7 252 255
15 7 252 255
15 7 252 255
15 7 252 255
15 7 252 255
15 7 252 255
15 7 252 255
12 9 252 255
12 9 252 255
12 9 252 255
12 9 252 255
12 9 252 255
12 9 252 255
12 9 252 255
12 9 252 255
12 9 252 255
12 9 252 255
12 9 252 255
12 9 252 255
12 9 252 255
12 9 252 255
12 9 252 255
16 8 253 255
16 8 253 255
16 8 253 255
16 8 253 255
16 8 253 255
16 8 253 255
16 8 253 255
16 8 253 255
16 8 253 255
16 8 253 255
16 8 253 255
16 8 253 255
16 8 253 255
16 8 253 255
15 7 254 254
15 7 254 254
15 7 254 254
15 7 254 254
15 7 254 254
15 7 254 254
15 7 254 254
15 7 254 254
15 7 254 254
15 7 254 254
15 7 253 255
15 7 253 255
15 7 253 255
15 7 253 255
15 7 253 255
15 7 253 255
15 7 253 255
15 7 253 255
15 7 253 255
15 7 253 255
15 7 253 255
15 7 253 255
14 5 254 252
14 5 254 252
14 5 254 252
14 5 254 252
14 5 254 252
14 5 254 252
14 5 254 252
14 5 254 252
14 5 254 252
14 5 254 252
14 5 254 252
14 5 254 252
14 5 254 252
14 5 254 252
14 5 254 252
14 5 254 253
14 5 254 253
14 5 254 253
14 5 254 253
14 5 254 253
14 5 254 253
14 5 254 253
14 5 254 253
14 5 254 253
14 5 254 253
14 5 254 253
14 5 254 253
14 5 254 253
14 5 254 253
14 5 254 253
14 5 254 253
14 3 254 252
14 3 254 252
14 3 254 252
14 3 254 252
14 3 254 252
14 3 254 252
14 3 254 252
14 3 254 252
14 3 254 252
14 3 254 252
14 3 254 252
14 3 254 252
14 3 254 252
14 3 254 252
14 3 254 252
14 2 255 250
14 2 255 250
14 2 255 250
14 2 255 250
14 2 255 250
14 2 255 250
14 2 255 250
14 2 255 250
14 2 255 250
14 2 255 250
14 2 255 250
14 2 255 250
14 2 255 250
14 2 255 250
14 2 255 250
15 4 253 249
15 4 253 249
15 4 253 249
15 4 253 249
15 4 253 249
15 4 253 249
15 4 253 249
15 4 253 249
15 4 253 249
15 4 253 249
15 4 253 249
15 4 253 249
15 4 253 249
15 4 253 249
16 2 253 248
16 2 253 248
16 2 253 248
16 2 253 248
16 2 253 248
16 2 253 248
16 2 253 248
16 2 253 248
16 2 253 248
16 2 253 248
16 2 253 248
16 2 253 248
16 2 253 248
16 2 253 248
15 0 253 249
15 0 253 249
15 0 253 249
15 0 253 249
15 0 253 249
15 0 253 249
15 0 253 249
15 0 253 249
15 0 253 249
15 0 253 249
15 0 253 249
15 0 253 249
15 0 253 249
15 0 253 249
15 0 253 249
15 4 253 248
15 4 253 248
15 4 253 248
15 4 253 248
15 4 253 248
15 4 253 248
15 4 253 248
15 4 253 248
15 4 253 248
15 4 253 248
15 4 253 248
15 4 253 248
15 4 253 248
15 4 253 248
15 4 253 248
18 2 252 249
18 2 252 249
18 2 252 249
18 2 252 249
18 2 252 249
18 2 252 249
18 2 252 249
18 2 252 249
18 2 252 249
18 2 252 249
18 2 252 249
18 2 252 249
18 2 252 249
18 2 252 249
18 2 252 249
17 1 252 249
17 1 252 249
17 1 252 249
17 1 252 249
17 1 252 249
17 1 252 249
17 1 252 249
17 1 252 249
17 1 252 249
17 1 252 249
17 1 252 249
17 1 252 249
17 1 252 249
17 1 252 249
17 2 250 249
17 2 250 249
17 2 250 249
17 2 250 249
17 2 250 249
17 2 250 249
17 2 250 249
17 2 250 249
17 2 250 249
17 2 250 249
17 2 250 249
17 2 250 249
17 2 250 249
15 3 250 248
15 3 250 248
15 3 250 248
15 3 250 248
15 3 250 248
15 3 250 248
15 3 250 248
15 3 250 248
15 3 250 248
15 3 250 248
15 3 250 248
15 3 250 248
15 3 250 248
15 3 248 248
15 3 248 248
15 3 248 248
15 3 248 248
15 3 248 248
15 3 248 248
15 3 248 248
15 3 248 248
15 3 248 248
15 3 248 248
15 3 248 248
15 3 248 248
15 3 248 248
15 3 248 248
15 3 248 248
16 3 249 248
16 3 249 248
16 3 249 248
16 3 249 248
16 3 249 248
16 3 249 248
16 3 249 248
16 3 249 248
16 3 249 248
16 3 249 248
16 3 249 248
16 3 249 248
16 3 249 248
16 3 249 248
16 3 248 248
16 3 248 248
16 3 248 248
16 3 248 248
16 3 248 248
16 3 248 248
16 3 248 248
16 3 248 248
16 3 248 248
16 3 248 248
16 3 248 248
16 3 248 248
16 3 248 248
16 3 248 248
16 3 248 248
16 5 248 248
16 5 248 248
16 5 248 248
16 5 248 248
16 5 248 248
16 5 248 248
16 5 248 248
16 5 248 248
16 5 248 248
16 5 248 248
16 5 248 248
16 5 248 248
16 5 248 248
16 5 248 248
18 4 249 248
18 4 249 248
18 4 249 248
18 4 249 248
18 4 249 248
18 4 249 248
18 4 249 248
18 4 249 248
18 4 249 248
18 4 249 248
18 4 249 248
18 4 249 248
18 4 249 248
18 4 249 248
18 4 249 248
19 5 250 249
19 5 250 249
19 5 250 249
19 5 250 249
19 5 250 249
19 5 250 249
19 5 250 249
19 5 250 249
19 5 250 249
19 5 250 249
19 5 250 249
19 5 250 249
19 5 250 249
19 5 250 249
20 8 251 250
20 8 251 250
20 8 251 250
20 8 251 250
20 8 251 250
20 8 251 250
20 8 251 250
20 8 251 250
20 8 251 250
20 8 251 250
20 8 251 250
20 8 251 250
20 8 251 250
20 8 251 250
20 8 251 250
20 8 251 250
19 8 251 250
19 8 251 250
19 8 251 250
19 8 251 250
19 8 251 250
19 8 251 250
19 8 251 250
19 8 251 250
19 8 251 250
19 8 251 250
19 8 251 250
19 8 251 250
19 8 251 250
19 8 251 250
19 8 251 250
23 6 252 249
23 6 252 249
23 6 252 249
23 6 252 249
23 6 252 249
23 6 252 249
23 6 252 249
23 6 252 249
23 6 252 249
23 6 252 249
23 6 252 249
23 6 252 249
23 6 252 249
23 6 252 249
24 8 253 250
24 8 253 250
24 8 253 250
24 8 253 250
24 8 253 250
24 8 253 250
24 8 253 250
24 8 253 250
24 8 253 250
24 8 253 250
24 8 253 250
24 8 253 250
27 7 254 251
27 7 254 251
27 7 254 251
25 10 254 251
25 10 254 251
25 10 254 251
25 10 254 251
25 10 254 251
25 10 254 251
25 10 254 251
25 10 254 251
25 10 254 251
25 10 254 251
25 10 254 251
25 10 254 251
25 10 254 251
25 10 254 251
25 10 254 251
26 8 255 250
26 8 255 250
26 8 255 250
26 8 255 250
26 8 255 250
26 8 255 250
26 8 255 250
26 8 255 250
26 8 255 250
26 8 255 250
26 8 255 250
26 8 255 250
26 8 255 250
25 7 254 249
25 7 254 249
25 7 254 249
25 7 254 249
25 7 254 249
25 7 254 249
25 7 254 249
25 7 254 249
25 7 254 249
25 7 254 249
25 7 254 249
25 7 254 249
25 7 254 249
25 7 254 249
25 7 254 249
26 8 254 249
26 8 254 249
26 8 254 249
26 8 254 249
26 8 254 249
26 8 254 249
26 8 254 249
26 8 254 249
26 8 254 249
26 8 254 249
26 8 254 249
26 8 254 249
26 8 254 249
26 8 254 249
26 8 254 249
26 8 254 249
24 3 253 248
24 3 253 248
24 3 253 248
24 3 253 248
24 3 253 248
24 3 253 248
24 3 253 248
24 3 253 248
24 3 253 248
24 3 253 248
24 3 253 248
24 3 253 248
24 3 253 248
20 1 253 247
20 1 253 247
20 1 253 247
20 1 253 247
20 1 253 247
20 1 253 247
20 1 253 247
20 1 253 247
20 1 253 247
20 1 253 247
20 1 253 247
20 1 253 247
20 1 253 247
20 1 253 247
21 4 254 248
21 4 254 248
21 4 254 248
21 4 254 248
21 4 254 248
21 4 254 248
21 4 254 248
21 4 254 248
21 4 254 248
21 4 254 248
21 4 254 248
21 4 254 248
21 4 254 248
21 4 254 248
19 2 251 247
19 2 251 247
19 2 251 247
19 2 251 247
19 2 251 247
19 2 251 247
19 2 251 247
19 2 251 247
19 2 251 247
19 2 251 247
19 2 251 247
19 2 251 247
19 2 251 247
19 2 251 247
19 2 251 247
19 2 251 247
18 3 252 248
18 3 252 248
18 3 252 248
18 3 252 248
18 3 252 248
18 3 252 248
18 3 252 248
18 3 252 248
18 3 252 248
18 3 252 248
18 3 252 248
18 3 252 248
18 3 252 248
18 3 252 248
18 3 252 248
18 3 253 248
18 3 253 248
18 3 253 248
18 3 253 248
18 3 253 248
18 3 253 248
18 3 253 248
18 3 253 248
18 3 253 248
18 3 253 248
18 3 253 248
18 3 253 248
18 3 253 248
20 2 252 247
20 2 252 247
20 2 252 247
20 2 252 247
20 2 252 247
20 2 252 247
20 2 252 247
20 2 252 247
20 2 252 247
20 2 252 247
20 2 252 247
20 2 252 247
20 2 252 247
17 1 250 248
17 1 250 248
17 1 250 248
17 1 250 248
17 1 250 248
17 1 250 248
17 1 250 248
17 1 250 248
17 1 250 248
17 1 250 248
17 1 250 248
17 1 250 248
17 1 250 248
17 1 250 248
17 1 250 248
17 0 251 247
17 0 251 247
17 0 251 247
17 0 251 247
17 0 251 247
17 0 251 247
17 0 251 247
17 0 251 247
17 0 251 247
17 0 251 247
17 0 251 247
17 0 251 247
17 0 251 247
17 0 251 247
17 0 251 247
16 0 251 244
16 0 251 244
16 0 251 244
16 0 251 244
16 0 251 244
16 0 251 244
16 0 251 244
16 0 251 244
16 0 251 244
16 0 251 244
16 0 251 244
16 0 251 244
16 1 250 244
16 1 250 244
16 1 250 244
16 1 250 244
16 1 250 244
16 1 250 244
16 1 250 244
16 1 250 244
16 1 250 244
16 1 250 244
16 1 250 244
16 1 250 244
16 1 250 244
19 0 251 245
19 0 251 245
19 0 251 245
19 0 251 245
19 0 251 245
19 0 251 245
19 0 251 245
19 0 251 245
19 0 251 245
19 0 251 245
19 0 251 245
19 0 251 245
19 0 251 245
19 0 251 245
19 2 250 246
19 2 250 246
19 2 250 246
19 2 250 246
19 2 250 246
19 2 250 246
19 2 250 246
19 2 250 246
19 2 250 246
19 2 250 246
19 2 250 246
19 2 250 246
19 2 250 246
19 2 251 247
19 2 251 247
19 2 251 247
19 2 251 247
19 2 251 247
19 2 251 247
19 2 251 247
19 2 251 247
19 2 251 247
19 2 251 247
19 2 251 247
19 2 251 247
19 2 251 247
19 2 251 247
17 3 249 248
17 3 249 248
17 3 249 248
17 3 249 248
17 3 249 248
17 3 249 248
17 3 249 248
17 3 249 248
17 3 249 248
17 3 249 248
17 3 249 248
17 3 249 248
17 3 249 248
19 3 250 248
19 3 250 248
19 3 250 248
19 3 250 248
19 3 250 248
19 3 250 248
19 3 250 248
19 3 250 248
19 3 250 248
19 3 250 248
19 3 250 248
19 3 250 248
20 4 252 248
20 4 252 248
20 4 252 248
20 4 252 248
20 4 252 248
20 4 252 248
20 4 252 248
20 4 252 248
20 4 252 248
20 4 252 248
20 4 252 248
20 4 252 248
20 4 252 248
22 5 252 249
22 5 252 249
22 5 252 249
22 5 252 249
22 5 252 249
22 5 252 249
22 5 252 249
22 5 252 249
22 5 252 249
22 5 252 249
22 5 252 249
22 5 252 249
22 5 252 249
20 4 252 247
20 4 252 247
20 4 252 247
20 4 252 247
20 4 252 247
20 4 252 247
20 4 252 247
20 4 252 247
20 4 252 247
20 4 252 247
20 4 252 247
20 4 252 247
20 4 252 247
24 5 253 246
24 5 253 246
24 5 253 246
24 5 253 246
24 5 253 246
24 5 253 246
24 5 253 246
24 5 253 246
24 5 253 246
24 5 253 246
24 5 253 246
24 5 253 246
24 5 253 246
24 6 250 246
24 6 250 246
24 6 250 246
24 6 250 246
24 6 250 246
24 6 250 246
24 6 250 246
24 6 250 246
24 6 250 246
24 6 250 246
24 6 250 246
24 6 250 246
24 6 250 246
24 6 250 246
25 5 251 247
25 5 251 247
25 5 251 247
25 5 251 247
25 5 251 247
25 5 251 247
25 5 251 247
25 5 251 247
25 5 251 247
25 5 251 247
25 5 251 247
25 5 251 247
25 5 251 247
25 5 251 247
23 4 250 248
23 4 250 248
23 4 250 248
23 4 250 248
23 4 250 248
23 4 250 248
23 4 250 248
23 4 250 248
23 4 250 248
23 4 250 248
23 4 250 248
23 4 250 248
23 4 250 248
23 4 250 248
23 4 250 248
20 6 250 248
20 6 250 248
20 6 250 248
20 6 250 248
20 6 250 248
20 6 250 248
20 6 250 248
20 6 250 248
20 6 250 248
20 6 250 248
20 6 250 248
20 6 250 248
20 6 250 248
20 6 250 248
20 6 250 248
20 6 250 248
18 5 249 250
18 5 249 250
18 5 249 250
18 5 249 250
18 5 249 250
18 5 249 250
18 5 249 250
18 5 249 250
18 5 249 250
18 5 249 250
18 5 249 250
18 5 249 250
18 5 249 250
18 5 249 250
18 5 249 250
15 4 251 250
15 4 251 250
15 4 251 250
15 4 251 250
15 4 251 250
15 4 251 250
15 4 251 250
15 4 251 250
15 4 251 250
15 4 251 250
15 4 251 250
15 4 251 250
15 4 251 250
15 4 251 250
15 4 251 250
15 4 251 250
18 4 251 247
18 4 251 247
18 4 251 247
18 4 251 247
18 4 251 247
18 4 251 247
18 4 251 247
18 4 251 247
18 4 251 247
18 4 251 247
18 4 251 247
18 4 251 247
18 4 251 247
18 4 251 247
18 4 251 247
15 2 250 249
15 2 250 249
15 2 250 249
15 2 250 249
15 2 250 249
15 2 250 249
15 2 250 249
15 2 250 249
15 2 250 249
15 2 250 249
15 2 250 249
15 2 250 249
15 2 250 249
15 2 250 249
15 2 250 249
14 2 250 248
14 2 250 248
14 2 250 248
14 2 250 248
14 2 250 248
14 2 250 248
14 2 250 248
14 2 250 248
14 2 250 248
14 2 250 248
14 2 250 248
14 2 250 248
14 2 250 248
14 2 250 248
14 2 250 248
12 1 249 249
12 1 249 249
12 1 249 249
12 1 249 249
12 1 249 249
12 1 249 249
12 1 249 249
12 1 249 249
12 1 249 249
12 1 249 249
12 1 249 249
12 1 249 249
12 1 249 249
12 1 249 249
12 1 249 249
12 1 249 249
12 0 249 248
12 0 249 248
12 0 249 248
12 0 249 248
12 0 249 248
12 0 249 248
12 0 249 248
12 0 249 248
12 0 249 248
12 0 249 248
12 0 249 248
12 0 249 248
12 0 249 248
12 0 249 248
12 0 249 248
11 1 248 248
11 1 248 248
11 1 248 248
11 1 248 248
11 1 248 248
11 1 248 248
11 1 248 248
11 1 248 248
11 1 248 248
11 1 248 248
11 1 248 248
11 1 248 248
11 1 248 248
11 1 248 248
11 1 248 248
11 1 248 248
12 3 248 249
12 3 248 249
12 3 248 249
12 3 248 249
12 3 248 249
12 3 248 249
12 3 248 249
12 3 248 249
12 3 248 249
12 3 248 249
12 3 248 249
12 3 248 249
12 3 248 249
12 3 248 249
12 3 248 249
12 3 248 249
15 4 250 250
15 4 250 250
15 4 250 250
15 4 250 250
15 4 250 250
15 4 250 250
15 4 250 250
15 4 250 250
15 4 250 250
15 4 250 250
15 4 250 250
15 4 250 250
15 4 250 250
15 4 250 250
17 6 251 250
17 6 251 250
17 6 251 250
17 6 251 250
17 6 251 250
17 6 251 250
17 6 251 250
17 6 251 250
17 6 251 250
17 6 251 250
17 6 251 250
17 6 251 250
17 6 251 250
17 6 251 250
17 6 251 250
18 8 252 251
18 8 252 251
18 8 252 251
18 8 252 251
18 8 252 251
18 8 252 251
18 8 252 251
18 8 252 251
18 8 252 251
18 8 252 251
18 8 252 251
18 8 252 251
18 8 252 251
18 8 252 251
18 8 252 251
23 7 254 250
23 7 254 250
23 7 254 250
23 7 254 250
23 7 254 250
23 7 254 250
23 7 254 250
23 7 254 250
23 7 254 250
23 7 254 250
23 7 254 250
23 7 254 250
23 7 254 250
23 7 254 250
23 7 254 250
20 6 254 252
20 6 254 252
20 6 254 252
20 6 254 252
20 6 254 252
20 6 254 252
20 6 254 252
20 6 254 252
20 6 254 252
20 6 254 252
20 6 254 252
20 6 254 252
20 6 254 252
20 6 254 252
20 6 254 252
20 6 254 252
17 5 254 253
17 5 254 253
17 5 254 253
17 5 254 253
17 5 254 253
17 5 254 253
17 5 254 253
17 5 254 253
17 5 254 253
17 5 254 253
17 5 254 253
17 5 254 253
17 5 254 253
17 5 254 253
14 3 253 253
14 3 253 253
14 3 253 253
14 3 253 253
14 3 253 253
14 3 253 253
14 3 253 253
14 3 253 253
14 3 253 253
14 3 253 253
14 3 253 253
14 3 253 253
14 3 252 255
11 2 252 255
11 2 252 255
11 2 252 255
11 2 252 255
11 2 252 255
11 2 252 255
11 2 252 255
11 2 252 255
11 2 252 255
11 2 252 255
11 2 252 255
11 2 252 255
11 2 252 255
11 2 252 255
11 2 252 255
6 1 253 254
6 1 253 254
6 1 253 254
6 1 253 254
6 1 253 254
6 1 253 254
6 1 253 254
6 1 253 254
6 1 253 254
6 1 253 254
6 1 253 254
6 1 253 254
6 1 253 254
6 1 253 254
6 1 253 254
0 0 254 254
0 0 254 254
0 0 254 254
0 0 254 254
0 0 254 254
0 0 254 254
0 0 254 254
0 0 254 254
0 0 254 254
0 0 254 254
0 0 254 254
0 0 254 254
0 0 254 254
0 0 254 254
0 0 254 254
0 0 254 254
1 0 252 0
1 0 252 0
1 0 252 0
1 0 252 0
1 0 252 0
1 0 252 0
1 0 252 0
1 0 252 0
1 0 252 0
1 0 252 0
1 0 252 0
1 0 252 0
1 0 252 0
1 0 252 0
255 0 252 0
255 0 252 0
255 0 252 0
255 0 252 0
255 0 252 0
255 0 252 0
255 0 252 0
255 0 252 0
255 0 252 0
255 0 252 0
255 0 252 0
255 0 252 0
255 0 252 0
255 0 252 0
255 0 252 0
255 0 252 0
0 0 0 0
0 0 0 0
0 0 0 0
0 0 0 0
0 0 0 0
0 0 0 0
0 0 0 0
0 0 0 0
0 0 0 0
0 0 0 0
0 0 0 0
0 0 0 0
0 0 0 0
0 0 0 0
0 0 0 0
0 0 0 0
0 0 0 0
0 0 0 0
0 0 0 0
0 0 0 0
0 0 0 0
0 0 0 0
0 0 0 0
0 0 0 0
0 0 0 0
0 0 0 0
0 0 0 0
0 0 0 0
0 0 0 0
0 0 0 0
0 0 0 0
0 0 0 0
0 0 0 0
0 0 0 0
0 0 0 0
0 0 0 0
0 0 0 0
0 0 0 0
0 0 0 0
0 0 0 0
0 0 0 0
0 0 0 0
0 0 0 0
0 0 0 0
0 0 0 0
0 0 0 0
0 0 0 0
0 0 0 0
0 0 0 0
0 0 0 0
0 0 0 0
0 0 0 0
0 0 0 0
0 0 0 0
0 0 0 0
0 0 0 0
0 0 0 0
0 0 0 0
0 0 0 0
0 0 0 0
0 0 0 0
0 0 0 0
0 0 0 0
0 0 0 0
0 0 0 0
0 0 0 0
0 0 0 0
0 0 0 0
0 0 0 0
0 0 0 0
0 0 0 0
0 0 0 0
0 0 0 0
0 0 0 0
0 0 0 0
0 0 0 0
0 0 0 0
0 0 0 0
0 0 0 0
0 0 0 0
0 0 0 0
0 0 0 0
0 0 0 0
0 0 0 0
0 0 0 0
0 0 0 0
0 0 0 0
0 0 0 0
0 0 0 0
0 0 0 0
0 0 0 0
0 0 0 0
0 0 0 0
0 0 0 0
0 0 0 0
0 0 0 0
0 0 0 0
0 0 0 0
0 0 0 0
0 0 0 0
0 0 0 0
0 0 0 0
0 0 0 0
0 0 0 0
0 0 0 0
0 0 0 0
0 0 0 0
0 0 0 0
0 0 0 0
0 0 0 0
0 0 0 0
0 0 0 0
0 0 0 0
0 0 0 0
0 0 0 0
0 0 0 0
0 0 0 0
0 0 0 0
0 0 0 0
0 0 0 0
0 0 0 0
0 0 0 0
0 0 0 0
0 0 0 0
0 0 0 0
0 0 0 0
0 0 0 0
0 0 0 0
0 0 0 0
0 0 0 0
0 0 0 0
0 0 0 0
0 0 0 0
0 0 0 0
0 0 0 0
0 0 0 0
0 0 0 0
0 0 0 0
0 0 0 0
0 0 0 0
0 0 0 0
0 0 0 0
0 0 0 0
0 0 0 0
0 0 0 0
0 0 0 0
0 0 0 0
0 0 0 0
0 0 0 0
0 0 0 0
0 0 0 0
0 0 0 0
0 0 0 0
0 0 0 0
0 0 0 0
0 0 0 0
0 0 0 0
0 0 0 0
0 0 0 0
0 0 0 0
0 0 0 0
0 0 0 0
0 0 0 0
0 0 0 0
0 0 0 0
0 0 0 0
0 0 0 0
0 0 0 0
0 0 0 0
0 0 0 0
0 0 0 0
0 0 0 0
0 0 0 0
0 0 0 0
0 0 0 0
0 0 0 0
0 0 0 0
0 0 0 0
0 0 0 0
0 0 0 0
0 0 0 0
0 0 0 0
0 0 0 0
0 0 0 0
0 0 0 0
0 0 0 0
0 0 0 0
0 0 0 0
0 0 0 0
0 0 0 0
0 0 0 0
0 0 0 0
0 0 0 0
0 0 0 0
0 0 0 0
0 0 0 0
0 0 0 0
0 0 0 0
0 0 0 0
0 0 0 0
0 0 0 0
0 0 0 0
0 0 0 0
0 0 0 0
0 0 0 0
0 0 0 0
0 0 0 0
0 0 0 0
0 0 0 0
0 0 0 0
0 0 0 0
0 0 0 0
0 0 0 0
0 0 0 0
0 0 0 0
0 0 0 0
0 0 0 0
0 0 0 0
0 0 0 0
0 0 0 0
0 0 0 0
0 0 0 0
0 0 0 0
0 0 0 0
0 0 0 0
0 0 0 0
0 0 0 0
0 0 0 0
0 0 0 0
0 0 0 0
0 0 0 0
0 0 0 0
0 0 0 0
0 0 0 0
0 0 0 0
0 0 0 0
0 0 0 0
0 0 0 0
0 0 0 0
0 0 0 0
0 0 0 0
0 0 0 0
0 0 0 0
0 0 0 0
0 0 0 0
0 0 0 0
0 0 0 0
0 0 0 0
0 0 0 0
0 0 0 0
0 0 0 0
0 0 0 0
0 0 0 0
0 0 0 0
0 0 0 0
0 0 0 0
0 0 0 0
0 0 0 0
0 0 0 0
0 0 0 0
0 0 0 0
0 0 0 0
0 0 0 0
0 0 0 0
0 0 0 0
0 0 0 0
0 0 0 0
0 0 0 0
0 0 0 0
0 0 0 0
0 0 0 0
0 0 0 0
0 0 0 0
0 0 0 0
0 0 0 0
0 0 0 0
0 0 0 0
0 0 0 0
0 0 0 0
0 0 0 0
0 0 0 0
0 0 0 0
0 0 0 0
0 0 0 0
0 0 0 0
0 0 0 0
0 0 0 0
0 0 0 0
0 0 0 0
0 0 0 0
0 0 0 0
0 0 0 0
0 0 0 0
0 0 0 0
0 0 0 0
0 0 0 0
0 0 0 0
0 0 0 0
0 0 0 0
0 0 0 0
0 0 0 0
0 0 0 0
0 0 0 0
0 0 0 0
0 0 0 0
0 0 0 0
0 0 0 0
0 0 0 0
0 0 0 0
0 0 0 0
0 0 0 0
0 0 0 0
0 0 0 0
0 0 0 0
0 0 0 0
0 0 0 0
0 0 0 0
0 0 0 0
0 0 0 0
0 0 0 0
0 0 0 0
0 0 0 0
0 0 0 0
0 0 0 0
0 0 0 0
0 0 0 0
0 0 0 0
0 0 0 0
0 0 0 0
0 0 0 0
0 0 0 0
0 0 0 0
0 0 0 0
0 0 0 0
0 0 0 0
0 0 0 0
0 0 0 0
0 0 0 0
0 0 0 0
0 0 0 0
0 0 0 0
0 0 0 0
0 0 0 0
0 0 0 0
0 0 0 0
0 0 0 0
0 0 0 0
0 0 0 0
0 0 0 0
0 0 0 0
0 0 0 0
0 0 0 0
0 0 0 0
0 0 0 0
0 0 0 0
0 0 0 0
0 0 0 0
0 0 0 0
0 0 0 0
0 0 0 0
0 0 0 0
0 0 0 0
0 0 0 0
0 0 0 0
0 0 0 0
0 0 0 0
0 0 0 0
0 0 0 0
0 0 0 0
0 0 0 0
0 0 0 0
0 0 0 0
0 0 0 0
0 0 0 0
0 0 0 0
0 0 0 0
0 0 0 0
0 0 0 0
0 0 0 0
0 0 0 0
0 0 0 0
0 0 0 0
0 0 0 0
0 0 0 0
0 0 0 0
0 0 0 0
0 0 0 0
0 0 0 0
0 0 0 0
0 0 0 0
0 0 0 0
0 0 0 0
0 0 0 0
0 0 0 0
0 0 0 0
0 0 0 0
0 0 0 0
0 0 0 0
0 0 0 0
0 0 0 0
0 0 0 0
0 0 0 0
0 0 0 0
0 0 0 0
0 0 0 0
0 0 0 0
0 0 0 0
0 0 0 0
0 0 0 0
0 0 0 0
0 0 0 0
0 0 0 0
0 0 0 0
0 0 0 0
0 0 0 0
0 0 0 0
0 0 0 0
0 0 0 0
0 0 0 0
0 0 0 0
0 0 0 0
0 0 0 0
0 0 0 0
0 0 0 0
0 0 0 0
0 0 0 0
0 0 0 0
0 0 0 0
0 0 0 0
0 0 0 0
0 0 0 0
0 0 0 0
0 0 0 0
0 0 0 0
0 0 0 0
0 0 0 0
0 0 0 0
0 0 0 0
0 0 0 0
0 0 0 0
0 0 0 0
0 0 0 0
0 0 0 0
0 0 0 0
0 0 0 0
0 0 0 0
0 0 0 0
0 0 0 0
0 0 0 0
0 0 0 0
0 0 0 0
0 0 0 0
0 0 0 0
0 0 0 0
0 0 0 0
0 0 0 0
0 0 0 0
0 0 0 0
0 0 0 0
0 0 0 0
0 0 0 0
0 0 0 0
0 0 0 0
0 0 0 0
0 0 0 0
0 0 0 0
0 0 0 0
0 0 0 0
0 0 0 0
0 0 0 0
0 0 0 0
0 0 0 0
0 0 0 0
0 0 0 0
0 0 0 0
0 0 0 0
0 0 0 0
0 0 0 0
0 0 0 0
0 0 0 0
0 0 0 0
0 0 0 0
0 0 0 0
0 0 0 0
0 0 0 0
0 0 0 0
0 0 0 0
0 0 0 0
0 0 0 0
0 0 0 0
0 0 0 0
0 0 0 0
0 0 0 0
0 0 0 0
0 0 0 0
0 0 0 0
0 0 0 0
0 0 0 0
0 0 0 0
0 0 0 0
0 0 0 0
0 0 0 0
0 0 0 0
0 0 0 0
0 0 0 0
0 0 0 0
0 0 0 0
0 0 0 0
0 0 0 0
0 0 0 0
0 0 0 0
0 0 0 0
0 0 0 0
0 0 0 0
0 0 0 0
0 0 0 0
0 0 0 0
0 0 0 0
0 0 0 0
0 0 0 0
0 0 0 0
0 0 0 0
0 0 0 0
0 0 0 0
0 0 0 0
0 0 0 0
0 0 0 0
0 0 0 0
0 0 0 0
0 0 0 0
0 0 0 0
0 0 0 0
0 0 0 0
0 0 0 0
0 0 0 0
0 0 0 0
0 0 0 0
0 0 0 0
0 0 0 0
0 0 0 0
0 0 0 0
0 0 0 0
0 0 0 0
0 0 0 0
0 0 0 0
0 0 0 0
0 0 0 0
0 0 0 0
0 0 0 0
0 0 0 0
0 0 0 0
0 0 0 0
0 0 0 0
0 0 0 0
0 0 0 0
0 0 0 0
0 0 0 0
0 0 0 0
0 0 0 0
0 0 0 0
0 0 0 0
0 0 0 0
0 0 0 0
0 0 0 0
0 0 0 0
0 0 0 0
0 0 0 0
0 0 0 0
0 0 0 0
0 0 0 0
0 0 0 0
0 0 0 0
0 0 0 0
0 0 0 0
0 0 0 0
0 0 0 0
0 0 0 0
0 0 0 0
0 0 0 0
0 0 0 0
0 0 0 0
0 0 0 0
0 0 0 0
0 0 0 0
0 0 0 0