6 124 6 96 8 10 6 164 181 12
6 123 6 95 8 12 6 188 181 13
6 128 6 96 8 11 6 185 181 15
6 124 6 96 8 8 6 182 181 16
6 132 6 96 8 11 6 192 181 17
6 127 6 96 8 9 6 197 181 18
6 126 6 96 8 8 6 171 181 20
6 126 6 96 8 3 6 193 181 21
6 132 6 95 8 13 6 188 181 22
6 136 6 96 8 12 6 193 181 24
6 122 6 96 8 35 6 196 181 25
6 127 6 96 8 28 6 170 181 26
6 127 6 96 8 10 6 161 181 27
6 126 6 95 8 21 6 176 181 28
6 134 6 96 8 32 6 181 181 29
6 135 6 96 8 19 6 187 181 30
6 124 6 96 8 25 6 187 181 31
6 141 6 95 8 10 6 167 181 32
6 131 6 96 8 8 6 179 181 34
6 119 6 96 8 30 6 174 181 35
6 137 6 96 7 253 6 189 181 36
6 136 6 96 7 242 6 199 181 37
6 136 6 96 7 246 6 183 181 38
6 135 6 96 8 30 6 198 181 39
6 131 6 96 7 249 6 200 181 40
6 126 6 96 8 17 6 194 181 41
6 120 6 96 8 8 6 193 181 42
6 131 6 96 8 8 6 187 181 43
6 114 6 96 8 18 6 188 181 44
6 117 6 96 8 17 6 184 181 46
6 113 6 96 8 13 6 172 181 47
6 133 6 96 8 37 6 185 181 48
6 131 6 96 8 36 6 215 181 49
6 135 6 96 8 12 6 212 181 50
6 130 6 95 8 4 6 205 181 51
6 124 6 95 7 248 6 200 181 52
6 125 6 96 7 246 6 201 181 53
6 118 6 96 8 42 6 187 181 54
6 126 6 95 8 23 6 183 181 55
6 120 6 96 8 18 6 183 181 56
6 132 6 96 8 8 6 195 181 57
6 133 6 95 8 8 6 196 181 58
6 142 6 96 8 13 6 177 181 59
6 152 6 95 8 10 6 192 181 60
6 151 6 96 8 9 6 195 181 61
6 137 6 96 8 1 6 198 181 62
6 115 6 96 8 11 6 209 181 63
6 106 6 96 8 17 6 212 181 64
6 123 6 96 8 7 6 213 181 65
6 125 6 96 8 15 6 213 181 66
6 133 6 96 8 10 6 217 181 67
6 127 6 96 8 10 6 203 181 68
6 121 6 95 8 7 6 193 181 69
6 135 6 96 8 7 6 199 181 70
6 128 6 96 8 7 6 197 181 71
6 122 6 96 8 23 6 192 181 72
6 122 6 96 8 39 6 188 181 73
6 129 6 96 8 35 6 183 181 74
6 123 6 96 8 50 6 197 181 75
6 123 6 96 8 31 6 214 181 76
6 123 6 96 7 252 6 207 181 77
6 128 6 96 8 3 6 207 181 78
6 122 6 96 8 21 6 207 181 79
6 124 6 96 8 21 6 190 181 80
6 120 6 96 8 29 6 201 181 81
6 122 6 96 8 21 6 212 181 82
6 123 6 96 8 13 6 212 181 82
6 122 6 95 8 17 6 206 181 83
6 112 6 96 8 19 6 204 181 85
6 129 6 96 8 15 6 201 181 86
6 142 6 96 8 9 6 201 181 87
6 130 6 95 8 18 6 202 181 88
6 140 6 96 8 21 6 188 181 89
6 132 6 96 8 23 6 185 181 90
6 107 6 96 8 16 6 197 181 91
6 114 6 96 8 18 6 183 181 92
6 117 6 96 8 15 6 187 181 93
6 135 6 96 8 17 6 203 181 94
6 139 6 96 7 255 6 196 181 95
6 133 6 96 8 5 6 187 181 96
6 141 6 96 8 16 6 187 181 97
6 135 6 96 8 33 6 196 181 98
6 131 6 96 8 15 6 197 181 99
6 138 6 96 7 255 6 196 181 100
6 135 6 96 8 51 6 194 181 101
6 137 6 96 8 51 6 185 181 102
6 139 6 96 7 249 6 207 181 103
6 140 6 96 8 24 6 205 181 104
6 143 6 96 8 12 6 208 181 105
6 135 6 96 8 23 6 182 181 108
6 141 6 96 7 243 6 172 181 109
6 129 6 95 8 24 6 193 181 110
6 135 6 95 7 251 6 206 181 111
6 132 6 96 7 245 6 212 181 112
6 134 6 96 7 247 6 218 181 113
6 134 6 96 7 251 6 227 181 114
6 128 6 96 8 10 6 234 181 115
6 127 6 96 8 34 6 210 181 116
6 117 6 96 8 18 6 205 181 117
6 131 6 96 8 5 6 222 181 118
6 122 6 96 8 14 6 222 181 120
6 120 6 96 7 235 6 223 181 121
6 101 6 96 7 246 6 201 181 122
6 103 6 96 7 217 6 207 181 123
6 102 6 96 8 2 6 213 181 124
6 113 6 96 8 2 6 208 181 125
6 109 6 96 8 28 6 206 181 126
6 115 6 96 8 5 6 193 181 127
6 122 6 96 8 4 6 182 181 128
6 121 6 96 8 17 6 168 181 129
6 124 6 95 8 17 6 174 181 130
6 125 6 96 8 23 6 206 181 132
6 133 6 96 8 15 6 147 181 135
6 136 6 96 8 20 6 150 181 137
6 129 6 95 8 22 6 168 181 138
6 131 6 96 8 20 6 191 181 140
6 121 6 96 8 16 6 196 181 141
6 126 6 96 8 7 6 210 181 143
6 106 6 96 8 17 6 213 181 144
6 119 6 96 8 28 6 214 181 145
6 121 6 96 8 8 6 203 181 146
6 118 6 96 8 15 6 172 181 148
6 121 6 96 7 252 6 179 181 149
6 118 6 96 8 36 6 201 181 150
6 128 6 96 7 234 6 213 181 151
6 123 6 96 8 6 6 217 181 152
6 125 6 96 8 14 6 202 181 153
6 128 6 96 8 12 6 197 181 154
6 121 6 96 8 10 6 186 181 155
6 125 6 96 8 26 6 176 181 156
6 129 6 96 8 15 6 162 181 157
6 132 6 96 8 6 6 177 181 158
6 123 6 96 8 10 6 200 181 159
6 132 6 96 8 3 6 189 181 160
6 128 6 96 8 15 6 189 181 161
6 140 6 96 8 1 6 194 181 163
6 116 6 96 8 17 6 175 181 164
6 109 6 96 8 25 6 183 181 165
6 121 6 96 8 15 6 192 181 166
6 130 6 96 8 14 6 186 181 168
6 129 6 96 8 19 6 188 181 169
6 124 6 96 8 15 6 188 181 169
6 147 6 96 8 6 6 196 181 171
6 126 6 95 8 22 6 213 181 171
6 142 6 96 8 18 6 196 181 172
6 121 6 96 8 17 6 190 181 174
6 131 6 96 8 11 6 178 181 175
6 124 6 96 8 32 6 169 181 176
6 128 6 95 8 12 6 190 181 177
6 124 6 97 7 255 6 205 181 178
6 131 6 95 8 2 6 184 181 179
6 126 6 95 8 16 6 175 181 180
6 125 6 96 8 17 6 184 181 181
6 127 6 95 8 18 6 184 181 181
6 120 6 96 8 11 6 176 181 182
6 122 6 96 8 5 6 182 181 183
6 116 6 96 8 22 6 178 181 184
6 119 6 96 8 22 6 172 181 185
6 128 6 95 8 15 6 190 181 186
6 117 6 96 8 18 6 199 181 187
6 130 6 96 8 18 6 180 181 188
6 129 6 96 8 5 6 189 181 189
6 133 6 96 8 9 6 194 181 190
6 120 6 96 8 9 6 175 181 191
6 126 6 95 8 12 6 185 181 192
6 128 6 95 8 24 6 197 181 193
6 128 6 96 8 19 6 203 181 194
6 125 6 96 8 34 6 210 181 195
6 131 6 96 8 24 6 210 181 195
6 124 6 96 8 24 6 211 181 196
6 117 6 96 8 14 6 203 181 197
6 122 6 96 8 14 6 210 181 198
6 123 6 96 7 248 6 216 181 199
6 123 6 96 7 243 6 207 181 200
6 130 6 96 7 245 6 211 181 201
6 141 6 97 8 5 6 196 181 202
6 129 6 96 8 17 6 196 181 202
6 113 6 96 8 6 6 185 181 203
6 110 6 95 8 7 6 197 181 204
6 118 6 96 8 6 6 183 181 206
6 92 6 95 8 13 6 194 181 207
6 97 6 96 8 21 6 196 181 208
6 104 6 96 8 14 6 192 181 209
6 110 6 95 8 8 6 186 181 210
6 110 6 95 8 25 6 184 181 211
6 111 6 95 7 248 6 198 181 212
6 113 6 95 7 248 6 209 181 213
6 101 6 96 8 10 6 201 181 214
6 110 6 96 8 11 6 201 181 214
6 107 6 95 7 254 6 189 181 215
6 99 6 96 8 3 6 182 181 216
6 100 6 95 8 2 6 179 181 217
6 110 6 95 8 9 6 176 181 218
6 118 6 96 8 3 6 171 181 219
6 118 6 96 8 3 6 177 181 220
6 117 6 95 8 11 6 177 181 221
6 121 6 95 8 4 6 169 181 222
6 110 6 95 8 9 6 172 181 223
6 116 6 96 8 24 6 169 181 224
6 116 6 96 8 8 6 170 181 225
6 106 6 96 8 18 6 173 181 226
6 108 6 96 8 6 6 176 181 227
6 120 6 95 7 254 6 173 181 228
6 128 6 95 7 248 6 171 181 229
6 126 6 96 7 241 6 176 181 230
6 126 6 95 7 252 6 170 181 231
6 124 6 96 7 247 6 167 181 232
6 125 6 96 8 1 6 166 181 233
6 118 6 95 7 246 6 157 181 234
6 116 6 95 8 36 6 161 181 235
6 111 6 95 8 36 6 174 181 236
6 110 6 95 8 36 6 174 181 236
6 103 6 95 8 24 6 177 181 237
6 100 6 95 8 14 6 181 181 238
6 115 6 96 8 4 6 179 181 239
6 99 6 95 8 4 6 178 181 240
6 101 6 95 8 7 6 164 181 241
6 104 6 95 8 4 6 159 181 242
6 93 6 95 7 237 6 176 181 243
6 86 6 95 8 0 6 190 181 244
6 91 6 95 8 18 6 194 181 245
6 107 6 96 7 251 6 189 181 246
6 109 6 95 7 230 6 176 181 247
6 113 6 95 7 231 6 158 181 248
6 113 6 95 8 1 6 151 181 249
6 111 6 95 8 8 6 155 181 250
6 110 6 96 7 253 6 161 181 251
6 115 6 95 8 7 6 168 181 252
6 122 6 95 8 35 6 173 181 253
6 125 6 95 8 43 6 165 181 254
6 119 6 95 8 43 6 150 181 255
6 119 6 96 7 245 6 156 182 0
6 119 6 95 7 233 6 177 182 1
6 108 6 95 8 27 6 179 182 2
6 110 6 95 8 58 6 173 182 3
6 109 6 95 8 28 6 159 182 4
6 114 6 95 7 247 6 161 182 5
6 113 6 95 8 19 6 180 182 6
6 118 6 95 7 255 6 183 182 7
6 121 6 95 8 24 6 176 182 8
6 129 6 95 7 247 6 170 182 9
6 122 6 95 7 254 6 170 182 10
6 121 6 95 8 15 6 176 182 11
6 114 6 95 8 12 6 194 182 12
6 118 6 95 8 15 6 192 182 13
6 117 6 95 8 36 6 182 182 14
6 115 6 95 7 239 6 183 182 15
6 107 6 95 7 236 6 167 182 16
6 119 6 95 7 234 6 159 182 17
6 110 6 95 7 254 6 163 182 18
6 112 6 95 8 28 6 152 182 19
6 112 6 95 7 252 6 172 182 20
6 115 6 95 8 6 6 177 182 21
6 120 6 95 8 20 6 175 182 22
6 131 6 95 7 255 6 164 182 23
6 129 6 95 8 11 6 174 182 24
6 134 6 95 7 249 6 179 182 25
6 124 6 95 8 1 6 163 182 26
6 120 6 95 7 252 6 166 182 27
6 111 6 95 7 231 6 182 182 28
6 102 6 95 7 252 6 198 182 29
6 107 6 95 7 255 6 194 182 30
6 118 6 95 8 10 6 179 182 31
6 118 6 94 8 89 6 182 182 32
6 132 6 95 8 84 6 201 182 33
6 136 6 95 7 246 6 205 182 34
6 141 6 95 7 246 6 201 182 35
6 121 6 95 8 12 6 197 182 37
6 106 6 95 8 15 6 200 182 38
6 89 6 95 8 22 6 205 182 39
6 88 6 95 8 22 6 207 182 40
6 86 6 95 8 23 6 212 182 41
6 89 6 95 7 250 6 213 182 42
6 94 6 95 8 11 6 211 182 43
6 103 6 95 8 17 6 201 182 44
6 103 6 95 8 13 6 205 182 45
6 101 6 95 7 243 6 210 182 46
6 98 6 95 8 9 6 199 182 47
6 123 6 95 8 18 6 203 182 48
6 133 6 94 8 9 6 196 182 49
6 124 6 95 8 18 6 200 182 50
6 123 6 94 8 23 6 195 182 51
6 118 6 95 8 23 6 204 182 52
6 119 6 94 7 255 6 211 182 53
6 115 6 94 7 243 6 216 182 54
6 110 6 95 8 29 6 218 182 55
6 114 6 95 8 31 6 205 182 57
6 125 6 94 8 46 6 206 182 58
6 121 6 95 8 41 6 212 182 59
6 127 6 95 8 14 6 223 182 60
6 132 6 95 8 9 6 230 182 61
6 123 6 95 8 23 6 220 182 62
6 105 6 95 7 244 6 216 182 63
6 100 6 95 8 19 6 216 182 64
6 104 6 94 8 40 6 212 182 65
6 106 6 95 7 236 6 212 182 66
6 100 6 95 8 8 6 216 182 67
6 101 6 95 8 20 6 202 182 68
6 100 6 94 8 15 6 205 182 69
6 107 6 94 8 34 6 210 182 70
6 109 6 95 8 20 6 204 182 71
6 101 6 94 8 17 6 205 182 72
6 102 6 94 8 6 6 213 182 73
6 105 6 94 7 235 6 213 182 74
6 89 6 94 8 21 6 204 182 75
6 97 6 95 8 40 6 205 182 76
6 98 6 94 8 44 6 208 182 77
6 104 6 95 7 241 6 199 182 78
6 89 6 94 8 22 6 202 182 79
6 87 6 94 8 5 6 205 182 80
6 103 6 95 8 5 6 209 182 81
6 103 6 95 8 21 6 206 182 82
6 100 6 94 8 23 6 212 182 83
6 95 6 94 8 28 6 205 182 84
6 91 6 94 8 11 6 197 182 85
6 97 6 94 8 1 6 197 182 86
6 81 6 94 8 16 6 190 182 87
6 105 6 94 8 12 6 212 182 88
6 96 6 94 8 34 6 212 182 88
6 97 6 95 8 0 6 206 182 89
6 99 6 94 7 253 6 185 182 90
6 107 6 94 7 253 6 193 182 91
6 108 6 94 8 5 6 189 182 92
6 110 6 93 8 6 6 188 182 93
6 96 6 94 8 9 6 179 182 94
6 114 6 94 8 59 6 187 182 95
6 105 6 94 8 27 6 195 182 96
6 91 6 94 7 254 6 194 182 97
6 92 6 93 8 13 6 190 182 98
6 99 6 94 7 252 6 192 182 99
6 104 6 94 7 248 6 198 182 100
6 100 6 94 8 7 6 194 182 102
6 84 6 94 8 17 6 170 182 103
6 98 6 94 8 5 6 168 182 104
6 105 6 93 8 65 6 160 182 105
6 110 6 93 8 48 6 185 182 107
6 104 6 94 8 32 6 174 182 108
6 106 6 94 7 247 6 178 182 109
6 109 6 93 7 254 6 184 182 110
6 113 6 94 8 19 6 189 182 111
6 101 6 94 8 6 6 192 182 112
6 90 6 94 7 251 6 192 182 114
6 101 6 94 8 29 6 197 182 115
6 102 6 93 8 43 6 188 182 116
6 99 6 94 8 23 6 178 182 117
6 92 6 93 8 16 6 189 182 118
6 84 6 94 7 254 6 188 182 119
6 73 6 93 8 29 6 198 182 120
6 86 6 93 8 103 6 197 182 121
6 82 6 94 8 103 6 193 182 122
6 87 6 93 7 221 6 195 182 123
6 106 6 93 7 212 6 174 182 124
6 99 6 93 8 80 6 175 182 125
6 75 6 93 7 253 6 180 182 126
6 51 6 93 7 232 6 186 182 127
6 34 6 93 7 200 6 186 182 128
6 34 6 93 7 240 6 186 182 129
6 36 6 92 7 249 6 166 182 130
6 56 6 93 8 62 6 155 182 131
6 105 6 93 8 120 6 155 182 131
6 67 6 93 8 120 6 164 182 132
6 103 6 93 7 229 6 164 182 133
6 105 6 93 7 236 6 155 182 134
6 85 6 92 8 11 6 162 182 135
6 85 6 93 8 8 6 159 182 136
6 91 6 92 7 246 6 145 182 137
6 101 6 93 8 5 6 145 182 137
6 88 6 93 8 5 6 159 182 138
6 94 6 93 8 42 6 144 182 139
6 104 6 93 8 71 6 160 182 140
6 94 6 93 8 16 6 166 182 142
6 82 6 92 7 243 6 166 182 143
6 97 6 93 8 25 6 155 182 144
6 84 6 93 8 48 6 163 182 145
6 91 6 92 7 219 6 168 182 146
6 81 6 92 8 42 6 168 182 148
6 94 6 92 8 24 6 160 182 149
6 102 6 92 8 5 6 152 182 150
6 91 6 92 8 52 6 151 182 151
6 84 6 92 7 205 6 157 182 152
6 96 6 92 8 72 6 154 182 153
6 109 6 92 8 72 6 167 182 154
6 94 6 92 7 230 6 145 182 156
6 74 6 92 8 76 6 145 182 157
6 78 6 92 7 237 6 158 182 158
6 74 6 92 7 178 6 157 182 159
6 52 6 92 8 70 6 152 182 160
6 83 6 92 8 65 6 154 182 162
6 97 6 92 8 71 6 152 182 163
6 98 6 92 7 227 6 147 182 164
6 99 6 91 8 6 6 140 182 165
6 104 6 91 8 43 6 140 182 166
6 111 6 91 7 231 6 146 182 168
6 106 6 91 8 24 6 156 182 169
6 94 6 91 8 14 6 147 182 170
6 96 6 91 7 207 6 138 182 171
6 103 6 92 8 125 6 143 182 172
6 115 6 91 7 241 6 144 182 173
6 91 6 92 7 217 6 139 182 174
6 106 6 92 8 75 6 145 182 175
6 114 6 92 7 253 6 145 182 177
6 139 6 92 8 4 6 155 182 178
6 122 6 92 8 71 6 157 182 179
6 136 6 92 8 55 6 145 182 180
6 123 6 91 7 207 6 141 182 181
6 135 6 92 7 240 6 162 182 182
6 134 6 91 8 69 6 163 182 183
6 142 6 91 7 253 6 158 182 185
6 117 6 92 8 90 6 158 182 186
6 120 6 91 7 228 6 141 182 187
6 116 6 92 7 235 6 153 182 188
6 122 6 91 8 85 6 159 182 189
6 113 6 92 8 14 6 163 182 190
6 104 6 92 8 33 6 172 182 191
6 89 6 92 8 9 6 171 182 192
6 111 6 91 8 6 6 174 182 193
6 103 6 92 8 77 6 178 182 194
6 90 6 91 7 234 6 157 182 195
6 95 6 91 7 239 6 164 182 196
6 111 6 91 7 213 6 175 182 197
6 136 6 91 8 33 6 160 182 198
6 141 6 91 8 58 6 148 182 199
6 126 6 92 8 42 6 153 182 201
6 148 6 92 8 22 6 159 182 202
6 137 6 91 7 229 6 155 182 203
6 135 6 92 7 236 6 172 182 204
6 104 6 91 8 59 6 185 182 205
6 114 6 91 8 76 6 184 182 206
6 95 6 91 8 2 6 189 182 207
6 83 6 91 8 1 6 192 182 208
6 68 6 91 7 250 6 176 182 210
6 72 6 92 8 44 6 184 182 211
6 82 6 91 7 224 6 194 182 212
6 35 6 91 7 202 6 194 182 213
6 51 6 91 8 106 6 185 182 213
6 54 6 91 7 203 6 167 182 214
6 92 6 91 7 248 6 158 182 215
6 66 6 91 7 248 6 151 182 216
6 72 6 91 7 252 6 145 182 217
6 97 6 91 7 237 6 152 182 218
6 111 6 91 8 200 6 155 182 219
6 110 6 91 7 161 6 151 182 220
6 86 6 91 7 228 6 151 182 221
6 88 6 91 7 243 6 146 182 222
6 98 6 91 7 249 6 149 182 223
6 109 6 90 8 245 6 139 182 224
6 109 6 91 8 7 6 159 182 225
6 110 6 91 7 246 6 155 182 226
6 108 6 91 7 152 6 159 182 227
6 101 6 91 8 49 6 163 182 230
6 53 6 91 7 249 6 162 182 231
6 75 6 91 7 241 6 166 182 232
6 65 6 91 8 4 6 162 182 233
6 92 6 90 7 236 6 172 182 234
6 76 6 91 7 241 6 164 182 236
6 105 6 90 8 29 6 167 182 237
6 93 6 91 8 23 6 164 182 238
6 108 6 91 8 1 6 157 182 239
6 115 6 91 7 186 6 156 182 240
6 147 6 91 8 105 6 146 182 241
6 101 6 91 8 18 6 166 182 243
6 94 6 91 8 34 6 175 182 244
6 156 6 91 7 227 6 171 182 245
6 119 6 90 8 151 6 174 182 246
6 102 6 90 7 248 6 172 182 247
6 52 6 90 7 194 6 167 182 248
6 58 6 91 7 240 6 165 182 249
6 59 6 90 8 114 6 165 182 251
6 61 6 91 8 45 6 163 182 252
6 79 6 90 8 60 6 159 182 253
6 94 6 90 7 241 6 148 182 254
6 128 6 90 7 226 6 154 182 255
6 132 6 90 7 217 6 160 183 0
6 106 6 89 8 43 6 137 183 1
6 148 6 91 8 77 6 150 183 3
6 109 6 90 8 90 6 147 183 4
6 99 6 90 8 32 6 154 183 5
6 134 6 90 8 21 6 168 183 6
6 155 6 91 8 41 6 160 183 7
6 147 6 90 7 236 6 149 183 8
6 169 6 90 7 247 6 143 183 9
6 116 6 91 8 20 6 150 183 10
6 145 6 90 8 134 6 164 183 12
6 133 6 90 8 102 6 169 183 13
6 123 6 90 8 36 6 175 183 14
6 84 6 90 7 197 6 185 183 15
6 70 6 90 7 227 6 180 183 16
6 61 6 90 7 196 6 167 183 18
6 78 6 90 8 82 6 166 183 19
6 57 6 90 8 53 6 147 183 20
6 76 6 90 7 219 6 136 183 21
6 74 6 90 7 230 6 131 183 22
6 42 6 90 7 202 6 137 183 23
6 70 6 89 8 80 6 143 183 25
6 42 6 90 7 250 6 140 183 26
6 103 6 90 8 12 6 141 183 27
6 101 6 90 7 246 6 129 183 28
6 97 6 90 7 237 6 138 183 29
6 108 6 90 8 112 6 128 183 30
6 107 6 89 8 70 6 137 183 32
6 80 6 90 8 48 6 137 183 33
6 78 6 90 8 29 6 150 183 34
6 92 6 89 7 231 6 135 183 35
6 72 6 89 7 215 6 122 183 36
6 85 6 89 8 27 6 130 183 37
6 67 6 89 7 253 6 130 183 38
6 119 6 89 8 92 6 120 183 39
6 108 6 89 8 122 6 129 183 40
6 49 6 89 7 246 6 131 183 42
6 100 6 89 7 224 6 132 183 43
6 44 6 89 7 215 6 129 183 44
6 101 6 89 8 39 6 118 183 45
6 93 6 89 8 54 6 125 183 46
6 110 6 89 7 241 6 109 183 47
6 98 6 89 7 255 6 119 183 49
6 135 6 90 8 79 6 119 183 50
6 92 6 90 8 55 6 113 183 50
6 133 6 89 8 54 6 110 183 51
6 130 6 89 8 54 6 116 183 52
6 124 6 89 8 24 6 107 183 53
6 136 6 89 7 248 6 99 183 54
6 133 6 89 8 24 6 111 183 55
6 133 6 90 8 56 6 118 183 56
6 119 6 90 8 65 6 127 183 57
6 137 6 89 8 66 6 127 183 57
6 120 6 89 8 37 6 121 183 58
6 119 6 89 8 37 6 124 183 59
6 160 6 89 8 63 6 128 183 60
6 144 6 89 8 68 6 116 183 61
6 165 6 89 7 245 6 114 183 62
6 115 6 90 8 7 6 119 183 63
6 146 6 89 7 253 6 109 183 64
6 161 6 89 8 42 6 105 183 65
6 166 6 89 8 54 6 96 183 66
6 131 6 89 7 244 6 133 183 67
6 131 6 89 8 21 6 139 183 68
6 163 6 90 8 61 6 133 183 69
6 171 6 90 7 205 6 129 183 70
6 125 6 89 7 214 6 122 183 71
6 137 6 89 8 44 6 135 183 72
6 105 6 89 8 55 6 150 183 74
6 142 6 89 8 48 6 133 183 75
6 110 6 90 8 16 6 105 183 76
6 108 6 89 7 210 6 118 183 77
6 125 6 90 7 219 6 111 183 78
6 139 6 89 7 238 6 107 183 79
6 149 6 89 7 251 6 132 183 80
6 47 6 89 8 15 6 135 183 81
6 110 6 90 8 122 6 131 183 82
6 150 6 90 8 61 6 118 183 83
6 151 6 89 8 61 6 116 183 84
6 125 6 90 8 37 6 128 183 85
6 128 6 89 8 30 6 132 183 86
6 135 6 90 8 7 6 135 183 87
6 142 6 89 8 46 6 140 183 88
6 128 6 89 8 89 6 140 183 89
6 119 6 90 8 15 6 148 183 90
6 110 6 89 7 233 6 136 183 91
6 126 6 89 7 230 6 132 183 92
6 136 6 89 8 6 6 116 183 94
6 113 6 89 8 41 6 113 183 95
6 125 6 89 8 74 6 139 183 96
6 173 6 90 7 206 6 147 183 97
6 137 6 89 8 115 6 149 183 98
6 130 6 90 8 32 6 140 183 99
6 124 6 90 7 207 6 127 183 100
6 107 6 90 7 178 6 129 183 101
6 73 6 90 8 59 6 126 183 102
6 80 6 90 8 48 6 119 183 103
6 137 6 89 8 71 6 134 183 104
6 92 6 89 8 37 6 119 183 105
6 106 6 90 7 247 6 112 183 106
6 75 6 89 7 204 6 106 183 107
6 141 6 89 8 29 6 115 183 108
6 91 6 89 8 13 6 115 183 109
6 86 6 89 7 247 6 106 183 110
6 105 6 90 8 38 6 110 183 111
6 114 6 90 8 39 6 102 183 112
6 113 6 90 8 11 6 99 183 113
6 135 6 90 8 16 6 91 183 114
6 167 6 90 7 222 6 100 183 115
6 141 6 90 7 245 6 98 183 116
6 160 6 90 8 91 6 105 183 117
6 151 6 89 8 17 6 94 183 118
6 163 6 90 8 46 6 86 183 119
6 134 6 90 8 63 6 101 183 120
6 132 6 90 8 87 6 93 183 122
6 133 6 89 7 137 6 114 183 123
6 153 6 90 8 9 6 117 183 124
6 121 6 90 8 65 6 118 183 125
6 142 6 90 7 236 6 107 183 126
6 154 6 89 7 248 6 109 183 127
6 163 6 90 8 46 6 114 183 128
6 160 6 90 8 25 6 105 183 129
6 114 6 89 7 148 6 111 183 130
6 129 6 90 8 39 6 118 183 131
6 155 6 90 7 235 6 112 183 132
6 120 6 90 8 9 6 108 183 133
6 142 6 90 8 31 6 111 183 134
6 211 6 90 8 70 6 115 183 135
6 125 6 90 8 110 6 100 183 136
6 136 6 90 8 171 6 90 183 137
6 180 6 91 7 207 6 98 183 138
6 155 6 90 8 75 6 108 183 139
6 182 6 90 8 8 6 108 183 139
6 152 6 90 7 252 6 123 183 140
6 143 6 90 7 252 6 116 183 141
6 150 6 91 7 229 6 123 183 142
6 153 6 91 8 1 6 127 183 143
6 153 6 90 7 235 6 148 183 144
6 186 6 90 8 19 6 130 183 145
6 148 6 90 8 61 6 126 183 146
6 184 6 90 8 41 6 130 183 147
6 136 6 91 8 7 6 117 183 148
6 187 6 91 8 6 6 117 183 148
6 181 6 91 8 6 6 128 183 149
6 170 6 90 8 40 6 145 183 150
6 161 6 91 7 188 6 156 183 151
6 185 6 91 8 84 6 152 183 152
6 162 6 91 7 191 6 156 183 153
6 132 6 91 8 57 6 151 183 154
6 132 6 91 7 251 6 139 183 155
6 152 6 91 8 20 6 133 183 156
6 193 6 91 8 196 6 152 183 157
6 172 6 91 8 14 6 165 183 158
6 191 6 91 7 206 6 165 183 159
6 163 6 91 7 179 6 159 183 160
6 168 6 92 8 20 6 159 183 161
6 160 6 91 8 13 6 146 183 162
6 172 6 91 8 46 6 164 183 163
6 153 6 91 7 234 6 174 183 164
6 173 6 91 7 238 6 154 183 165
6 156 6 92 8 31 6 159 183 166
6 145 6 92 8 16 6 160 183 167
6 161 6 91 8 106 6 163 183 168
6 144 6 92 7 223 6 162 183 169
6 130 6 92 8 6 6 155 183 170
6 148 6 92 7 213 6 146 183 171
6 116 6 92 8 3 6 150 183 172
6 132 6 92 7 255 6 157 183 173
6 124 6 92 8 14 6 160 183 174
6 124 6 91 8 93 6 176 183 175
6 102 6 91 7 197 6 171 183 176
6 146 6 91 8 120 6 151 183 177
6 139 6 92 8 62 6 164 183 178
6 110 6 92 7 201 6 163 183 179
6 126 6 92 7 192 6 164 183 180
6 141 6 92 7 224 6 154 183 181
6 141 6 92 8 120 6 143 183 182
6 127 6 92 8 54 6 136 183 183
6 132 6 91 7 224 6 130 183 184
6 134 6 92 8 18 6 137 183 185
6 153 6 91 8 38 6 142 183 186
6 131 6 92 8 24 6 142 183 186
6 122 6 92 7 236 6 165 183 187
6 131 6 92 8 18 6 162 183 188
6 114 6 91 7 221 6 163 183 189
6 111 6 92 7 176 6 156 183 190
6 114 6 92 8 30 6 162 183 192
6 123 6 92 8 66 6 162 183 192
6 130 6 92 8 55 6 156 183 193
6 132 6 92 8 55 6 142 183 194
6 147 6 92 8 72 6 138 183 195
6 154 6 92 7 156 6 149 183 196
6 144 6 92 7 251 6 145 183 197
6 134 6 92 7 253 6 150 183 198
6 110 6 92 8 10 6 159 183 199
6 151 6 91 8 125 6 154 183 200
6 134 6 92 8 83 6 130 183 201
6 140 6 92 8 41 6 125 183 202
6 140 6 92 7 198 6 136 183 203
6 154 6 91 8 20 6 132 183 204
6 158 6 92 7 202 6 138 183 206
6 127 6 92 7 196 6 150 183 207
6 104 6 92 8 46 6 137 183 208
6 137 6 92 8 72 6 148 183 209
6 132 6 92 8 109 6 164 183 210
6 182 6 92 7 236 6 166 183 211
6 155 6 92 7 159 6 162 183 212
6 180 6 91 8 10 6 171 183 213
6 190 6 92 8 119 6 179 183 214
6 173 6 92 7 241 6 162 183 215
6 174 6 93 7 229 6 151 183 216
6 129 6 92 7 223 6 154 183 217
6 149 6 93 7 185 6 173 183 218
6 125 6 93 7 223 6 154 183 219
6 173 6 93 8 92 6 171 183 220
6 151 6 93 8 85 6 178 183 221
6 162 6 92 8 69 6 166 183 222
6 132 6 92 7 199 6 176 183 223
6 153 6 92 7 174 6 179 183 224
6 178 6 93 7 203 6 176 183 225
6 166 6 92 7 177 6 177 183 226
6 193 6 92 8 35 6 163 183 227
6 193 6 93 8 119 6 156 183 228
6 193 6 93 8 1 6 172 183 229
6 146 6 93 7 192 6 187 183 230
6 145 6 93 8 36 6 187 183 230
6 160 6 93 8 106 6 195 183 231
6 176 6 93 8 24 6 196 183 232
6 190 6 93 8 63 6 201 183 233
6 120 6 93 8 63 6 200 183 234
6 146 6 93 7 149 6 197 183 235
6 200 6 93 8 81 6 214 183 236
6 167 6 93 8 106 6 209 183 237
6 190 6 93 8 1 6 207 183 238
6 190 6 93 8 43 6 213 183 239
6 183 6 93 7 250 6 217 183 240
6 146 6 94 7 231 6 217 183 240
6 129 6 93 7 9 6 219 183 241
6 160 6 94 8 9 6 221 183 242
6 115 6 94 8 15 6 235 183 243
6 115 6 93 8 80 6 237 183 244
6 117 6 93 8 44 6 223 183 245
6 130 6 93 8 63 6 205 183 246
6 116 6 94 7 187 6 242 183 249
6 136 6 93 7 196 6 231 183 250
6 100 6 93 8 101 6 214 183 251
6 100 6 93 8 15 6 207 183 252
6 96 6 93 8 78 6 199 183 253
6 112 6 93 7 234 6 211 183 254
6 95 6 93 7 205 6 218 183 255
6 100 6 93 8 89 6 203 184 0
6 128 6 93 8 58 6 215 184 1
6 83 6 93 7 179 6 234 184 2
6 91 6 93 8 5 6 222 184 3
6 115 6 93 8 96 6 206 184 4
6 80 6 93 8 4 6 214 184 5
6 100 6 93 8 4 6 196 184 6
6 91 6 92 8 79 6 191 184 7
6 80 6 93 7 252 6 193 184 8
6 95 6 93 8 24 6 189 184 9
6 100 6 93 8 21 6 167 184 10
6 114 6 93 8 75 6 194 184 11
6 113 6 93 8 85 6 204 184 12
6 113 6 93 7 140 6 205 184 13
6 78 6 93 8 108 6 192 184 14
6 112 6 93 7 249 6 173 184 15
6 106 6 93 8 11 6 165 184 16
6 95 6 93 7 185 6 167 184 17
6 101 6 94 8 98 6 173 184 18
6 93 6 93 8 28 6 156 184 19
6 105 6 92 7 238 6 143 184 20
6 95 6 92 7 178 6 143 184 21
6 110 6 93 8 56 6 152 184 22
6 113 6 92 7 211 6 152 184 22
6 115 6 93 8 85 6 177 184 23
6 97 6 93 8 17 6 174 184 24
6 117 6 92 8 59 6 151 184 25
6 125 6 93 8 59 6 157 184 26
6 94 6 93 7 224 6 163 184 27
6 112 6 92 7 232 6 160 184 28
6 132 6 92 8 52 6 141 184 29
6 139 6 93 7 196 6 136 184 30
6 125 6 93 8 53 6 143 184 31
6 118 6 93 7 201 6 144 184 32
6 107 6 93 8 28 6 144 184 33
6 132 6 92 8 118 6 140 184 34
6 134 6 92 7 173 6 117 184 36
6 108 6 93 8 72 6 101 184 37
6 152 6 93 7 194 6 96 184 38
6 156 6 92 8 11 6 114 184 39
6 126 6 93 8 116 6 148 184 40
6 135 6 92 7 171 6 134 184 41
6 156 6 93 7 217 6 131 184 42
6 132 6 93 7 230 6 139 184 43
6 144 6 93 8 158 6 134 184 45
6 152 6 93 8 8 6 136 184 46
6 153 6 93 7 182 6 151 184 47
6 141 6 93 7 164 6 147 184 48
6 170 6 93 8 134 6 139 184 49
6 155 6 93 7 143 6 164 184 50
6 136 6 93 8 126 6 171 184 51
6 129 6 93 7 206 6 132 184 53
6 128 6 93 8 40 6 134 184 54
6 142 6 93 8 10 6 158 184 55
6 153 6 93 7 201 6 162 184 56
6 135 6 93 8 174 6 164 184 57
6 134 6 93 7 159 6 153 184 58
6 137 6 92 7 221 6 146 184 59
6 143 6 93 8 105 6 138 184 61
6 146 6 93 7 198 6 143 184 62
6 101 6 93 8 32 6 138 184 63
6 143 6 93 8 54 6 147 184 64
6 143 6 93 8 185 6 161 184 65
6 168 6 93 8 11 6 163 184 66
6 115 6 93 7 235 6 140 184 67
6 152 6 93 8 57 6 140 184 68
6 104 6 93 8 57 6 140 184 68
6 132 6 93 8 57 6 165 184 69
6 117 6 94 7 224 6 170 184 70
6 164 6 93 7 254 6 166 184 71
6 129 6 93 8 45 6 162 184 72
6 132 6 93 7 189 6 154 184 73
6 101 6 93 8 104 6 151 184 74
6 101 6 93 8 7 6 143 184 75
6 110 6 93 8 62 6 141 184 76
6 115 6 93 7 236 6 136 184 77
6 88 6 93 7 136 6 136 184 77
6 138 6 93 8 182 6 150 184 78
6 105 6 93 7 188 6 151 184 79
6 85 6 93 7 65 6 131 184 80
6 101 6 93 8 65 6 145 184 81
6 136 6 93 7 201 6 138 184 82
6 128 6 93 8 72 6 128 184 83
6 130 6 93 8 108 6 132 184 84
6 135 6 93 7 182 6 136 184 85
6 126 6 93 7 144 6 144 184 88
6 139 6 93 8 23 6 147 184 90
6 151 6 93 8 85 6 154 184 91
6 157 6 93 8 111 6 131 184 92
6 137 6 93 7 215 6 118 184 93
6 157 6 93 8 36 6 120 184 94
6 144 6 93 8 132 6 135 184 95
6 126 6 94 7 158 6 127 184 96
6 154 6 94 8 191 6 138 184 98
6 146 6 93 7 191 6 146 184 99
6 117 6 93 7 191 6 144 184 100
6 140 6 93 8 3 6 140 184 101
6 152 6 93 8 138 6 135 184 102
6 168 6 93 7 247 6 136 184 103
6 160 6 94 8 7 6 136 184 104
6 126 6 94 7 253 6 138 184 106
6 157 6 94 8 72 6 129 184 107
6 162 6 94 7 199 6 162 184 108
6 173 6 93 7 219 6 154 184 109
6 182 6 94 7 168 6 138 184 110
6 172 6 94 8 124 6 123 184 111
6 167 6 94 7 229 6 129 184 112
6 153 6 94 7 173 6 142 184 113
6 185 6 94 8 85 6 144 184 115
6 160 6 94 7 253 6 152 184 116
6 169 6 94 8 54 6 155 184 117
6 149 6 94 7 199 6 160 184 118
6 155 6 94 8 168 6 160 184 119
6 137 6 94 8 64 6 180 184 120
6 150 6 94 8 81 6 166 184 121
6 164 6 94 7 232 6 168 184 123
6 139 6 94 7 235 6 176 184 124
6 130 6 94 8 86 6 162 184 125
6 134 6 95 7 174 6 159 184 126
6 138 6 94 8 97 6 156 184 127
6 137 6 95 7 161 6 157 184 128
6 138 6 94 8 0 6 156 184 129
6 130 6 94 8 72 6 155 184 131
6 175 6 94 7 203 6 167 184 132
6 160 6 95 8 42 6 166 184 133
6 149 6 95 7 179 6 149 184 134
6 151 6 94 8 10 6 138 184 135
6 170 6 94 8 165 6 146 184 136
6 143 6 95 8 8 6 163 184 137
6 151 6 94 8 0 6 146 184 138
6 137 6 94 8 57 6 149 184 139
6 170 6 95 8 72 6 153 184 140
6 121 6 95 7 254 6 174 184 141
6 162 6 95 8 5 6 176 184 142
6 128 6 95 7 255 6 165 184 143
6 145 6 95 8 34 6 157 184 144
6 169 6 95 7 226 6 157 184 145
6 167 6 95 8 70 6 156 184 146
6 156 6 95 7 198 6 150 184 147
6 175 6 95 8 89 6 171 184 148
6 177 6 95 7 199 6 183 184 149
6 154 6 95 8 83 6 171 184 150
6 207 6 95 7 186 6 146 184 151
6 173 6 95 8 128 6 147 184 152
6 179 6 95 7 226 6 159 184 153
6 157 6 96 8 7 6 171 184 154
6 171 6 95 7 227 6 180 184 155
6 165 6 95 8 116 6 190 184 156
6 174 6 95 7 203 6 200 184 157
6 174 6 96 8 47 6 185 184 158
6 148 6 95 7 192 6 161 184 159
6 167 6 96 7 251 6 151 184 160
6 169 6 95 8 91 6 151 184 160
6 144 6 95 8 91 6 161 184 161
6 143 6 95 8 33 6 184 184 162
6 143 6 95 7 253 6 172 184 163
6 165 6 96 8 41 6 182 184 164
6 169 6 96 7 227 6 178 184 165
6 153 6 96 8 128 6 173 184 166
6 193 6 96 8 9 6 175 184 167
6 162 6 96 7 175 6 175 184 167
6 143 6 96 8 112 6 167 184 168
6 178 6 96 8 112 6 175 184 169
6 152 6 96 7 189 6 180 184 170
6 152 6 96 7 228 6 176 184 171
6 135 6 95 8 64 6 175 184 172
6 191 6 95 8 85 6 177 184 173
6 164 6 96 7 208 6 182 184 174
6 171 6 96 8 11 6 183 184 175
6 125 6 96 8 71 6 194 184 176
6 120 6 96 8 27 6 153 184 178
6 139 6 96 7 135 6 166 184 179
6 137 6 96 8 151 6 185 184 180
6 150 6 96 8 20 6 191 184 181
6 133 6 96 7 176 6 184 184 182
6 165 6 96 8 90 6 172 184 183
6 139 6 96 8 95 6 172 184 185
6 131 6 96 7 237 6 159 184 186
6 135 6 96 7 236 6 163 184 187
6 172 6 97 8 40 6 165 184 188
6 144 6 96 8 29 6 176 184 189
6 140 6 96 8 51 6 187 184 190
6 153 6 96 8 8 6 168 184 191
6 120 6 96 7 214 6 156 184 192
6 123 6 96 8 27 6 171 184 193
6 103 6 97 7 222 6 180 184 194
6 134 6 97 8 56 6 170 184 196
6 105 6 96 8 13 6 164 184 197
6 141 6 96 8 20 6 146 184 198
6 121 6 96 7 252 6 135 184 199
6 162 6 96 8 120 6 132 184 200
6 142 6 96 7 203 6 134 184 201
6 142 6 96 7 249 6 131 184 202
6 167 6 97 8 25 6 127 184 203
6 152 6 96 8 22 6 115 184 204
6 186 6 96 7 249 6 102 184 205
6 179 6 96 8 19 6 126 184 206
6 154 6 97 8 30 6 144 184 208
6 152 6 96 7 250 6 135 184 209
6 151 6 97 7 210 6 129 184 210
6 176 6 96 8 101 6 128 184 211
6 172 6 97 8 9 6 129 184 212
6 173 6 97 7 251 6 141 184 213
6 177 6 97 8 86 6 136 184 214
6 164 6 97 7 230 6 137 184 216
6 168 6 97 7 211 6 125 184 217
6 160 6 97 8 152 6 122 184 218
6 189 6 96 8 21 6 110 184 219
6 152 6 97 8 25 6 132 184 220
6 191 6 97 7 241 6 145 184 221
6 161 6 97 8 69 6 138 184 222
6 172 6 97 7 229 6 131 184 223
6 156 6 97 8 107 6 123 184 224
6 149 6 97 7 220 6 123 184 226
6 166 6 97 7 254 6 119 184 227
6 171 6 98 8 17 6 123 184 228
6 200 6 97 8 22 6 122 184 229
6 169 6 98 8 2 6 131 184 230
6 196 6 98 7 233 6 141 184 231
6 191 6 98 8 2 6 157 184 232
6 176 6 98 7 216 6 122 184 234
6 181 6 98 8 112 6 132 184 235
6 154 6 98 7 173 6 141 184 236
6 188 6 97 8 19 6 136 184 237
6 203 6 98 8 49 6 125 184 238
6 158 6 98 7 237 6 123 184 239
6 176 6 98 8 29 6 131 184 240
6 207 6 98 8 237 6 133 184 241
6 165 6 98 7 248 6 133 184 242
6 205 6 98 8 69 6 142 184 244
6 164 6 98 7 207 6 134 184 245
6 154 6 98 8 44 6 122 184 246
6 176 6 98 8 28 6 140 184 247
6 199 6 99 8 110 6 128 184 249
6 188 6 98 7 172 6 133 184 250
6 174 6 99 7 174 6 135 184 251
6 174 6 98 8 168 6 135 184 251
6 184 6 99 8 168 6 149 184 252
6 169 6 99 7 212 6 154 184 253
6 205 6 99 7 236 6 157 184 254
6 190 6 99 7 252 6 154 184 255
6 209 6 99 8 77 6 161 185 0
6 184 6 99 8 18 6 168 185 1
6 202 6 99 7 185 6 159 185 2
6 169 6 99 8 78 6 160 185 3
6 195 6 99 7 241 6 163 185 4
6 173 6 99 8 45 6 148 185 5
6 173 6 99 7 208 6 160 185 6
6 177 6 99 8 11 6 180 185 7
6 178 6 99 8 35 6 185 185 8
6 179 6 100 7 243 6 190 185 9
6 178 6 99 8 44 6 190 185 9
6 170 6 100 8 14 6 196 185 10
6 183 6 99 8 3 6 202 185 11
6 163 6 100 8 72 6 175 185 13
6 168 6 99 7 193 6 177 185 14
6 173 6 100 8 33 6 184 185 15
6 184 6 100 8 52 6 173 185 16
6 176 6 99 7 226 6 136 185 18
6 178 6 100 8 11 6 141 185 19
6 180 6 100 8 6 6 169 185 20
6 138 6 100 7 186 6 194 185 21
6 142 6 99 8 85 6 187 185 22
6 138 6 100 7 178 6 171 185 23
6 158 6 100 8 45 6 149 185 24
6 179 6 100 8 129 6 146 185 25
6 157 6 100 7 206 6 147 185 26
6 123 6 100 7 249 6 145 185 27
6 162 6 100 7 218 6 147 185 28
6 137 6 100 8 152 6 140 185 29
6 119 6 100 7 199 6 141 185 30
6 127 6 100 8 8 6 132 185 31
6 140 6 100 8 30 6 119 185 32
6 134 6 100 7 232 6 132 185 33
6 123 6 100 8 44 6 132 185 34
6 104 6 100 8 27 6 123 185 35
6 133 6 100 8 66 6 121 185 36
6 149 6 100 8 15 6 110 185 37
6 139 6 100 8 79 6 117 185 38
6 150 6 100 7 232 6 122 185 39
6 167 6 100 7 230 6 126 185 40
6 200 6 100 8 7 6 122 185 41
6 184 6 100 8 126 6 111 185 42
6 180 6 100 7 156 6 114 185 43
6 171 6 100 7 233 6 118 185 44
6 217 6 100 8 76 6 110 185 45
6 192 6 100 8 0 6 101 185 46
6 192 6 100 8 25 6 124 185 47
6 171 6 100 8 11 6 126 185 48
6 180 6 101 8 22 6 114 185 49
6 201 6 100 8 45 6 126 185 50
6 186 6 100 8 8 6 130 185 51
6 198 6 101 7 243 6 130 185 52
6 180 6 101 7 207 6 146 185 52
6 178 6 101 8 18 6 146 185 53
6 164 6 101 8 69 6 136 185 54
6 157 6 100 7 207 6 147 185 55
6 160 6 101 7 207 6 148 185 56
6 179 6 101 8 129 6 138 185 57
6 168 6 101 7 211 6 130 185 58
6 187 6 101 8 6 6 126 185 59
6 188 6 101 7 214 6 121 185 60
6 198 6 101 8 29 6 140 185 61
6 200 6 101 8 107 6 131 185 62
6 204 6 101 7 222 6 124 185 63
6 190 6 101 7 243 6 123 185 64
6 195 6 102 7 242 6 128 185 65
6 189 6 101 8 111 6 121 185 66
6 164 6 102 8 55 6 122 185 67
6 166 6 101 7 244 6 132 185 68
6 167 6 101 8 124 6 147 185 69
6 164 6 101 8 13 6 152 185 70
6 165 6 101 7 174 6 148 185 71
6 165 6 101 8 135 6 135 185 72
6 171 6 102 7 211 6 131 185 73
6 155 6 102 8 83 6 114 185 74
6 175 6 102 7 225 6 118 185 75
6 157 6 102 8 11 6 118 185 76
6 172 6 102 8 20 6 140 185 76
6 154 6 102 7 177 6 145 185 77
6 164 6 102 8 21 6 140 185 78
6 172 6 101 8 21 6 144 185 79
6 195 6 102 8 75 6 119 185 80
6 164 6 102 8 77 6 111 185 81
6 156 6 102 8 17 6 123 185 82
6 170 6 102 7 231 6 146 185 83
6 172 6 102 7 232 6 142 185 84
6 172 6 102 7 238 6 123 185 85
6 177 6 102 8 54 6 118 185 86
6 172 6 102 8 45 6 124 185 87
6 156 6 102 8 32 6 124 185 87
6 170 6 103 8 32 6 115 185 88
6 181 6 102 8 32 6 116 185 89
6 170 6 102 8 14 6 134 185 90
6 170 6 102 8 23 6 141 185 91
6 178 6 103 7 235 6 140 185 92
6 168 6 102 7 229 6 140 185 92
6 193 6 102 7 229 6 148 185 93
6 175 6 102 8 60 6 147 185 97
6 159 6 102 7 208 6 138 185 98
6 159 6 102 7 237 6 135 185 99
6 176 6 102 8 134 6 134 185 100
6 174 6 103 7 210 6 131 185 101
6 179 6 103 8 76 6 131 185 102
6 161 6 103 8 15 6 127 185 103
6 161 6 103 7 224 6 124 185 104
6 178 6 103 8 56 6 126 185 105
6 175 6 102 7 229 6 126 185 105
6 194 6 103 7 229 6 144 185 106
6 170 6 103 7 213 6 165 185 108
6 177 6 102 8 97 6 156 185 109
6 186 6 102 7 254 6 156 185 109
6 165 6 103 8 19 6 129 185 111
6 168 6 102 7 245 6 130 185 112
6 174 6 103 8 81 6 130 185 113
6 173 6 103 7 209 6 130 185 113
6 182 6 103 8 46 6 127 185 114
6 178 6 103 8 6 6 132 185 115
6 166 6 104 8 38 6 113 185 116
6 187 6 103 8 30 6 105 185 117
6 179 6 104 8 30 6 112 185 118
6 174 6 103 7 203 6 126 185 119
6 181 6 103 8 31 6 152 185 120
6 191 6 103 8 41 6 158 185 121
6 181 6 104 7 238 6 148 185 122
6 175 6 103 8 95 6 138 185 123
6 197 6 104 8 21 6 136 185 124
6 179 6 103 8 13 6 139 185 125
6 186 6 103 8 13 6 139 185 126
6 196 6 104 8 44 6 154 185 127
6 214 6 104 8 32 6 158 185 128
6 201 6 104 8 12 6 147 185 129
6 200 6 104 7 201 6 145 185 130
6 187 6 104 8 42 6 149 185 131
6 181 6 104 7 217 6 149 185 132
6 169 6 104 8 64 6 154 185 133
6 169 6 104 8 70 6 150 185 134
6 159 6 104 7 255 6 154 185 135
6 158 6 104 7 250 6 134 185 136
6 193 6 104 8 83 6 136 185 137
6 188 6 105 8 38 6 137 185 138
6 177 6 104 7 254 6 133 185 139
6 168 6 104 7 221 6 135 185 140
6 178 6 104 7 253 6 129 185 141
6 193 6 105 8 51 6 131 185 142
6 196 6 104 8 34 6 142 185 143
6 188 6 105 8 7 6 141 185 144
6 191 6 104 7 236 6 132 185 145
6 181 6 105 8 53 6 135 185 146
6 179 6 105 8 37 6 135 185 147
6 206 6 104 8 21 6 127 185 148
6 205 6 105 7 244 6 128 185 149
6 185 6 104 8 42 6 140 185 150
6 194 6 105 8 30 6 140 185 151
6 192 6 105 7 249 6 141 185 151
6 199 6 105 8 20 6 146 185 153
6 191 6 105 7 247 6 154 185 153
6 187 6 105 8 60 6 158 185 155
6 184 6 105 8 47 6 163 185 156
6 187 6 105 8 20 6 156 185 157
6 173 6 105 8 10 6 162 185 158
6 178 6 105 7 235 6 168 185 159
6 176 6 105 7 219 6 173 185 160
6 172 6 105 7 255 6 163 185 161
6 194 6 105 8 87 6 162 185 163
6 165 6 105 7 241 6 171 185 164
6 164 6 105 7 250 6 158 185 165
6 182 6 106 8 26 6 159 185 166
6 174 6 105 8 17 6 165 185 167
6 182 6 106 7 229 6 161 185 168
6 187 6 106 8 64 6 157 185 169
6 197 6 106 8 45 6 145 185 170
6 186 6 106 8 65 6 137 185 171
6 186 6 106 7 244 6 131 185 172
6 178 6 106 7 229 6 150 185 173
6 182 6 106 8 9 6 150 185 173
6 186 6 106 8 9 6 160 185 174
6 182 6 106 8 30 6 149 185 175
6 162 6 106 7 225 6 142 185 176
6 162 6 106 7 255 6 137 185 177
6 169 6 106 8 31 6 148 185 178
6 159 6 106 8 18 6 148 185 178
6 159 6 106 8 18 6 151 185 179
6 146 6 106 8 2 6 148 185 180
6 146 6 106 7 241 6 162 185 181
6 145 6 106 7 237 6 151 185 182
6 169 6 106 8 50 6 151 185 182
6 176 6 106 8 3 6 145 185 184
6 141 6 106 7 255 6 145 185 184
6 161 6 107 8 10 6 134 185 185
6 147 6 106 8 10 6 147 185 186
6 150 6 106 8 28 6 147 185 187
6 155 6 106 8 7 6 145 185 188
6 155 6 106 7 254 6 141 185 189
6 162 6 106 8 86 6 122 185 190
6 166 6 106 8 24 6 122 185 191
6 149 6 106 8 27 6 124 185 191
6 152 6 107 8 27 6 139 185 192
6 151 6 106 7 234 6 134 185 193
6 174 6 106 7 242 6 143 185 194
6 174 6 106 8 48 6 146 185 195
6 168 6 106 8 7 6 144 185 196
6 137 6 106 8 3 6 139 185 197
6 143 6 106 8 22 6 154 185 198
6 154 6 106 7 249 6 145 185 199
6 160 6 106 8 46 6 134 185 200
6 163 6 106 8 15 6 132 185 201
6 152 6 106 7 253 6 134 185 202
6 171 6 107 8 38 6 142 185 203
6 159 6 106 8 7 6 144 185 204
6 165 6 107 7 241 6 145 185 205
6 161 6 107 7 255 6 135 185 206
6 168 6 107 8 63 6 137 185 207
6 183 6 106 8 3 6 148 185 208
6 179 6 107 8 3 6 145 185 209
6 169 6 107 7 225 6 135 185 210
6 193 6 107 8 0 6 131 185 211
6 183 6 107 8 34 6 130 185 212
6 180 6 107 8 62 6 131 185 213
6 176 6 107 8 51 6 131 185 214
6 176 6 107 7 244 6 140 185 215
6 170 6 107 8 22 6 148 185 216
6 176 6 107 7 230 6 146 185 217
6 192 6 107 8 47 6 143 185 218
6 180 6 107 7 247 6 147 185 219
6 179 6 107 8 43 6 147 185 219
6 170 6 107 8 42 6 152 185 220
6 191 6 108 8 11 6 143 185 222
6 160 6 107 8 14 6 133 185 223
6 167 6 107 8 12 6 131 185 224
6 167 6 108 8 27 6 131 185 224
6 167 6 107 7 240 6 136 185 225
6 162 6 108 8 2 6 142 185 226
6 162 6 107 7 255 6 143 185 227
6 166 6 107 7 255 6 133 185 228
6 172 6 108 8 44 6 136 185 229
6 162 6 107 8 22 6 144 185 230
6 161 6 107 8 28 6 145 185 231
6 183 6 107 8 11 6 143 185 232
6 185 6 107 8 36 6 147 185 233
6 191 6 107 8 21 6 143 185 234
6 202 6 108 7 228 6 146 185 235
6 187 6 108 8 48 6 146 185 236
6 187 6 108 8 11 6 145 185 237
6 174 6 108 8 8 6 149 185 238
6 184 6 108 8 7 6 144 185 239
6 188 6 108 8 1 6 167 185 240
6 202 6 108 8 27 6 163 185 241
6 210 6 108 8 13 6 171 185 242
6 209 6 108 8 27 6 174 185 243
6 203 6 108 7 250 6 173 185 245
6 196 6 108 8 16 6 164 185 246
6 187 6 108 8 16 6 161 185 247
6 189 6 108 8 4 6 152 185 248
6 189 6 109 7 230 6 164 185 249
6 196 6 108 8 20 6 168 185 250
6 180 6 108 8 19 6 176 185 251
6 188 6 108 8 29 6 183 185 252
6 203 6 108 8 26 6 190 185 254
6 209 6 108 8 33 6 191 185 255
6 198 6 108 7 240 6 188 186 0
6 204 6 109 8 6 6 189 186 1
6 197 6 109 7 253 6 199 186 2
6 191 6 109 8 2 6 208 186 3
6 186 6 109 8 4 6 201 186 4
6 196 6 109 8 25 6 204 186 6
6 193 6 109 8 33 6 215 186 7
6 191 6 110 8 21 6 210 186 8
6 191 6 109 8 36 6 206 186 9
6 184 6 109 8 3 6 213 186 10
6 186 6 109 8 5 6 213 186 10
6 176 6 109 8 5 6 210 186 11
6 174 6 109 8 10 6 218 186 12
6 174 6 109 8 14 6 221 186 13
6 177 6 109 8 0 6 227 186 14
6 184 6 110 8 2 6 223 186 15
6 192 6 109 8 14 6 223 186 15
6 202 6 110 8 14 6 218 186 16
6 192 6 110 8 28 6 210 186 17
6 189 6 110 8 43 6 203 186 18
6 189 6 110 8 26 6 211 186 19
6 189 6 109 7 232 6 215 186 20
6 172 6 110 7 249 6 215 186 20
6 172 6 110 7 249 6 214 186 21
6 163 6 110 8 20 6 231 186 22
6 163 6 110 8 39 6 229 186 23
6 162 6 110 8 32 6 219 186 24
6 154 6 110 8 11 6 219 186 24
6 160 6 110 8 17 6 207 186 25
6 170 6 110 8 17 6 210 186 26
6 169 6 110 7 254 6 204 186 27
6 169 6 110 7 239 6 215 186 28
6 167 6 110 8 17 6 215 186 29
6 151 6 110 8 21 6 215 186 29
6 156 6 110 8 21 6 206 186 30
6 160 6 110 8 16 6 211 186 31
6 160 6 110 7 246 6 232 186 32
6 153 6 110 8 6 6 213 186 33
6 162 6 110 8 1 6 213 186 34
6 160 6 110 8 23 6 203 186 34
6 163 6 111 8 23 6 201 186 35
6 155 6 110 8 19 6 210 186 36
6 156 6 110 8 16 6 205 186 37
6 148 6 110 8 21 6 199 186 38
6 160 6 110 8 21 6 205 186 39
6 156 6 110 8 10 6 205 186 40
6 161 6 110 8 9 6 200 186 41
6 156 6 110 8 19 6 212 186 42
6 163 6 110 8 9 6 205 186 43
6 156 6 111 8 11 6 203 186 44
6 159 6 110 8 16 6 201 186 45
6 160 6 110 8 18 6 202 186 46
6 163 6 110 8 29 6 194 186 47
6 157 6 110 8 17 6 186 186 49
6 161 6 110 8 15 6 192 186 50
6 166 6 110 8 19 6 185 186 51
6 151 6 111 8 6 6 201 186 52
6 146 6 110 8 30 6 205 186 53
6 154 6 110 8 17 6 199 186 54
6 162 6 111 8 9 6 199 186 54
6 142 6 111 8 8 6 180 186 55
6 161 6 110 8 13 6 171 186 56
6 165 6 111 8 12 6 174 186 57
6 160 6 110 8 12 6 185 186 58
6 164 6 111 8 14 6 184 186 59
6 158 6 110 8 20 6 186 186 60
6 166 6 111 8 20 6 180 186 61
6 182 6 111 7 251 6 180 186 62
6 181 6 111 8 2 6 185 186 63
6 178 6 111 8 6 6 201 186 64
6 178 6 111 8 11 6 190 186 65
6 176 6 111 8 8 6 177 186 66
6 177 6 111 8 15 6 172 186 67
6 183 6 111 8 6 6 172 186 68
6 188 6 111 8 10 6 172 186 69
6 184 6 111 8 20 6 162 186 70
6 196 6 111 8 8 6 162 186 70
6 180 6 111 8 8 6 176 186 71
6 177 6 111 8 15 6 177 186 72
6 169 6 111 8 15 6 188 186 73
6 168 6 111 8 17 6 196 186 74
6 165 6 111 8 16 6 198 186 75
6 166 6 111 8 10 6 197 186 76
6 171 6 111 8 3 6 203 186 77
6 169 6 111 8 19 6 197 186 78
6 169 6 112 8 25 6 195 186 79
6 169 6 112 8 34 6 197 186 80
6 170 6 111 8 36 6 195 186 81
6 166 6 111 8 8 6 191 186 82
6 172 6 112 8 28 6 182 186 83
6 168 6 112 8 34 6 191 186 84
6 168 6 111 8 15 6 195 186 85
6 161 6 112 7 254 6 187 186 86
6 164 6 111 8 9 6 192 186 87
6 157 6 112 8 21 6 190 186 88
6 157 6 112 8 15 6 195 186 89
6 158 6 111 8 13 6 183 186 90
6 155 6 112 8 9 6 174 186 92
6 154 6 111 8 13 6 184 186 93
6 161 6 112 8 22 6 186 186 94
6 153 6 111 8 6 6 184 186 95
6 155 6 112 8 12 6 170 186 96
6 150 6 112 8 20 6 182 186 97
6 148 6 112 8 40 6 183 186 98
6 154 6 111 8 24 6 189 186 99
6 154 6 111 8 36 6 184 186 100
6 147 6 111 8 39 6 185 186 101
6 152 6 111 8 27 6 187 186 102
6 153 6 111 8 13 6 189 186 103
6 153 6 111 8 21 6 185 186 104
6 150 6 111 8 33 6 193 186 105
6 156 6 112 8 16 6 200 186 106
6 156 6 112 8 20 6 191 186 107
6 152 6 112 8 4 6 191 186 108
6 151 6 111 8 29 6 205 186 109
6 158 6 112 8 23 6 204 186 110
6 143 6 112 8 23 6 204 186 111
6 137 6 111 8 23 6 197 186 111
6 153 6 112 8 23 6 184 186 112
6 152 6 112 8 14 6 192 186 113
6 152 6 111 8 10 6 192 186 114
6 152 6 112 8 26 6 186 186 115
6 158 6 112 8 17 6 189 186 116
6 156 6 112 8 9 6 193 186 117
6 154 6 111 8 8 6 191 186 118
6 151 6 112 8 8 6 190 186 119
6 155 6 112 8 12 6 197 186 120
6 147 6 112 8 26 6 193 186 121
6 147 6 112 8 0 6 188 186 122
6 162 6 111 8 14 6 163 186 128
6 158 6 112 8 9 6 155 186 129
6 154 6 111 8 6 6 183 186 130
6 154 6 112 8 12 6 178 186 131
6 159 6 112 8 12 6 183 186 132
6 153 6 112 8 25 6 183 186 133
6 157 6 112 8 14 6 175 186 134
6 151 6 112 8 14 6 173 186 135
6 152 6 112 8 15 6 192 186 136
6 155 6 112 8 14 6 182 186 137
6 145 6 112 8 11 6 172 186 138
6 159 6 112 8 12 6 189 186 139
6 149 6 112 8 12 6 203 186 140
6 155 6 112 8 23 6 183 186 141
6 153 6 112 8 11 6 177 186 142
6 151 6 112 8 17 6 177 186 143
6 147 6 112 8 14 6 175 186 144
6 152 6 112 8 14 6 169 186 145
6 153 6 112 8 13 6 178 186 147
6 154 6 112 8 12 6 164 186 148
6 151 6 112 8 25 6 168 186 149
6 156 6 112 8 1 6 183 186 150
6 156 6 112 8 22 6 182 186 151
6 154 6 112 8 14 6 172 186 152
6 157 6 112 8 14 6 164 186 153
6 157 6 112 8 6 6 158 186 154
6 149 6 113 8 12 6 188 186 155
6 155 6 112 8 19 6 182 186 156
6 158 6 112 8 27 6 177 186 157
6 159 6 112 8 24 6 178 186 158
6 154 6 112 8 18 6 178 186 159
6 148 6 112 8 12 6 181 186 160
6 147 6 112 8 10 6 178 186 161
6 154 6 112 8 10 6 171 186 162
6 151 6 112 8 12 6 179 186 163
6 156 6 112 8 1 6 174 186 164
6 157 6 112 8 7 6 174 186 165
6 153 6 113 8 15 6 178 186 166
6 151 6 112 8 38 6 175 186 167
6 150 6 112 8 18 6 163 186 168
6 149 6 112 8 8 6 176 186 169
6 150 6 112 8 17 6 168 186 170
6 154 6 112 7 253 6 175 186 171
6 153 6 112 8 16 6 178 186 172
6 147 6 112 8 22 6 192 186 173
6 153 6 112 8 28 6 191 186 174
6 152 6 112 8 21 6 179 186 175
6 154 6 112 8 9 6 182 186 176
6 154 6 112 8 21 6 172 186 177
6 153 6 113 8 0 6 171 186 178
6 154 6 112 8 16 6 171 186 179
6 153 6 113 8 5 6 176 186 180
6 150 6 112 8 3 6 166 186 181
6 153 6 112 8 11 6 172 186 182
6 154 6 113 8 20 6 176 186 183
6 158 6 112 8 7 6 171 186 184
6 155 6 112 8 12 6 184 186 185
6 157 6 112 8 11 6 180 186 186
6 155 6 112 8 22 6 186 186 187
6 151 6 112 8 6 6 186 186 188
6 151 6 112 8 29 6 185 186 189
6 149 6 112 8 35 6 180 186 190
6 152 6 113 7 241 6 175 186 191
6 152 6 113 8 37 6 177 186 192
6 151 6 113 8 41 6 178 186 193
6 161 6 113 8 5 6 178 186 193
6 164 6 113 8 13 6 172 186 194
6 154 6 113 8 13 6 176 186 195
6 143 6 113 8 29 6 189 186 196
6 143 6 112 8 8 6 180 186 197
6 148 6 112 8 11 6 184 186 198
6 143 6 113 8 3 6 184 186 198
6 154 6 113 8 20 6 173 186 199
6 147 6 112 8 17 6 181 186 200
6 150 6 112 8 17 6 181 186 201
6 151 6 112 8 14 6 177 186 202
6 155 6 112 8 21 6 178 186 203
6 156 6 112 7 246 6 171 186 204
6 156 6 113 8 42 6 172 186 205
6 154 6 113 7 240 6 166 186 206
6 155 6 113 8 11 6 172 186 207
6 134 6 113 8 13 6 172 186 207
6 160 6 113 8 18 6 179 186 208
6 158 6 113 8 18 6 183 186 209
6 154 6 113 8 10 6 186 186 210
6 153 6 113 8 16 6 182 186 211
6 143 6 112 8 16 6 182 186 212
6 145 6 113 8 18 6 175 186 213
6 148 6 113 8 16 6 188 186 214
6 148 6 113 8 15 6 179 186 215
6 154 6 113 8 6 6 183 186 216
6 150 6 113 8 19 6 174 186 217
6 148 6 112 8 17 6 173 186 218
6 140 6 112 8 16 6 176 186 219
6 151 6 113 8 12 6 179 186 221
6 158 6 113 7 246 6 174 186 222
6 153 6 112 8 15 6 165 186 223
6 153 6 113 8 3 6 160 186 224
6 158 6 113 8 12 6 180 186 225
6 151 6 112 8 36 6 188 186 226
6 154 6 113 8 23 6 182 186 227
6 156 6 113 8 25 6 182 186 228
6 158 6 112 8 32 6 173 186 229
6 153 6 112 8 17 6 175 186 230
6 159 6 113 8 17 6 178 186 231
6 162 6 113 8 11 6 177 186 232
6 150 6 113 8 9 6 185 186 233
6 154 6 113 8 6 6 175 186 234
6 161 6 113 8 16 6 188 186 235
6 153 6 113 8 18 6 196 186 236
6 153 6 113 8 8 6 192 186 237
6 156 6 113 8 8 6 200 186 238
6 154 6 113 8 17 6 191 186 239
6 156 6 113 8 18 6 175 186 240
6 153 6 113 8 4 6 174 186 241
6 151 6 113 8 19 6 177 186 242
6 150 6 112 8 16 6 178 186 243
6 152 6 113 8 16 6 182 186 244
6 150 6 113 8 15 6 179 186 245
6 151 6 113 8 11 6 182 186 246
6 153 6 112 8 4 6 180 186 247
6 155 6 112 8 16 6 181 186 248
6 153 6 112 8 37 6 172 186 249
6 154 6 113 8 9 6 170 186 250
6 153 6 113 8 17 6 170 186 251
6 156 6 113 8 3 6 174 186 252
6 156 6 113 8 20 6 191 186 253
6 153 6 113 8 15 6 197 186 254
6 154 6 113 8 9 6 183 186 255
6 156 6 113 8 14 6 188 187 0
6 152 6 113 8 24 6 190 187 1
6 151 6 113 8 20 6 189 187 2
6 154 6 113 8 20 6 176 187 3
6 159 6 113 8 24 6 168 187 4
6 151 6 113 8 6 6 168 187 5
6 150 6 113 8 11 6 173 187 6
6 147 6 113 8 21 6 187 187 8
6 154 6 113 8 27 6 194 187 9
6 153 6 113 8 0 6 172 187 10
6 154 6 113 8 12 6 157 187 11
6 155 6 113 8 15 6 171 187 12
6 156 6 113 8 10 6 167 187 13
6 150 6 113 8 12 6 190 187 15
6 153 6 113 8 15 6 179 187 16
6 154 6 113 8 35 6 181 187 17
6 164 6 113 8 16 6 174 187 18
6 147 6 113 8 11 6 155 187 20
6 149 6 113 8 11 6 171 187 21
6 151 6 113 8 26 6 180 187 22
6 152 6 113 8 24 6 164 187 23
6 159 6 113 8 14 6 180 187 24
6 158 6 113 8 23 6 162 187 25
6 156 6 113 8 21 6 174 187 26
6 158 6 113 8 7 6 185 187 27
6 155 6 113 8 15 6 186 187 28
6 155 6 113 8 25 6 200 187 29
6 163 6 113 8 16 6 192 187 30
6 162 6 113 8 20 6 167 187 31
6 162 6 113 8 6 6 180 187 32
6 163 6 114 8 37 6 186 187 33
6 159 6 113 8 10 6 190 187 34
6 153 6 113 8 7 6 190 187 34
6 163 6 114 8 13 6 202 187 35
6 155 6 114 8 13 6 189 187 36
6 147 6 114 8 9 6 190 187 37
6 147 6 114 8 13 6 189 187 38
6 151 6 114 7 249 6 193 187 39
6 164 6 114 8 7 6 193 187 40
6 140 6 113 8 8 6 205 187 40
6 149 6 114 8 8 6 198 187 41
6 142 6 114 8 32 6 195 187 42
6 142 6 114 8 35 6 197 187 43
6 143 6 114 7 248 6 186 187 44
6 147 6 114 8 25 6 193 187 45
6 144 6 113 8 29 6 177 187 46
6 142 6 113 8 12 6 177 187 46
6 145 6 114 8 19 6 169 187 47
6 138 6 113 8 16 6 165 187 48
6 146 6 113 8 12 6 197 187 50
6 152 6 114 8 21 6 200 187 51
6 155 6 114 8 21 6 200 187 51
6 164 6 114 8 6 6 189 187 52
6 161 6 114 8 10 6 181 187 54
6 149 6 114 8 18 6 186 187 55
6 149 6 113 8 44 6 186 187 56
6 143 6 114 8 41 6 169 187 57
6 148 6 113 8 19 6 180 187 58
6 161 6 113 8 8 6 163 187 60