C51 COMPILER V9.51   USBFS_1_DESCR                                                         01/05/2014 02:23:52 PAGE 1   


C51 COMPILER V9.51, COMPILATION OF MODULE USBFS_1_DESCR
OBJECT MODULE PLACED IN .\DP8051\DP8051_Keil_951\Debug\USBFS_1_descr.obj
COMPILER INVOKED BY: C:\Program Files (x86)\Cypress\PSoC Creator\3.0\PSoC Creator\import\keil\pk51\9.51\C51\BIN\c51.exe 
                    -.\Generated_Source\PSoC3\USBFS_1_descr.c NOIV LARGE MODDP2 OMF2 VB(1) PR(.\DP8051\DP8051_Keil_951\Debug\USBFS_1_descr.ls
                    -t) CD DB NOIP OT(2,SIZE) DF(DEBUG) INCDIR(.,.\Generated_Source\PSoC3) OJ(.\DP8051\DP8051_Keil_951\Debug\USBFS_1_descr.ob
                    -j)

line level    source

   1          /*******************************************************************************
   2          * File Name: USBFS_1_descr.c
   3          * Version 2.60
   4          *
   5          * Description:
   6          *  USB descriptors and storage.
   7          *
   8          *  Note:
   9          *
  10          ********************************************************************************
  11          * Copyright 2008-2013, Cypress Semiconductor Corporation.  All rights reserved.
  12          * You may use this file only in accordance with the license, terms, conditions,
  13          * disclaimers, and limitations in the end user license agreement accompanying
  14          * the software package with which this file was provided.
  15          *******************************************************************************/
  16          
  17          #include "USBFS_1.h"
  18          #include "USBFS_1_pvt.h"
  19          
  20          
  21          /*****************************************************************************
  22          *  User supplied descriptors.  If you want to specify your own descriptors,
  23          *  remove the comments around the define USER_SUPPLIED_DESCRIPTORS below and
  24          *  add your descriptors.
  25          *****************************************************************************/
  26          /* `#START USER_DESCRIPTORS_DECLARATIONS` Place your declaration here */
  27          
  28          /* `#END` */
  29          
  30          
  31          /***************************************
  32          *  USB Customizer Generated Descriptors
  33          ***************************************/
  34          
  35          #if !defined(USER_SUPPLIED_DESCRIPTORS)
  36          /*********************************************************************
  37          * Device Descriptors
  38          *********************************************************************/
  39          const uint8 CYCODE USBFS_1_DEVICE0_DESCR[18u] = {
  40          /* Descriptor Length                       */ 0x12u,
  41          /* DescriptorType: DEVICE                  */ 0x01u,
  42          /* bcdUSB (ver 2.0)                        */ 0x00u, 0x02u,
  43          /* bDeviceClass                            */ 0x00u,
  44          /* bDeviceSubClass                         */ 0x00u,
  45          /* bDeviceProtocol                         */ 0x00u,
  46          /* bMaxPacketSize0                         */ 0x08u,
  47          /* idVendor                                */ 0xB4u, 0x04u,
  48          /* idProduct                               */ 0x11u, 0xE0u,
  49          /* bcdDevice                               */ 0x00u, 0x00u,
  50          /* iManufacturer                           */ 0x02u,
  51          /* iProduct                                */ 0x01u,
  52          /* iSerialNumber                           */ 0x00u,
C51 COMPILER V9.51   USBFS_1_DESCR                                                         01/05/2014 02:23:52 PAGE 2   

  53          /* bNumConfigurations                      */ 0x01u
  54          };
  55          /*********************************************************************
  56          * Config Descriptor  
  57          *********************************************************************/
  58          const uint8 CYCODE USBFS_1_DEVICE0_CONFIGURATION0_DESCR[34u] = {
  59          /*  Config Descriptor Length               */ 0x09u,
  60          /*  DescriptorType: CONFIG                 */ 0x02u,
  61          /*  wTotalLength                           */ 0x22u, 0x00u,
  62          /*  bNumInterfaces                         */ 0x01u,
  63          /*  bConfigurationValue                    */ 0x01u,
  64          /*  iConfiguration                         */ 0x00u,
  65          /*  bmAttributes                           */ 0x80u,
  66          /*  bMaxPower                              */ 0x0Au,
  67          /*********************************************************************
  68          * Interface Descriptor
  69          *********************************************************************/
  70          /*  Interface Descriptor Length            */ 0x09u,
  71          /*  DescriptorType: INTERFACE              */ 0x04u,
  72          /*  bInterfaceNumber                       */ 0x00u,
  73          /*  bAlternateSetting                      */ 0x00u,
  74          /*  bNumEndpoints                          */ 0x01u,
  75          /*  bInterfaceClass                        */ 0x03u,
  76          /*  bInterfaceSubClass                     */ 0x00u,
  77          /*  bInterfaceProtocol                     */ 0x00u,
  78          /*  iInterface                             */ 0x00u,
  79          /*********************************************************************
  80          * HID Class Descriptor
  81          *********************************************************************/
  82          /*  HID Class Descriptor Length            */ 0x09u,
  83          /*  DescriptorType: HID_CLASS              */ 0x21u,
  84          /*  bcdHID                                 */ 0x11u, 0x01u,
  85          /*  bCountryCode                           */ 0x00u,
  86          /*  bNumDescriptors                        */ 0x01u,
  87          /*  bDescriptorType                        */ 0x22u,
  88          /*  wDescriptorLength (LSB)                */ USBFS_1_HID_RPT_1_SIZE_LSB,
  89          /*  wDescriptorLength (MSB)                */ USBFS_1_HID_RPT_1_SIZE_MSB,
  90          /*********************************************************************
  91          * Endpoint Descriptor
  92          *********************************************************************/
  93          /*  Endpoint Descriptor Length             */ 0x07u,
  94          /*  DescriptorType: ENDPOINT               */ 0x05u,
  95          /*  bEndpointAddress                       */ 0x81u,
  96          /*  bmAttributes                           */ 0x03u,
  97          /*  wMaxPacketSize                         */ 0x08u, 0x00u,
  98          /*  bInterval                              */ 0x01u
  99          };
 100          
 101          /*********************************************************************
 102          * String Descriptor Table
 103          *********************************************************************/
 104          const uint8 CYCODE USBFS_1_STRING_DESCRIPTORS[113u] = {
 105          /*********************************************************************
 106          * Language ID Descriptor
 107          *********************************************************************/
 108          /* Descriptor Length                       */ 0x04u,
 109          /* DescriptorType: STRING                  */ 0x03u,
 110          /* Language Id                             */ 0x09u, 0x04u,
 111          /*********************************************************************
 112          * String Descriptor: "Mushaca"
 113          *********************************************************************/
 114          /* Descriptor Length                       */ 0x10u,
C51 COMPILER V9.51   USBFS_1_DESCR                                                         01/05/2014 02:23:52 PAGE 3   

 115          /* DescriptorType: STRING                  */ 0x03u,
 116           (uint8)'M', 0u,(uint8)'u', 0u,(uint8)'s', 0u,(uint8)'h', 0u,(uint8)'a', 0u,
 117           (uint8)'c', 0u,(uint8)'a', 0u,
 118          /*********************************************************************
 119          * String Descriptor: "3DOF Mouse"
 120          *********************************************************************/
 121          /* Descriptor Length                       */ 0x16u,
 122          /* DescriptorType: STRING                  */ 0x03u,
 123           (uint8)'3', 0u,(uint8)'D', 0u,(uint8)'O', 0u,(uint8)'F', 0u,(uint8)' ', 0u,
 124           (uint8)'M', 0u,(uint8)'o', 0u,(uint8)'u', 0u,(uint8)'s', 0u,(uint8)'e', 0u,
 125          /*********************************************************************
 126          * String Descriptor: "Cypress Semiconductor"
 127          *********************************************************************/
 128          /* Descriptor Length                       */ 0x2Cu,
 129          /* DescriptorType: STRING                  */ 0x03u,
 130           (uint8)'C', 0u,(uint8)'y', 0u,(uint8)'p', 0u,(uint8)'r', 0u,(uint8)'e', 0u,
 131           (uint8)'s', 0u,(uint8)'s', 0u,(uint8)' ', 0u,(uint8)'S', 0u,(uint8)'e', 0u,
 132           (uint8)'m', 0u,(uint8)'i', 0u,(uint8)'c', 0u,(uint8)'o', 0u,(uint8)'n', 0u,
 133           (uint8)'d', 0u,(uint8)'u', 0u,(uint8)'c', 0u,(uint8)'t', 0u,(uint8)'o', 0u,
 134           (uint8)'r', 0u,
 135          /*********************************************************************
 136          * String Descriptor: "Square Mouse"
 137          *********************************************************************/
 138          /* Descriptor Length                       */ 0x1Au,
 139          /* DescriptorType: STRING                  */ 0x03u,
 140           (uint8)'S', 0u,(uint8)'q', 0u,(uint8)'u', 0u,(uint8)'a', 0u,(uint8)'r', 0u,
 141           (uint8)'e', 0u,(uint8)' ', 0u,(uint8)'M', 0u,(uint8)'o', 0u,(uint8)'u', 0u,
 142           (uint8)'s', 0u,(uint8)'e', 0u,
 143          /*********************************************************************/
 144          /* Marks the end of the list.              */ 0x00u};
 145          /*********************************************************************/
 146          
 147          
 148          /*********************************************************************
 149          * HID Report Descriptor: 3 Button Mouse
 150          *********************************************************************/
 151          const uint8 CYCODE USBFS_1_HIDREPORT_DESCRIPTOR1[56u] = {
 152          /*  Descriptor Size (Not part of descriptor)*/ USBFS_1_HID_RPT_1_SIZE_LSB,
 153          USBFS_1_HID_RPT_1_SIZE_MSB,
 154          /* USAGE_PAGE                              */ 0x05u, 0x01u, 
 155          /* USAGE                                   */ 0x09u, 0x02u, 
 156          /* COLLECTION                              */ 0xA1u, 0x01u, 
 157          /* USAGE                                   */ 0x09u, 0x01u, 
 158          /* COLLECTION                              */ 0xA1u, 0x00u, 
 159          /* USAGE_PAGE                              */ 0x05u, 0x09u, 
 160          /* USAGE_MINIMUM                           */ 0x19u, 0x01u, 
 161          /* USAGE_MAXIMUM                           */ 0x29u, 0x03u, 
 162          /* LOGICAL_MINIMUM                         */ 0x15u, 0x00u, 
 163          /* LOGICAL_MAXIMUM                         */ 0x25u, 0x01u, 
 164          /* REPORT_COUNT                            */ 0x95u, 0x03u, 
 165          /* REPORT_SIZE                             */ 0x75u, 0x01u, 
 166          /* INPUT                                   */ 0x81u, 0x02u, 
 167          /* REPORT_COUNT                            */ 0x95u, 0x01u, 
 168          /* REPORT_SIZE                             */ 0x75u, 0x05u, 
 169          /* INPUT                                   */ 0x81u, 0x03u, 
 170          /* USAGE_PAGE                              */ 0x05u, 0x01u, 
 171          /* USAGE                                   */ 0x09u, 0x30u, 
 172          /* USAGE                                   */ 0x09u, 0x31u, 
 173          /* USAGE                                   */ 0x09u, 0x38u, 
 174          /* LOGICAL_MINIMUM                         */ 0x15u, 0x80u, 
 175          /* LOGICAL_MAXIMUM                         */ 0x25u, 0x80u, 
 176          /* REPORT_SIZE                             */ 0x75u, 0x08u, 
C51 COMPILER V9.51   USBFS_1_DESCR                                                         01/05/2014 02:23:52 PAGE 4   

 177          /* REPORT_COUNT                            */ 0x95u, 0x03u, 
 178          /* INPUT                                   */ 0x81u, 0x06u, 
 179          /* END_COLLECTION                          */ 0xC0u, 
 180          /* END_COLLECTION                          */ 0xC0u, 
 181          /*********************************************************************/
 182          /* End of the HID Report Descriptor        */ 0x00u, 0x00u};
 183          /*********************************************************************/
 184          
 185          #if !defined(USER_DEFINE_USBFS_1_DEVICE0_CONFIGURATION0_INTERFACE0_ALTERNATE0_HID_HID_RPT_STORAGE)
 186          /*********************************************************************
 187          * HID Input Report Storage
 188          *********************************************************************/
 189          T_USBFS_1_XFER_STATUS_BLOCK USBFS_1_DEVICE0_CONFIGURATION0_INTERFACE0_ALTERNATE0_HID_IN_RPT_SCB;
 190          uint8 USBFS_1_DEVICE0_CONFIGURATION0_INTERFACE0_ALTERNATE0_HID_IN_BUF[
 191                      USBFS_1_DEVICE0_CONFIGURATION0_INTERFACE0_ALTERNATE0_HID_IN_BUF_SIZE];
 192          
 193          /*********************************************************************
 194          * HID Input Report TD Table
 195          *********************************************************************/
 196          const T_USBFS_1_TD CYCODE USBFS_1_DEVICE0_CONFIGURATION0_INTERFACE0_ALTERNATE0_HID_IN_RPT_TABLE[1u] = {
 197              {USBFS_1_DEVICE0_CONFIGURATION0_INTERFACE0_ALTERNATE0_HID_IN_BUF_SIZE,
 198              &USBFS_1_DEVICE0_CONFIGURATION0_INTERFACE0_ALTERNATE0_HID_IN_BUF[0u],
 199              &USBFS_1_DEVICE0_CONFIGURATION0_INTERFACE0_ALTERNATE0_HID_IN_RPT_SCB},
 200          };
 201          /*********************************************************************
 202          * HID Report Look Up Table         This table has four entries:
 203          *                                        IN Report Table
 204          *                                        OUT Report Table
 205          *                                        Feature Report Table
 206          *                                        HID Report Descriptor
 207          *                                        HID Class Descriptor
 208          *********************************************************************/
 209          const T_USBFS_1_LUT CYCODE USBFS_1_DEVICE0_CONFIGURATION0_INTERFACE0_ALTERNATE0_HID_TABLE[5u] = {
 210              {0x00u,     &USBFS_1_DEVICE0_CONFIGURATION0_INTERFACE0_ALTERNATE0_HID_IN_RPT_TABLE},
 211              {0x00u,    NULL},
 212              {0x00u,    NULL},
 213              {0x01u,     (const void *)&USBFS_1_HIDREPORT_DESCRIPTOR1[0]},
 214              {0x01u,     (const void *)&USBFS_1_DEVICE0_CONFIGURATION0_DESCR[18]}
 215          };
 216          #endif /* USER_DEFINE_USBFS_1_DEVICE0_CONFIGURATION0_INTERFACE0_ALTERNATE0_HID_HID_RPT_STORAGE */
 217          
 218          /*********************************************************************
 219          * Interface Dispatch Table -- Points to the Class Dispatch Tables
 220          *********************************************************************/
 221          const T_USBFS_1_LUT CYCODE USBFS_1_DEVICE0_CONFIGURATION0_INTERFACE0_TABLE[1u] = {
 222              {USBFS_1_DEVICE0_CONFIGURATION0_INTERFACE0_ALTERNATE0_HID_COUNT, 
 223              &USBFS_1_DEVICE0_CONFIGURATION0_INTERFACE0_ALTERNATE0_HID_TABLE}
 224          };
 225          /*********************************************************************
 226          * Endpoint Setting Table -- This table contain the endpoint setting
 227          *                           for each endpoint in the configuration. It
 228          *                           contains the necessary information to
 229          *                           configure the endpoint hardware for each
 230          *                           interface and alternate setting.
 231          *********************************************************************/
 232          const T_USBFS_1_EP_SETTINGS_BLOCK CYCODE USBFS_1_DEVICE0_CONFIGURATION0_EP_SETTINGS_TABLE[1u] = {
 233          /* IFC  ALT    EPAddr bmAttr MaxPktSize Class ********************/
 234          {0x00u, 0x00u, 0x81u, 0x03u, 0x0008u,   0x03u}
 235          };
 236          const uint8 CYCODE USBFS_1_DEVICE0_CONFIGURATION0_INTERFACE_CLASS[1u] = {
 237          0x03u
 238          };
C51 COMPILER V9.51   USBFS_1_DESCR                                                         01/05/2014 02:23:52 PAGE 5   

 239          /*********************************************************************
 240          * Config Dispatch Table -- Points to the Config Descriptor and each of
 241          *                          and endpoint setup table and to each
 242          *                          interface table if it specifies a USB Class
 243          *********************************************************************/
 244          const T_USBFS_1_LUT CYCODE USBFS_1_DEVICE0_CONFIGURATION0_TABLE[4u] = {
 245              {0x01u,     &USBFS_1_DEVICE0_CONFIGURATION0_DESCR},
 246              {0x01u,     &USBFS_1_DEVICE0_CONFIGURATION0_EP_SETTINGS_TABLE},
 247              {0x01u,     &USBFS_1_DEVICE0_CONFIGURATION0_INTERFACE0_TABLE},
 248              {0x00u,     &USBFS_1_DEVICE0_CONFIGURATION0_INTERFACE_CLASS}
 249          };
 250          /*********************************************************************
 251          * Device Dispatch Table -- Points to the Device Descriptor and each of
 252          *                          and Configuration Tables for this Device 
 253          *********************************************************************/
 254          const T_USBFS_1_LUT CYCODE USBFS_1_DEVICE0_TABLE[2u] = {
 255              {0x01u,     &USBFS_1_DEVICE0_DESCR},
 256              {0x01u,     &USBFS_1_DEVICE0_CONFIGURATION0_TABLE}
 257          };
 258          /*********************************************************************
 259          * Device Table -- Indexed by the device number.
 260          *********************************************************************/
 261          const T_USBFS_1_LUT CYCODE USBFS_1_TABLE[1u] = {
 262              {0x01u,     &USBFS_1_DEVICE0_TABLE}
 263          };
 264          
 265          #endif /* USER_SUPPLIED_DESCRIPTORS */
 266          
 267          #if defined(USBFS_1_ENABLE_MSOS_STRING)
              
                  /******************************************************************************
                  *  USB Microsoft OS String Descriptor
                  *  "MSFT" identifies a Microsoft host
                  *  "100" specifies version 1.00
                  *  USBFS_1_GET_EXTENDED_CONFIG_DESCRIPTOR becomes the bRequest value
                  *  in a host vendor device/class request
                  ******************************************************************************/
              
                  const uint8 CYCODE USBFS_1_MSOS_DESCRIPTOR[USBFS_1_MSOS_DESCRIPTOR_LENGTH] = {
                  /* Descriptor Length                       */   0x12u,
                  /* DescriptorType: STRING                  */   0x03u,
                  /* qwSignature - "MSFT100"                 */   (uint8)'M', 0u, (uint8)'S', 0u, (uint8)'F', 0u, (uint8
             -)'T', 0u,
                                                                  (uint8)'1', 0u, (uint8)'0', 0u, (uint8)'0', 0u,
                  /* bMS_VendorCode:                         */   USBFS_1_GET_EXTENDED_CONFIG_DESCRIPTOR,
                  /* bPad                                    */   0x00u
                  };
              
                  /* Extended Configuration Descriptor */
              
                  const uint8 CYCODE USBFS_1_MSOS_CONFIGURATION_DESCR[USBFS_1_MSOS_CONF_DESCR_LENGTH] = {
                  /*  Length of the descriptor 4 bytes       */   0x28u, 0x00u, 0x00u, 0x00u,
                  /*  Version of the descriptor 2 bytes      */   0x00u, 0x01u,
                  /*  wIndex - Fixed:INDEX_CONFIG_DESCRIPTOR */   0x04u, 0x00u,
                  /*  bCount - Count of device functions.    */   0x01u,
                  /*  Reserved : 7 bytes                     */   0x00u, 0x00u, 0x00u, 0x00u, 0x00u, 0x00u, 0x00u,
                  /*  bFirstInterfaceNumber                  */   0x00u,
                  /*  Reserved                               */   0x01u,
                  /*  compatibleID    - "CYUSB\0\0"          */   (uint8)'C', (uint8)'Y', (uint8)'U', (uint8)'S', (uint8
             -)'B',
                                                                  0x00u, 0x00u, 0x00u,
                  /*  subcompatibleID - "00001\0\0"          */   (uint8)'0', (uint8)'0', (uint8)'0', (uint8)'0', (uint8
C51 COMPILER V9.51   USBFS_1_DESCR                                                         01/05/2014 02:23:52 PAGE 6   

             -)'1',
                                                                  0x00u, 0x00u, 0x00u,
                  /*  Reserved : 6 bytes                     */   0x00u, 0x00u, 0x00u, 0x00u, 0x00u, 0x00u
                  };
              
              #endif /* USBFS_1_ENABLE_MSOS_STRING */
 304          
 305          /* DIE ID string descriptor for 8 bytes ID */
 306          #if defined(USBFS_1_ENABLE_IDSN_STRING)
                  uint8 USBFS_1_idSerialNumberStringDescriptor[USBFS_1_IDSN_DESCR_LENGTH];
              #endif /* USBFS_1_ENABLE_IDSN_STRING */
 309          
 310          
 311          /* [] END OF FILE */
C51 COMPILER V9.51   USBFS_1_DESCR                                                         01/05/2014 02:23:52 PAGE 7   

ASSEMBLY LISTING OF GENERATED OBJECT CODE




MODULE INFORMATION:   STATIC OVERLAYABLE
   CODE SIZE        =   ----    ----
   CONSTANT SIZE    =    289    ----
   XDATA SIZE       =      8    ----
   PDATA SIZE       =   ----    ----
   DATA SIZE        =   ----    ----
   IDATA SIZE       =   ----    ----
   BIT SIZE         =   ----    ----
   EDATA SIZE       =   ----    ----
   HDATA SIZE       =   ----    ----
   XDATA CONST SIZE =   ----    ----
   FAR CONST SIZE   =   ----    ----
END OF MODULE INFORMATION.


C51 COMPILATION COMPLETE.  0 WARNING(S),  0 ERROR(S)
