8 1 7 244 9 243 9 148 0 0
8 3 7 244 9 239 9 145 0 0
8 5 7 244 9 240 9 146 0 0
8 5 7 244 9 249 9 146 0 0
8 6 7 244 9 246 9 148 0 0
8 4 7 244 9 240 9 148 0 0
8 4 7 244 9 245 9 147 0 0
8 6 7 244 9 239 9 145 0 0
8 1 7 245 9 246 9 145 0 0
8 5 7 244 9 242 9 145 0 0
8 6 7 244 9 246 9 146 0 0
8 6 7 245 9 242 9 144 0 0
8 5 7 245 9 236 9 145 0 0
8 6 7 244 9 248 9 146 0 0
8 4 7 245 9 240 9 148 0 0
7 255 7 244 9 249 9 146 0 0
8 4 7 245 9 243 9 146 0 0
8 1 7 245 9 240 9 145 0 0
8 4 7 245 9 239 9 146 0 0
8 1 7 245 9 243 9 147 0 0
8 2 7 245 9 242 9 147 0 0
8 5 7 245 9 248 9 146 0 0
8 3 7 245 9 246 9 147 0 0
8 3 7 245 9 243 9 148 0 0
8 4 7 245 9 243 9 146 0 0
8 7 7 245 9 242 9 144 0 0
8 6 7 245 9 245 9 146 0 0
8 4 7 245 9 242 9 145 0 0
7 255 7 245 9 240 9 145 0 0
8 0 7 245 9 239 9 146 0 0
7 253 7 245 9 241 9 147 0 0
8 0 7 249 9 241 9 149 0 0
8 3 7 249 9 244 9 149 0 0
7 255 7 249 9 243 9 148 0 0
7 249 7 249 9 248 9 148 0 0
8 2 7 248 9 248 9 148 0 0
7 255 7 248 9 244 9 149 0 0
7 254 7 247 9 236 9 151 0 0
8 1 7 248 9 235 9 153 0 0
8 0 7 248 9 239 9 151 0 0
7 188 7 247 9 190 9 163 0 0
7 155 7 246 10 20 9 198 0 0
7 201 7 246 10 5 9 206 0 0
8 19 7 246 9 240 9 171 0 0
8 16 7 246 9 245 9 168 0 0
7 254 7 242 10 1 9 189 0 0
8 27 7 242 10 0 9 174 0 0
8 59 7 239 10 4 9 115 0 0
8 29 7 239 9 241 9 124 0 0
7 197 7 233 9 251 9 123 0 0
7 180 7 232 9 214 9 118 0 0
7 237 7 226 10 25 9 70 0 0
7 199 7 225 9 231 9 79 0 0
7 226 7 225 9 232 9 82 0 0
8 0 7 224 9 233 9 86 0 0
8 56 7 225 9 221 9 82 0 0
7 210 7 224 9 233 9 86 0 0
7 235 7 224 10 26 9 84 0 0
7 240 7 224 9 229 9 93 0 0
8 14 7 224 9 215 9 102 0 0
8 69 7 225 10 63 9 72 0 0
8 41 7 225 9 222 9 82 0 0
8 3 7 225 9 240 9 92 0 0
8 4 7 227 10 13 9 81 0 0
8 7 7 227 9 245 9 83 0 0
7 236 7 227 10 103 9 83 0 0
7 234 7 228 10 34 9 85 0 0
7 236 7 228 9 220 9 85 0 0
7 224 7 227 9 202 9 83 0 0
8 16 7 227 9 250 9 78 0 0
7 221 7 227 9 224 9 70 0 0
7 217 7 225 10 9 9 59 0 0
7 222 7 224 9 206 9 59 0 0
7 183 7 224 9 164 9 59 0 0
7 218 7 224 10 125 9 40 0 0
7 239 7 226 9 163 9 62 0 0
7 205 7 225 9 194 9 51 0 0
8 12 7 231 9 231 9 28 0 0
8 61 7 231 10 62 9 14 0 0
8 119 7 231 9 227 9 12 0 0
8 55 7 232 9 209 9 19 0 0
7 252 7 235 10 22 9 69 0 0
7 255 7 235 9 225 9 73 0 0
7 224 7 235 10 45 9 71 0 0
7 219 7 234 9 180 9 69 0 0
7 222 7 238 9 198 9 85 0 0
7 208 7 238 9 205 9 74 0 0
8 88 7 238 10 22 9 71 0 0
8 10 7 240 9 207 9 105 0 0
7 193 7 239 9 194 9 107 0 0
8 44 7 240 10 109 9 96 0 0
8 14 7 240 9 213 9 97 0 0
7 216 7 240 10 35 9 100 0 0
7 214 7 240 9 240 9 86 0 0
7 199 7 239 9 237 9 89 0 0
7 180 7 239 9 203 9 87 0 0
7 204 7 239 9 200 9 55 0 0
7 206 7 238 9 214 9 55 0 0
7 230 7 238 10 32 9 62 0 0
8 45 7 238 10 38 9 66 0 0
7 238 7 239 9 237 9 99 0 0
7 244 7 239 9 235 9 106 0 0
7 254 7 238 9 201 9 70 0 0
7 207 7 237 10 1 9 70 0 0
7 216 7 237 10 2 9 65 0 0
7 194 7 237 9 252 9 60 0 0
7 223 7 237 9 144 9 50 0 0
8 71 7 237 10 27 9 43 0 0
7 250 7 238 9 237 9 50 0 0
8 56 7 239 9 247 9 55 0 0
8 5 7 239 10 6 9 59 0 0
8 16 7 240 9 226 9 68 0 0
8 8 7 240 9 236 9 65 0 0
7 201 7 240 9 207 9 69 0 0
7 179 7 240 9 187 9 60 0 0
8 86 7 241 10 26 9 45 0 0
8 27 7 239 9 152 9 38 0 0
8 38 7 239 9 209 9 40 0 0
8 12 7 239 10 38 9 38 0 0
8 3 7 248 10 17 9 41 0 0
8 50 7 248 10 56 9 42 0 0
8 55 7 248 9 232 9 38 0 0
8 89 7 249 9 232 9 31 0 0
8 59 7 255 10 27 9 71 0 0
8 136 7 255 10 73 9 73 0 0
8 101 8 0 10 35 9 80 0 0
8 53 8 0 9 240 9 95 0 0
8 119 8 0 10 17 9 107 0 0
8 85 8 6 9 218 9 122 0 0
8 2 8 6 9 227 9 126 0 0
8 36 8 6 10 75 9 121 0 0
8 102 8 6 9 224 9 118 0 0
8 69 8 6 10 5 9 117 0 0
8 19 8 9 9 240 9 115 0 0
8 30 8 9 10 8 9 112 0 0
8 36 8 9 9 216 9 111 0 0
8 27 8 10 9 216 9 108 0 0
8 120 8 19 9 221 9 153 0 0
8 66 8 19 9 182 9 152 0 0
8 90 8 19 9 235 9 149 0 0
8 82 8 19 9 253 9 141 0 0
8 99 8 29 9 229 9 205 0 0
8 86 8 30 9 246 9 204 0 0
8 30 8 33 9 245 9 233 0 0
8 14 8 32 9 239 9 233 0 0
7 254 8 32 9 235 9 229 0 0
8 27 8 29 9 246 9 171 0 0
8 16 8 29 9 238 9 170 0 0
8 23 8 29 9 241 9 168 0 0
8 42 8 30 9 254 9 167 0 0
8 53 8 29 9 244 9 167 0 0
8 7 8 29 9 236 9 168 0 0
8 16 8 26 9 255 9 190 0 0
8 19 8 26 9 247 9 191 0 0
8 22 8 26 9 241 9 194 0 0
8 27 8 27 9 237 9 197 0 0
8 66 8 26 9 244 9 165 0 0
8 52 8 26 9 245 9 167 0 0
8 44 8 26 9 248 9 169 0 0
8 49 8 26 9 255 9 168 0 0
8 62 8 28 9 242 9 159 0 0
8 61 8 27 9 236 9 159 0 0
8 57 8 28 9 239 9 158 0 0
8 34 8 26 9 224 9 152 0 0
8 30 8 26 9 237 9 152 0 0
8 27 8 26 9 242 9 153 0 0
8 21 8 26 9 251 9 154 0 0
8 21 8 24 9 244 9 151 0 0
8 26 8 24 9 242 9 151 0 0
8 26 8 23 9 237 9 151 0 0
8 28 8 24 9 241 9 152 0 0
8 26 8 23 9 236 9 152 0 0
8 24 8 17 9 241 9 144 0 0
8 24 8 17 9 241 9 145 0 0
8 25 8 17 9 239 9 147 0 0
8 22 8 17 9 235 9 144 0 0
8 23 8 16 9 242 9 147 0 0
8 26 8 16 9 246 9 145 0 0
8 25 8 16 9 246 9 145 0 0
8 25 8 16 9 241 9 147 0 0
8 23 8 15 9 235 9 145 0 0
8 23 8 15 9 240 9 146 0 0
8 21 8 15 9 240 9 143 0 0
8 23 8 14 9 241 9 145 0 0
8 22 8 14 9 239 9 147 0 0
8 21 8 14 9 243 9 146 0 0
8 23 8 14 9 249 9 146 0 0
8 23 8 13 9 244 9 145 0 0
8 27 8 13 9 240 9 146 0 0
8 25 8 13 9 243 9 143 0 0
8 22 8 13 9 243 9 144 0 0
8 22 8 12 9 241 9 144 0 0
8 28 8 13 9 238 9 142 0 0
8 33 8 13 9 233 9 137 0 0
8 19 8 12 9 244 9 138 0 0
8 19 8 12 9 242 9 139 0 0
8 19 8 12 9 245 9 141 0 0
8 21 8 12 9 243 9 142 0 0
8 23 8 12 9 243 9 145 0 0
8 22 8 12 9 245 9 145 0 0
8 22 8 12 9 239 9 144 0 0
8 25 8 12 9 245 9 146 0 0
8 33 8 12 9 245 9 123 0 0
8 31 8 12 9 244 9 123 0 0
8 29 8 12 9 246 9 124 0 0
8 26 8 12 9 247 9 126 0 0
8 32 8 12 9 238 9 119 0 0
8 34 8 12 9 238 9 115 0 0
8 32 8 12 9 243 9 114 0 0
8 35 8 12 9 240 9 114 0 0
8 39 8 14 9 247 9 112 0 0
8 35 8 14 9 249 9 90 0 0
8 38 8 15 9 239 9 88 0 0
8 35 8 14 9 243 9 87 0 0
8 40 8 14 9 243 9 86 0 0
8 55 8 16 9 236 9 36 0 0
8 36 8 16 9 238 9 37 0 0
8 33 8 16 9 239 9 38 0 0
8 47 8 16 10 4 9 40 0 0
8 65 8 20 9 225 9 87 0 0
8 67 8 21 9 243 9 82 0 0
8 93 8 21 9 236 9 78 0 0
8 78 8 21 10 0 9 75 0 0
8 87 8 29 9 227 9 134 0 0
8 58 8 30 9 221 9 132 0 0
8 60 8 30 9 217 9 126 0 0
8 138 8 30 10 19 9 123 0 0
8 12 8 46 9 236 10 17 0 0
8 97 8 46 10 7 10 11 0 0
8 136 8 47 9 236 10 18 0 0
8 22 8 49 10 10 10 39 0 0
8 71 8 48 9 213 10 39 0 0
8 28 8 48 9 182 10 45 0 0
8 37 8 48 9 224 10 44 0 0
8 69 8 48 10 17 10 44 0 0
8 133 8 45 9 244 9 249 0 0
8 19 8 44 9 248 9 255 0 0
8 104 8 44 10 36 10 7 0 0
8 56 8 45 9 210 10 14 0 0
8 3 8 45 9 218 10 14 0 0
8 21 8 43 10 0 9 231 0 0
8 15 8 43 10 7 9 228 0 0
8 71 8 43 9 249 9 230 0 0
8 32 8 43 9 208 9 228 0 0
8 50 8 40 10 77 9 234 0 0
8 80 8 40 9 194 9 233 0 0
8 15 8 40 9 184 9 232 0 0
7 240 8 39 9 195 9 235 0 0
8 42 8 35 9 235 9 237 0 0
8 83 8 35 9 201 9 238 0 0
7 242 8 34 9 173 9 235 0 0
7 253 8 34 9 224 9 233 0 0
7 203 8 29 9 227 10 3 0 0
7 190 8 29 10 34 9 246 0 0
8 42 8 29 9 201 9 237 0 0
8 8 8 28 9 192 9 234 0 0
8 127 8 19 9 227 9 158 0 0
8 71 8 19 9 230 9 164 0 0
8 33 8 20 10 38 9 174 0 0
7 232 8 20 9 236 9 176 0 0
8 1 8 19 10 3 9 180 0 0
8 32 8 19 9 249 9 185 0 0
7 219 8 18 10 34 9 238 0 0
7 250 8 18 9 255 9 238 0 0
8 40 8 18 9 228 9 236 0 0
8 93 8 19 9 229 9 236 0 0
7 158 8 15 10 42 9 252 0 0
7 213 8 14 9 202 9 240 0 0
7 210 8 12 9 220 9 233 0 0
7 254 8 12 9 177 9 222 0 0
8 40 8 12 9 216 9 222 0 0
8 154 8 12 9 232 9 235 0 0
8 6 8 8 9 237 10 0 0 0
8 17 8 9 9 207 9 242 0 0
8 51 8 8 9 157 9 239 0 0
8 21 8 8 9 226 9 237 0 0
7 210 8 5 9 219 9 234 0 0
7 231 8 5 9 196 9 225 0 0
8 72 8 5 9 245 9 223 0 0
8 34 8 5 9 246 9 228 0 0
7 209 8 5 10 22 9 233 0 0
7 237 8 4 9 227 9 243 0 0
8 78 8 0 9 171 9 218 0 0
8 67 8 0 9 236 9 214 0 0
7 235 8 2 9 195 9 227 0 0
8 87 8 2 9 231 9 210 0 0
8 46 8 5 10 24 10 26 0 0
8 40 8 5 9 225 10 34 0 0
8 61 8 2 9 241 10 2 0 0
7 107 8 1 10 9 10 4 0 0
7 234 7 254 10 71 9 206 0 0
8 43 7 254 9 204 9 205 0 0
8 55 7 254 9 153 9 208 0 0
8 102 7 254 9 249 9 223 0 0
8 36 7 254 9 230 9 237 0 0
7 221 7 253 10 19 9 244 0 0
8 17 7 254 9 224 9 244 0 0
8 48 7 252 9 233 9 244 0 0
8 84 7 253 10 42 9 248 0 0
8 7 7 253 9 247 10 1 0 0
7 214 7 252 9 199 10 12 0 0
7 226 7 245 10 9 9 172 0 0
8 18 7 245 10 2 9 174 0 0
7 230 7 245 9 232 9 183 0 0
7 96 7 244 9 210 9 191 0 0
7 218 7 236 9 243 9 164 0 0
7 196 7 236 9 235 9 171 0 0
7 242 7 236 10 42 9 174 0 0
7 249 7 236 10 0 9 177 0 0
7 207 7 228 9 240 9 135 0 0
7 222 7 228 10 3 9 134 0 0
7 242 7 228 9 252 9 140 0 0
7 235 7 224 10 5 9 121 0 0
7 242 7 225 10 11 9 130 0 0
7 255 7 224 9 248 9 136 0 0
7 228 7 224 10 5 9 140 0 0
8 73 7 223 9 220 9 137 0 0
8 20 7 223 10 18 9 49 0 0
8 8 7 223 9 214 9 66 0 0
7 233 7 223 9 232 9 88 0 0
7 231 7 223 9 249 9 108 0 0
8 2 7 223 10 16 9 122 0 0
7 200 7 220 9 237 9 155 0 0
7 205 7 221 9 248 9 159 0 0
7 209 7 220 9 247 9 156 0 0
8 5 7 222 9 244 9 154 0 0
8 6 7 222 9 248 9 151 0 0
8 8 7 223 9 242 9 152 0 0
8 6 7 223 9 239 9 151 0 0
8 9 7 226 9 241 9 149 0 0
8 6 7 226 9 238 9 148 0 0
8 7 7 226 9 243 9 146 0 0
8 6 7 233 9 242 9 162 0 0
8 9 7 233 9 243 9 163 0 0
8 10 7 233 9 241 9 164 0 0
8 7 7 236 9 243 9 160 0 0
8 7 7 236 9 244 9 160 0 0
8 8 7 236 9 247 9 160 0 0
8 5 7 238 9 242 9 151 0 0
8 7 7 238 9 241 9 151 0 0
8 6 7 238 9 240 9 150 0 0
8 3 7 240 9 247 9 150 0 0
8 7 7 240 9 237 9 151 0 0
8 5 7 240 9 236 9 150 0 0
8 6 7 241 9 241 9 150 0 0
8 11 7 241 9 245 9 150 0 0
8 7 7 241 9 243 9 150 0 0
8 4 7 242 9 239 9 149 0 0
8 7 7 242 9 242 9 149 0 0
8 5 7 242 9 240 9 150 0 0
8 9 7 242 9 247 9 150 0 0
8 7 7 243 9 241 9 151 0 0
8 7 7 243 9 240 9 151 0 0
8 8 7 243 9 245 9 152 0 0
8 10 7 243 9 244 9 151 0 0
8 8 7 243 9 241 9 150 0 0
8 4 7 244 9 243 9 150 0 0
8 7 7 244 9 240 9 151 0 0
8 8 7 244 9 242 9 152 0 0
8 10 7 244 9 241 9 151 0 0
8 8 7 244 9 244 9 151 0 0
8 6 7 244 9 245 9 151 0 0
8 4 7 244 9 240 9 152 0 0
8 9 7 245 9 245 9 155 0 0
8 9 7 245 9 242 9 153 0 0
8 11 7 245 9 235 9 153 0 0
8 10 7 245 9 239 9 152 0 0
8 6 7 246 9 239 9 151 0 0
8 5 7 246 9 244 9 151 0 0
8 6 7 246 9 244 9 151 0 0
8 5 7 246 9 245 9 151 0 0
8 8 7 246 9 243 9 149 0 0
8 7 7 246 9 244 9 151 0 0
8 6 7 246 9 237 9 152 0 0
8 9 7 246 9 247 9 152 0 0
8 5 7 246 9 245 9 150 0 0
8 9 7 246 9 243 9 151 0 0
8 6 7 246 9 248 9 152 0 0
8 5 7 246 9 238 9 152 0 0
8 8 7 246 9 241 9 153 0 0
8 5 7 246 9 248 9 151 0 0
8 2 7 246 9 241 9 151 0 0
8 2 7 246 9 237 9 152 0 0
8 2 7 246 9 242 9 148 0 0
8 4 7 241 9 242 9 149 0 0
8 6 7 242 9 240 9 147 0 0
8 7 7 242 9 241 9 146 0 0
8 6 7 242 9 246 9 145 0 0
8 7 7 242 9 242 9 145 0 0
8 7 7 243 9 243 9 145 0 0
8 4 7 243 9 247 9 145 0 0
8 7 7 243 9 245 9 145 0 0
8 7 7 243 9 242 9 146 0 0
8 2 7 244 9 243 9 147 0 0
8 6 7 244 9 248 9 148 0 0
8 5 7 244 9 236 9 150 0 0
8 7 7 245 9 246 9 147 0 0
8 7 7 244 9 244 9 147 0 0
8 9 7 244 9 238 9 146 0 0
8 5 7 245 9 241 9 145 0 0
8 10 7 245 9 239 9 150 0 0
8 8 7 244 9 243 9 146 0 0
8 6 7 244 9 243 9 145 0 0
8 9 7 245 9 244 9 146 0 0
8 3 7 245 9 245 9 144 0 0
8 7 7 245 9 245 9 148 0 0
8 6 7 245 9 245 9 148 0 0
8 8 7 245 9 241 9 147 0 0
8 8 7 246 9 241 9 145 0 0
8 5 7 246 9 240 9 146 0 0
8 7 7 246 9 239 9 148 0 0
8 5 7 246 9 237 9 147 0 0
8 5 7 246 9 243 9 146 0 0
8 5 7 246 9 247 9 146 0 0
8 9 7 246 9 241 9 149 0 0
8 4 7 246 9 239 9 145 0 0
8 7 7 246 9 241 9 146 0 0
8 5 7 246 9 240 9 147 0 0
8 7 7 246 9 245 9 147 0 0
8 6 7 246 9 241 9 149 0 0
8 4 7 246 9 241 9 147 0 0
8 8 7 246 9 239 9 145 0 0
8 3 7 246 9 240 9 146 0 0
8 6 7 246 9 244 9 145 0 0
8 6 7 246 9 238 9 146 0 0
8 5 7 247 9 234 9 144 0 0
8 9 7 246 9 248 9 144 0 0
8 5 7 246 9 246 9 145 0 0
8 3 7 247 9 237 9 147 0 0
8 5 7 247 9 250 9 146 0 0
8 6 7 247 9 240 9 146 0 0
8 7 7 246 9 245 9 143 0 0
8 3 7 247 9 242 9 146 0 0
8 3 7 247 9 240 9 146 0 0
8 8 7 247 9 244 9 145 0 0
8 7 7 247 9 246 9 147 0 0
8 3 7 247 9 243 9 145 0 0
8 5 7 247 9 241 9 146 0 0
8 4 7 247 9 244 9 145 0 0
8 6 7 251 9 244 9 151 0 0
8 7 7 251 9 248 9 150 0 0
8 8 7 252 9 244 9 149 0 0
8 7 7 251 9 242 9 151 0 0
8 6 7 251 9 245 9 152 0 0
8 5 7 251 9 242 9 152 0 0
8 2 7 251 9 239 9 150 0 0
8 6 7 251 9 237 9 150 0 0
8 4 7 251 9 242 9 150 0 0
8 4 7 251 9 236 9 151 0 0
8 7 7 250 9 244 9 152 0 0
8 8 7 250 9 246 9 151 0 0
8 7 7 251 9 237 9 151 0 0
8 5 7 250 9 243 9 150 0 0
8 7 7 251 9 241 9 149 0 0
8 6 7 250 9 245 9 153 0 0
8 7 7 250 9 246 9 152 0 0
8 5 7 250 9 240 9 153 0 0
8 7 7 250 9 238 9 151 0 0
8 6 7 250 9 241 9 149 0 0
8 7 7 250 9 238 9 150 0 0
8 6 7 249 9 241 9 151 0 0
8 5 7 250 9 242 9 150 0 0
8 7 7 249 9 242 9 149 0 0
8 5 7 249 9 241 9 149 0 0
8 5 7 249 9 243 9 151 0 0
8 4 7 249 9 242 9 152 0 0
8 7 7 249 9 243 9 151 0 0
8 6 7 249 9 242 9 150 0 0
8 6 7 249 9 243 9 150 0 0
8 5 7 249 9 242 9 152 0 0
8 6 7 249 9 240 9 152 0 0
8 7 7 249 9 238 9 151 0 0
8 9 7 249 9 240 9 150 0 0
8 4 7 249 9 242 9 151 0 0
8 8 7 249 9 243 9 153 0 0
8 5 7 249 9 237 9 152 0 0
8 6 7 249 9 239 9 151 0 0
8 6 7 249 9 240 9 149 0 0
8 7 7 249 9 240 9 149 0 0
8 9 7 249 9 243 9 148 0 0
8 7 7 249 9 245 9 151 0 0
8 6 7 249 9 243 9 151 0 0
8 5 7 249 9 240 9 153 0 0
8 6 7 249 9 241 9 154 0 0
8 5 7 249 9 241 9 154 0 0
8 4 7 249 9 244 9 151 0 0
8 4 7 249 9 242 9 150 0 0
8 8 7 248 9 244 9 150 0 0
8 8 7 248 9 240 9 151 0 0
8 4 7 248 9 243 9 151 0 0
8 7 7 248 9 244 9 153 0 0
8 9 7 248 9 245 9 153 0 0
8 5 7 249 9 246 9 152 0 0
8 8 7 244 9 245 9 148 0 0
8 6 7 244 9 241 9 146 0 0
8 5 7 244 9 242 9 145 0 0
8 3 7 244 9 241 9 145 0 0
8 6 7 245 9 244 9 145 0 0
8 6 7 245 9 247 9 145 0 0
8 8 7 245 9 246 9 144 0 0
8 8 7 245 9 241 9 145 0 0
8 6 7 245 9 242 9 146 0 0
8 4 7 246 9 243 9 148 0 0
8 5 7 246 9 245 9 148 0 0
8 7 7 246 9 242 9 146 0 0
8 5 7 245 9 242 9 145 0 0
8 5 7 246 9 240 9 145 0 0
8 9 7 245 9 249 9 147 0 0
8 3 7 246 9 241 9 148 0 0
8 8 7 246 9 244 9 148 0 0