C51 COMPILER V9.51   PIN_GYRO_ST_OUT                                                       01/04/2014 15:52:36 PAGE 1   


C51 COMPILER V9.51, COMPILATION OF MODULE PIN_GYRO_ST_OUT
OBJECT MODULE PLACED IN .\DP8051\DP8051_Keil_951\Debug\Pin_gyro_ST_out.obj
COMPILER INVOKED BY: C:\Program Files (x86)\Cypress\PSoC Creator\3.0\PSoC Creator\import\keil\pk51\9.51\C51\BIN\c51.exe 
                    -.\Generated_Source\PSoC3\Pin_gyro_ST_out.c NOIV LARGE MODDP2 OMF2 VB(1) PR(.\DP8051\DP8051_Keil_951\Debug\Pin_gyro_ST_ou
                    -t.lst) CD DB NOIP OT(2,SIZE) DF(DEBUG) INCDIR(.,.\Generated_Source\PSoC3) OJ(.\DP8051\DP8051_Keil_951\Debug\Pin_gyro_ST_
                    -out.obj)

line level    source

   1          /*******************************************************************************
   2          * File Name: Pin_gyro_ST_out.c  
   3          * Version 1.90
   4          *
   5          * Description:
   6          *  This file contains API to enable firmware control of a Pins component.
   7          *
   8          * Note:
   9          *
  10          ********************************************************************************
  11          * Copyright 2008-2012, Cypress Semiconductor Corporation.  All rights reserved.
  12          * You may use this file only in accordance with the license, terms, conditions, 
  13          * disclaimers, and limitations in the end user license agreement accompanying 
  14          * the software package with which this file was provided.
  15          *******************************************************************************/
  16          
  17          #include "cytypes.h"
  18          #include "Pin_gyro_ST_out.h"
  19          
  20          
  21          /*******************************************************************************
  22          * Function Name: Pin_gyro_ST_out_Write
  23          ********************************************************************************
  24          *
  25          * Summary:
  26          *  Assign a new value to the digital port's data output register.  
  27          *
  28          * Parameters:  
  29          *  prtValue:  The value to be assigned to the Digital Port. 
  30          *
  31          * Return: 
  32          *  None 
  33          *  
  34          *******************************************************************************/
  35          void Pin_gyro_ST_out_Write(uint8 value) 
  36          {
  37   1          uint8 staticBits = (Pin_gyro_ST_out_DR & (uint8)(~Pin_gyro_ST_out_MASK));
  38   1          Pin_gyro_ST_out_DR = staticBits | ((uint8)(value << Pin_gyro_ST_out_SHIFT) & Pin_gyro_ST_out_MASK);
  39   1      }
  40          
  41          
  42          /*******************************************************************************
  43          * Function Name: Pin_gyro_ST_out_SetDriveMode
  44          ********************************************************************************
  45          *
  46          * Summary:
  47          *  Change the drive mode on the pins of the port.
  48          * 
  49          * Parameters:  
  50          *  mode:  Change the pins to this drive mode.
  51          *
  52          * Return: 
C51 COMPILER V9.51   PIN_GYRO_ST_OUT                                                       01/04/2014 15:52:36 PAGE 2   

  53          *  None
  54          *
  55          *******************************************************************************/
  56          void Pin_gyro_ST_out_SetDriveMode(uint8 mode) 
  57          {
  58   1              CyPins_SetPinDriveMode(Pin_gyro_ST_out_0, mode);
  59   1      }
  60          
  61          
  62          /*******************************************************************************
  63          * Function Name: Pin_gyro_ST_out_Read
  64          ********************************************************************************
  65          *
  66          * Summary:
  67          *  Read the current value on the pins of the Digital Port in right justified 
  68          *  form.
  69          *
  70          * Parameters:  
  71          *  None 
  72          *
  73          * Return: 
  74          *  Returns the current value of the Digital Port as a right justified number
  75          *  
  76          * Note:
  77          *  Macro Pin_gyro_ST_out_ReadPS calls this function. 
  78          *  
  79          *******************************************************************************/
  80          uint8 Pin_gyro_ST_out_Read(void) 
  81          {
  82   1          return (Pin_gyro_ST_out_PS & Pin_gyro_ST_out_MASK) >> Pin_gyro_ST_out_SHIFT;
  83   1      }
  84          
  85          
  86          /*******************************************************************************
  87          * Function Name: Pin_gyro_ST_out_ReadDataReg
  88          ********************************************************************************
  89          *
  90          * Summary:
  91          *  Read the current value assigned to a Digital Port's data output register
  92          *
  93          * Parameters:  
  94          *  None 
  95          *
  96          * Return: 
  97          *  Returns the current value assigned to the Digital Port's data output register
  98          *  
  99          *******************************************************************************/
 100          uint8 Pin_gyro_ST_out_ReadDataReg(void) 
 101          {
 102   1          return (Pin_gyro_ST_out_DR & Pin_gyro_ST_out_MASK) >> Pin_gyro_ST_out_SHIFT;
 103   1      }
 104          
 105          
 106          /* If Interrupts Are Enabled for this Pins component */ 
 107          #if defined(Pin_gyro_ST_out_INTSTAT) 
              
                  /*******************************************************************************
                  * Function Name: Pin_gyro_ST_out_ClearInterrupt
                  ********************************************************************************
                  *
                  * Summary:
                  *  Clears any active interrupts attached to port and returns the value of the 
C51 COMPILER V9.51   PIN_GYRO_ST_OUT                                                       01/04/2014 15:52:36 PAGE 3   

                  *  interrupt status register.
                  *
                  * Parameters:  
                  *  None 
                  *
                  * Return: 
                  *  Returns the value of the interrupt status register
                  *  
                  *******************************************************************************/
                  uint8 Pin_gyro_ST_out_ClearInterrupt(void) 
                  {
                      return (Pin_gyro_ST_out_INTSTAT & Pin_gyro_ST_out_MASK) >> Pin_gyro_ST_out_SHIFT;
                  }
              
              #endif /* If Interrupts Are Enabled for this Pins component */ 
 130          
 131          
 132          /* [] END OF FILE */
C51 COMPILER V9.51   PIN_GYRO_ST_OUT                                                       01/04/2014 15:52:36 PAGE 4   

ASSEMBLY LISTING OF GENERATED OBJECT CODE


             ; FUNCTION _Pin_gyro_ST_out_Write (BEGIN)
                                           ; SOURCE LINE # 35
0000 900000      R     MOV     DPTR,#value
0003 EF                MOV     A,R7
0004 F0                MOVX    @DPTR,A
                                           ; SOURCE LINE # 36
                                           ; SOURCE LINE # 37
0005 905100            MOV     DPTR,#05100H
0008 E0                MOVX    A,@DPTR
0009 FF                MOV     R7,A
000A EF                MOV     A,R7
000B 54FB              ANL     A,#0FBH
000D FF                MOV     R7,A
000E 900000      R     MOV     DPTR,#staticBits
0011 EF                MOV     A,R7
0012 F0                MOVX    @DPTR,A
                                           ; SOURCE LINE # 38
0013 900000      R     MOV     DPTR,#value
0016 E0                MOVX    A,@DPTR
0017 FF                MOV     R7,A
0018 EF                MOV     A,R7
0019 25E0              ADD     A,ACC
001B 25E0              ADD     A,ACC
001D FF                MOV     R7,A
001E EF                MOV     A,R7
001F 5404              ANL     A,#04H
0021 FF                MOV     R7,A
0022 900000      R     MOV     DPTR,#staticBits
0025 E0                MOVX    A,@DPTR
0026 FE                MOV     R6,A
0027 EF                MOV     A,R7
0028 4E                ORL     A,R6
0029 FF                MOV     R7,A
002A 905100            MOV     DPTR,#05100H
002D EF                MOV     A,R7
002E F0                MOVX    @DPTR,A
                                           ; SOURCE LINE # 39
002F 22                RET     
             ; FUNCTION _Pin_gyro_ST_out_Write (END)

             ; FUNCTION _Pin_gyro_ST_out_SetDriveMode (BEGIN)
                                           ; SOURCE LINE # 56
0000 900000      R     MOV     DPTR,#mode
0003 EF                MOV     A,R7
0004 F0                MOVX    @DPTR,A
                                           ; SOURCE LINE # 57
                                           ; SOURCE LINE # 58
0005 900000      R     MOV     DPTR,#mode
0008 E0                MOVX    A,@DPTR
0009 FF                MOV     R7,A
000A EF                MOV     A,R7
000B 540E              ANL     A,#0EH
000D FF                MOV     R7,A
000E 905002            MOV     DPTR,#05002H
0011 E0                MOVX    A,@DPTR
0012 FE                MOV     R6,A
0013 EE                MOV     A,R6
0014 54F1              ANL     A,#0F1H
0016 FE                MOV     R6,A
C51 COMPILER V9.51   PIN_GYRO_ST_OUT                                                       01/04/2014 15:52:36 PAGE 5   

0017 EE                MOV     A,R6
0018 4F                ORL     A,R7
0019 FF                MOV     R7,A
001A 905002            MOV     DPTR,#05002H
001D EF                MOV     A,R7
001E F0                MOVX    @DPTR,A
                                           ; SOURCE LINE # 59
001F 22                RET     
             ; FUNCTION _Pin_gyro_ST_out_SetDriveMode (END)

             ; FUNCTION Pin_gyro_ST_out_Read (BEGIN)
                                           ; SOURCE LINE # 80
                                           ; SOURCE LINE # 81
                                           ; SOURCE LINE # 82
0000 905101            MOV     DPTR,#05101H
0003 E0                MOVX    A,@DPTR
0004 FF                MOV     R7,A
0005 EF                MOV     A,R7
0006 5404              ANL     A,#04H
0008 FF                MOV     R7,A
0009 7E00              MOV     R6,#00H
000B EF                MOV     A,R7
000C 7802              MOV     R0,#02H
000E         ?C0005:
000E CE                XCH     A,R6
000F C3                CLR     C
0010 13                RRC     A
0011 CE                XCH     A,R6
0012 13                RRC     A
0013 D8F9              DJNZ    R0,?C0005
0015 FF                MOV     R7,A
                                           ; SOURCE LINE # 83
0016         ?C0003:
0016 22                RET     
             ; FUNCTION Pin_gyro_ST_out_Read (END)

             ; FUNCTION Pin_gyro_ST_out_ReadDataReg (BEGIN)
                                           ; SOURCE LINE # 100
                                           ; SOURCE LINE # 101
                                           ; SOURCE LINE # 102
0000 905100            MOV     DPTR,#05100H
0003 E0                MOVX    A,@DPTR
0004 FF                MOV     R7,A
0005 EF                MOV     A,R7
0006 5404              ANL     A,#04H
0008 FF                MOV     R7,A
0009 7E00              MOV     R6,#00H
000B EF                MOV     A,R7
000C 7802              MOV     R0,#02H
000E         ?C0006:
000E CE                XCH     A,R6
000F C3                CLR     C
0010 13                RRC     A
0011 CE                XCH     A,R6
0012 13                RRC     A
0013 D8F9              DJNZ    R0,?C0006
0015 FF                MOV     R7,A
                                           ; SOURCE LINE # 103
0016         ?C0004:
0016 22                RET     
             ; FUNCTION Pin_gyro_ST_out_ReadDataReg (END)

C51 COMPILER V9.51   PIN_GYRO_ST_OUT                                                       01/04/2014 15:52:36 PAGE 6   



MODULE INFORMATION:   STATIC OVERLAYABLE
   CODE SIZE        =    126    ----
   CONSTANT SIZE    =   ----    ----
   XDATA SIZE       =   ----       3
   PDATA SIZE       =   ----    ----
   DATA SIZE        =   ----    ----
   IDATA SIZE       =   ----    ----
   BIT SIZE         =   ----    ----
   EDATA SIZE       =   ----    ----
   HDATA SIZE       =   ----    ----
   XDATA CONST SIZE =   ----    ----
   FAR CONST SIZE   =   ----    ----
END OF MODULE INFORMATION.


C51 COMPILATION COMPLETE.  0 WARNING(S),  0 ERROR(S)
