0 0 0 0
0 0 0 0
0 0 0 0
0 0 0 0
0 0 0 0
0 0 0 0
0 0 0 0
0 0 0 0
0 0 0 0
0 0 0 0
0 0 0 0
0 0 0 0
0 0 0 0
0 0 0 0
0 0 0 0
0 0 0 0
0 0 0 0
0 0 0 0
0 0 0 0
0 0 0 0
0 0 0 0
0 0 0 0
0 0 0 0
0 0 0 0
0 0 0 0
0 0 0 0
0 0 0 0
0 0 0 0
0 0 0 0
0 0 0 0
0 0 0 0
0 0 0 0
0 0 0 0
0 0 0 0
0 0 0 0
0 0 0 0
0 0 0 0
0 0 0 0
0 0 0 0
0 0 0 0
0 0 0 0
0 0 0 0
0 0 0 0
0 0 0 0
0 0 0 0
0 0 0 0
0 0 0 0
0 0 0 0
0 0 0 0
0 0 0 0
0 0 0 0
0 0 0 0
0 0 0 0
0 0 0 0
0 0 0 0
0 0 0 0
0 0 0 0
0 0 0 0
0 0 0 0
0 0 0 0
0 0 0 0
0 0 0 0
0 0 0 0
0 0 0 0
0 0 0 0
0 0 0 0
0 0 0 0
0 0 0 0
0 0 0 0
0 0 0 0
0 0 0 0
0 0 0 0
0 0 0 0
0 0 0 0
0 0 0 0
0 0 0 0
0 0 0 0
0 0 0 0
0 0 0 0
0 0 0 0
0 0 0 0
0 0 0 0
0 0 0 0
0 0 0 0
0 0 0 0
0 0 0 0
0 0 0 0
0 0 0 0
0 0 0 0
0 0 0 0
0 0 0 0
0 0 0 0
0 0 0 0
0 0 0 0
0 0 0 0
0 0 0 0
0 0 0 0
0 0 0 0
0 0 0 0
0 0 0 0
0 0 0 0
0 0 0 0
0 0 0 0
0 0 0 0
0 0 0 0
0 0 0 0
0 0 0 0
0 0 0 0
0 0 0 0
0 0 0 0
0 0 0 0
0 0 0 0
0 0 0 0
0 0 0 0
0 0 0 0
255 0 1 1
255 0 1 1
255 0 1 1
255 0 1 1
255 0 1 1
255 0 1 1
255 0 1 1
255 0 1 1
255 0 1 1
255 0 1 1
255 0 1 1
255 0 1 1
255 0 1 1
255 0 1 1
255 0 1 1
4 253 9 0
4 253 9 0
4 253 9 0
4 253 9 0
4 253 9 0
4 253 9 0
4 253 9 0
4 253 9 0
4 253 9 0
4 253 9 0
4 253 9 0
4 253 9 0
4 253 9 0
4 253 9 0
4 253 9 0
16 0 23 1
16 0 23 1
16 0 23 1
16 0 23 1
16 0 23 1
16 0 23 1
16 0 23 1
16 0 23 1
16 0 23 1
16 0 23 1
16 0 23 1
16 0 23 1
16 0 23 1
16 0 23 1
16 0 23 1
16 0 23 1
21 0 29 0
21 0 29 0
21 0 29 0
21 0 29 0
21 0 29 0
21 0 29 0
21 0 29 0
21 0 29 0
21 0 29 0
21 0 29 0
21 0 29 0
21 0 29 0
21 0 29 0
21 0 29 0
21 0 29 0
30 0 32 1
30 0 32 1
30 0 32 1
30 0 32 1
30 0 32 1
30 0 32 1
30 0 32 1
30 0 32 1
30 0 32 1
30 0 32 1
30 0 32 1
30 0 32 1
30 0 32 1
30 0 32 1
30 0 32 1
30 0 32 1
30 0 32 1
35 0 39 2
35 0 39 2
35 0 39 2
35 0 39 2
35 0 39 2
35 0 39 2
35 0 39 2
35 0 39 2
35 0 39 2
35 0 39 2
35 0 39 2
35 0 39 2
35 0 39 2
42 1 26 2
42 1 26 2
42 1 26 2
42 1 26 2
42 1 26 2
42 1 26 2
42 1 26 2
42 1 26 2
42 1 26 2
42 1 26 2
42 1 26 2
42 1 26 2
42 1 26 2
42 1 26 2
42 1 26 2
45 1 47 1
45 1 47 1
45 1 47 1
45 1 47 1
45 1 47 1
45 1 47 1
45 1 47 1
45 1 47 1
45 1 47 1
45 1 47 1
45 1 47 1
45 1 47 1
45 1 47 1
45 1 47 1
45 1 47 1
45 1 47 1
50 0 50 0
50 0 50 0
50 0 50 0
50 0 50 0
50 0 50 0
50 0 50 0
50 0 50 0
50 0 50 0
50 0 50 0
50 0 50 0
50 0 50 0
50 0 50 0
50 0 50 0
50 0 50 0
58 3 57 0
58 3 57 0
58 3 57 0
58 3 57 0
58 3 57 0
58 3 57 0
58 3 57 0
58 3 57 0
58 3 57 0
58 3 57 0
58 3 57 0
58 3 57 0
58 3 57 0
61 3 59 0
61 3 59 0
61 3 59 0
61 3 59 0
61 3 59 0
61 3 59 0
61 3 59 0
61 3 59 0
61 3 59 0
61 3 59 0
61 3 59 0
61 3 59 0
61 3 59 0
61 3 59 0
61 4 61 1
61 4 61 1
61 4 61 1
61 4 61 1
61 4 61 1
61 4 61 1
61 4 61 1
61 4 61 1
61 4 61 1
61 4 61 1
61 4 61 1
61 4 61 1
61 4 61 1
61 4 61 1
61 4 61 1
60 3 59 0
60 3 59 0
60 3 59 0
60 3 59 0
60 3 59 0
60 3 59 0
60 3 59 0
60 3 59 0
60 3 59 0
60 3 59 0
60 3 59 0
60 3 59 0
60 3 59 0
60 3 59 0
60 3 59 0
59 2 59 0
59 2 59 0
59 2 59 0
59 2 59 0
59 2 59 0
59 2 59 0
59 2 59 0
59 2 59 0
59 2 59 0
59 2 59 0
59 2 59 0
59 2 59 0
59 2 59 0
59 2 59 0
59 2 59 0
61 1 60 0
61 1 60 0
61 1 60 0
61 1 60 0
61 1 60 0
61 1 60 0
61 1 60 0
61 1 60 0
61 1 60 0
61 1 60 0
61 1 60 0
61 1 60 0
61 1 60 0
61 1 60 0
61 1 60 0
61 1 60 0
63 3 44 0
63 3 44 0
63 3 44 0
63 3 44 0
63 3 44 0
63 3 44 0
63 3 44 0
63 3 44 0
63 3 44 0
63 3 44 0
63 3 44 0
63 3 44 0
63 3 44 0
63 3 44 0
63 3 44 0
66 0 52 251
66 0 52 251
66 0 52 251
66 0 52 251
66 0 52 251
66 0 52 251
66 0 52 251
66 0 52 251
66 0 52 251
66 0 52 251
66 0 52 251
66 0 52 251
66 0 52 251
66 0 52 251
66 0 52 251
66 0 52 251
75 0 41 0
75 0 41 0
75 0 41 0
75 0 41 0
75 0 41 0
75 0 41 0
75 0 41 0
75 0 41 0
75 0 41 0
75 0 41 0
75 0 41 0
75 0 41 0
75 0 41 0
75 0 41 0
74 1 76 0
74 1 76 0
74 1 76 0
74 1 76 0
74 1 76 0
74 1 76 0
74 1 76 0
74 1 76 0
74 1 76 0
74 1 76 0
74 1 76 0
74 1 76 0
74 1 76 0
74 1 76 0
74 1 78 255
80 0 78 255
80 0 78 255
80 0 78 255
80 0 78 255
80 0 78 255
80 0 78 255
80 0 78 255
80 0 78 255
80 0 78 255
80 0 78 255
80 0 78 255
80 0 78 255
80 0 78 255
80 0 78 255
80 0 78 255
83 0 85 0
83 0 85 0
83 0 85 0
83 0 85 0
83 0 85 0
83 0 85 0
83 0 85 0
83 0 85 0
83 0 85 0
83 0 85 0
83 0 85 0
83 0 85 0
83 0 85 0
83 0 85 0
83 0 85 0
88 0 88 0
88 0 88 0
88 0 88 0
88 0 88 0
88 0 88 0
88 0 88 0
88 0 88 0
88 0 88 0
88 0 88 0
88 0 88 0
88 0 88 0
88 0 88 0
88 0 88 0
88 0 88 0
88 0 88 0
85 0 89 1
85 0 89 1
85 0 89 1
85 0 89 1
85 0 89 1
85 0 89 1
85 0 89 1
85 0 89 1
85 0 89 1
85 0 89 1
85 0 89 1
85 0 89 1
85 0 89 1
85 0 89 1
87 0 90 0
87 0 90 0
87 0 90 0
87 0 90 0
87 0 90 0
87 0 90 0
87 0 90 0
87 0 90 0
87 0 90 0
87 0 90 0
87 0 90 0
87 0 90 0
87 0 90 0
87 0 90 0
88 0 89 0
88 0 89 0
88 0 89 0
88 0 89 0
88 0 89 0
88 0 89 0
88 0 89 0
88 0 89 0
88 0 89 0
88 0 89 0
89 1 91 0
89 1 91 0
89 1 91 0
89 1 91 0
89 1 91 0
89 1 91 0
89 1 91 0
89 1 91 0
89 1 91 0
89 1 91 0
89 1 91 0
89 1 91 0
89 1 91 0
89 1 91 0
90 3 90 0
90 3 90 0
90 3 90 0
90 3 90 0
90 3 90 0
90 3 90 0
90 3 90 0
90 3 90 0
90 3 90 0
90 3 90 0
90 3 90 0
90 3 90 0
90 3 90 0
90 3 90 0
90 3 90 0
90 2 91 1
90 2 91 1
90 2 91 1
90 2 91 1
90 2 91 1
90 2 91 1
90 2 91 1
90 2 91 1
90 2 91 1
90 2 91 1
90 2 91 1
90 2 91 1
90 2 91 1
90 2 91 1
90 2 91 1
89 2 90 1
89 2 90 1
89 2 90 1
89 2 90 1
89 2 90 1
89 2 90 1
89 2 90 1
89 2 90 1
89 2 90 1
89 2 90 1
89 2 90 1
89 2 90 1
89 2 90 1
89 2 90 1
89 2 90 1
86 0 89 0
86 0 89 0
86 0 89 0
86 0 89 0
86 0 89 0
86 0 89 0
86 0 89 0
86 0 89 0
86 0 89 0
86 0 89 0
86 0 89 0
86 0 89 0
86 0 89 0
86 0 89 0
86 0 89 0
87 0 89 0
87 0 89 0
87 0 89 0
87 0 89 0
87 0 89 0
87 0 89 0
87 0 89 0
87 0 89 0
87 0 89 0
87 0 89 0
87 0 89 0
87 0 89 0
87 0 89 0
89 0 86 0
89 0 86 0
89 0 86 0
89 0 86 0
89 0 86 0
89 0 86 0
89 0 86 0
89 0 86 0
89 0 86 0
89 0 86 0
89 0 86 0
89 0 86 0
89 0 86 0
89 0 86 0
89 0 86 0
84 0 88 0
84 0 88 0
84 0 88 0
84 0 88 0
84 0 88 0
84 0 88 0
84 0 88 0
84 0 88 0
84 0 88 0
84 0 88 0
84 0 88 0
84 0 88 0
84 0 88 0
84 0 88 0
84 0 88 0
89 1 88 0
89 1 88 0
89 1 88 0
89 1 88 0
89 1 88 0
89 1 88 0
89 1 88 0
89 1 88 0
89 1 88 0
89 1 88 0
89 1 88 0
89 1 88 0
89 1 88 0
89 1 88 0
89 1 88 0
89 1 88 0
85 0 84 2
85 0 84 2
85 0 84 2
85 0 84 2
85 0 84 2
85 0 84 2
85 0 84 2
85 0 84 2
85 0 84 2
85 0 84 2
85 0 84 2
85 0 84 2
85 0 84 2
85 0 84 2
85 0 84 2
85 0 84 2
84 5 80 1
84 5 80 1
84 5 80 1
84 5 80 1
84 5 80 1
84 5 80 1
84 5 80 1
84 5 80 1
84 5 80 1
84 5 80 1
84 5 80 1
84 5 80 1
84 5 80 1
84 5 80 1
84 5 80 1
84 5 80 1
80 4 78 4
80 4 78 4
80 4 78 4
80 4 78 4
80 4 78 4
80 4 78 4
80 4 78 4
80 4 78 4
80 4 78 4
80 4 78 4
80 4 78 4
80 4 78 4
80 4 78 4
80 4 78 4
79 6 76 2
79 6 76 2
79 6 76 2
79 6 76 2
79 6 76 2
79 6 76 2
79 6 76 2
79 6 76 2
79 6 76 2
79 6 76 2
79 6 76 2
79 6 76 2
79 6 76 2
73 3 71 2
73 3 71 2
73 3 71 2
73 3 71 2
73 3 71 2
73 3 71 2
73 3 71 2
73 3 71 2
73 3 71 2
73 3 71 2
73 3 71 2
73 3 71 2
73 3 71 2
73 3 71 2
73 3 71 2
74 3 67 0
74 3 67 0
74 3 67 0
74 3 67 0
74 3 67 0
74 3 67 0
74 3 67 0
74 3 67 0
74 3 67 0
74 3 67 0
74 3 67 0
74 3 67 0
74 3 67 0
74 3 67 0
74 3 67 0
74 3 67 0
65 2 63 1
65 2 63 1
65 2 63 1
65 2 63 1
65 2 63 1
65 2 63 1
65 2 63 1
65 2 63 1
65 2 63 1
65 2 63 1
65 2 63 1
65 2 63 1
65 2 63 1
65 2 63 1
65 2 63 1
65 3 62 1
65 3 62 1
65 3 62 1
65 3 62 1
65 3 62 1
65 3 62 1
65 3 62 1
65 3 62 1
65 3 62 1
65 3 62 1
65 3 62 1
65 3 62 1
65 3 62 1
65 3 62 1
65 3 62 1
61 0 60 0
61 0 60 0
61 0 60 0
61 0 60 0
61 0 60 0
61 0 60 0
61 0 60 0
61 0 60 0
61 0 60 0
61 0 60 0
61 0 60 0
61 0 60 0
58 1 60 0
58 1 60 0
58 1 60 0
58 1 60 0
58 1 60 0
58 1 60 0
58 1 60 0
58 1 60 0
58 1 60 0
58 1 60 0
58 1 60 0
58 1 60 0
58 1 60 0
61 0 58 0
61 0 58 0
61 0 58 0
61 0 58 0
61 0 58 0
61 0 58 0
61 0 58 0
61 0 58 0
61 0 58 0
61 0 58 0
61 0 58 0
61 0 58 0
61 0 58 0
61 0 58 0
55 254 53 255
55 254 53 255
55 254 53 255
55 254 53 255
55 254 53 255
55 254 53 255
55 254 53 255
55 254 53 255
55 254 53 255
55 254 53 255
55 254 53 255
55 254 53 255
55 254 53 255
55 254 53 255
55 254 53 255
55 254 53 255
28 250 28 254
28 250 28 254
28 250 28 254
28 250 28 254
28 250 28 254
28 250 28 254
28 250 28 254
28 250 28 254
28 250 28 254
28 250 28 254
28 250 28 254
28 250 28 254
28 250 28 254
28 250 28 254
28 250 28 254
19 253 21 253
19 253 21 253
19 253 21 253
19 253 21 253
19 253 21 253
19 253 21 253
19 253 21 253
19 253 21 253
19 253 21 253
19 253 21 253
19 253 21 253
19 253 21 253
19 253 21 253
19 253 21 253
19 253 21 253
17 255 20 255
17 255 20 255
17 255 20 255
17 255 20 255
17 255 20 255
17 255 20 255
17 255 20 255
17 255 20 255
17 255 20 255
17 255 20 255
17 255 20 255
17 255 20 255
17 255 20 255
12 255 12 253
12 255 12 253
12 255 12 253
12 255 12 253
12 255 12 253
12 255 12 253
12 255 12 253
12 255 12 253
12 255 12 253
12 255 12 253
12 255 12 253
6 255 7 0
6 255 7 0
6 255 7 0
6 255 7 0
6 255 7 0
6 255 7 0
6 255 7 0
6 255 7 0
6 255 7 0
6 255 7 0
6 255 7 0
6 255 7 0
6 255 7 0
6 255 7 0
6 255 7 0
0 0 0 0
0 0 0 0
0 0 0 0
0 0 0 0
0 0 0 0
0 0 0 0
0 0 0 0
0 0 0 0
0 0 0 0
0 0 0 0
0 0 0 0
0 0 0 0
0 0 0 0
0 0 0 0
0 0 0 0
0 0 0 0
0 0 0 0
0 0 0 0
0 0 0 0
0 0 0 0
0 0 0 0
0 0 0 0
0 0 0 0
0 0 0 0
0 0 0 0
0 0 0 0
0 0 0 0
0 0 0 0
0 0 0 0
0 0 0 0
0 0 0 0
0 0 0 0
0 0 0 0
0 0 0 0
0 0 0 0
0 0 0 0
0 0 0 0
0 0 0 0
0 0 0 0
0 0 0 0
0 0 0 0
0 0 0 0
0 0 0 0
0 0 0 0
0 0 0 0
0 0 0 0
0 0 0 0
0 0 0 0
0 0 0 0
0 0 0 0
0 0 0 0
0 0 0 0
0 0 0 0
0 0 0 0
0 0 0 0
0 0 0 0
0 0 0 0
0 0 0 0
0 0 0 0
0 0 0 0
0 0 0 0
0 0 0 0
0 0 0 0
0 0 0 0
0 0 0 0
0 0 0 0
0 0 0 0
0 0 0 0
0 0 0 0
0 0 0 0
0 0 0 0
0 0 0 0
0 0 0 0
0 0 0 0
0 0 0 0
0 0 0 0
0 0 0 0
0 0 0 0
0 0 0 0
0 0 0 0
0 0 0 0
0 0 0 0
0 0 0 0
0 0 0 0
0 0 0 0
0 0 0 0
0 0 0 0
0 0 0 0
0 0 0 0
0 0 0 0
0 0 0 0
0 0 0 0
0 0 0 0
0 0 0 0
0 0 0 0
0 0 0 0
0 0 0 0
0 0 0 0
0 0 0 0
0 0 0 0
0 0 0 0
0 0 0 0
0 0 0 0
0 0 0 0
0 0 0 0
0 0 0 0
0 0 0 0
0 0 0 0
0 0 0 0
0 0 0 0
0 0 0 0
0 0 0 0
0 0 0 0
0 0 0 0
0 0 0 0
0 0 0 0
0 0 0 0
0 0 0 0
0 0 0 0
0 0 0 0
0 0 0 0
0 0 0 0
0 0 0 0
0 0 0 0
0 0 0 0
0 0 0 0
0 0 0 0
0 0 0 0
0 0 0 0
0 0 0 0
0 0 0 0
0 0 0 0
0 0 0 0
0 0 0 0
0 0 0 0
0 0 0 0
0 0 0 0
0 0 0 0
0 0 0 0
0 0 0 0
0 0 0 0
0 0 0 0
0 0 0 0
0 0 0 0
0 0 0 0
0 0 0 0
0 0 0 0
0 0 0 0
0 0 0 0
0 0 0 0
0 0 0 0
0 0 0 0
0 0 0 0
0 0 0 0
0 0 0 0
0 0 0 0
0 0 0 0
0 0 0 0
0 0 0 0
0 0 0 0
0 0 0 0
0 0 0 0
0 0 0 0
0 0 0 0
0 0 0 0
0 0 0 0
0 0 0 0
0 0 0 0
0 0 0 0
0 0 0 0
0 0 0 0
0 0 0 0
0 0 0 0
0 0 0 0
0 0 0 0
0 0 0 0
0 0 0 0
0 0 0 0
0 0 0 0
0 0 0 0
0 0 0 0
0 0 0 0
0 0 0 0
0 0 0 0
0 0 0 0
0 0 0 0
0 0 0 0
0 0 0 0
0 0 0 0
0 0 0 0
0 0 0 0
0 0 0 0
0 0 0 0
0 0 0 0
0 0 0 0
0 0 0 0
0 0 0 0
0 0 0 0
0 0 0 0
0 0 0 0
0 0 0 0
0 0 0 0
0 0 0 0
0 0 0 0
0 0 0 0
0 0 0 0
0 0 0 0
0 0 0 0
0 0 0 0
0 0 0 0
0 0 0 0
0 0 0 0
0 0 0 0
0 0 0 0
0 0 0 0
0 0 0 0
0 0 0 0
0 0 0 0
0 0 0 0
0 0 0 0
0 0 0 0
0 0 0 0
0 0 0 0
0 0 0 0
0 0 0 0
0 0 0 0
0 0 0 0
0 0 0 0
0 0 0 0
0 0 0 0
0 0 0 0
0 0 0 0
0 0 0 0
0 0 0 0
0 0 0 0
0 0 0 0
0 0 0 0
0 0 0 0
0 0 0 0
0 0 0 0
0 0 0 0
0 0 0 0
0 0 0 0
0 0 0 0
0 0 0 0
0 0 0 0
0 0 0 0
0 0 0 0
0 0 0 0
0 0 0 0
0 0 0 0
0 0 0 0
0 0 0 0
0 0 0 0
0 0 0 0
0 0 0 0
0 0 0 0
0 0 0 0
0 0 0 0
0 0 0 0
0 0 0 0
0 0 0 0
0 0 0 0
0 0 0 0
0 0 0 0
0 0 0 0
0 0 0 0
0 0 0 0
0 0 0 0
0 0 0 0
0 0 0 0
0 0 0 0
0 0 0 0
0 0 0 0
0 0 0 0
0 0 0 0
0 0 0 0
0 0 0 0
0 0 0 0
0 0 0 0
0 0 0 0
0 0 0 0
0 0 0 0
0 0 0 0
0 0 0 0
0 0 0 0
0 0 0 0
0 0 0 0
0 0 0 0
0 0 0 0
0 0 0 0
0 0 0 0
0 0 0 0
0 0 0 0
0 0 0 0
0 0 0 0
0 0 0 0
0 0 0 0
0 0 0 0
0 0 0 0
0 0 0 0
0 0 0 0
0 0 0 0
0 0 0 0
0 0 0 0
0 0 0 0
0 0 0 0
0 0 0 0
0 0 0 0
0 0 0 0
0 0 0 0
0 0 0 0
0 0 0 0
0 0 0 0
0 0 0 0
0 0 0 0
0 0 0 0
0 0 0 0
0 0 0 0
0 0 0 0
0 0 0 0
0 0 0 0
0 0 0 0
0 0 0 0
0 0 0 0
0 0 0 0
0 0 0 0
0 0 0 0
0 0 0 0
0 0 0 0
0 0 0 0
0 0 0 0
0 0 0 0
0 0 0 0
0 0 0 0
0 0 0 0
0 0 0 0
0 0 0 0
0 0 0 0
0 0 0 0
0 0 0 0
0 0 0 0
0 0 0 0
0 0 0 0
0 0 0 0
0 0 0 0
0 0 0 0
0 0 0 0
0 0 0 0
0 0 0 0
0 0 0 0
0 0 0 0
0 0 0 0
0 0 0 0
0 0 0 0
0 0 0 0
0 0 0 0
0 0 0 0
0 0 0 0
0 0 0 0
0 0 0 0
0 0 0 0
0 0 0 0
0 0 0 0
0 0 0 0
0 0 0 0
0 0 0 0
0 0 0 0
0 0 0 0
0 0 0 0
0 0 0 0
0 0 0 0
0 0 0 0
0 0 0 0
0 0 0 0
0 0 0 0
0 0 0 0
0 0 0 0
0 0 0 0
0 0 0 0
0 0 0 0
0 0 0 0
0 0 0 0
0 0 0 0
0 0 0 0
0 0 0 0
0 0 0 0
0 0 0 0
0 0 0 0
0 0 0 0
0 0 0 0
0 0 0 0
0 0 0 0
0 0 0 0
0 0 0 0
0 0 0 0
0 0 0 0
0 0 0 0
0 0 0 0
0 0 0 0
0 0 0 0
0 0 0 0
0 0 0 0
0 0 0 0
0 0 0 0
0 0 0 0
0 0 0 0
0 0 0 0
0 0 0 0
0 0 0 0
0 0 0 0
0 0 0 0
0 0 0 0
0 0 0 0
0 0 0 0
0 0 0 0
0 0 0 0
0 0 0 0
0 0 0 0
0 0 0 0
0 0 0 0
0 0 0 0
0 0 0 0
0 0 0 0
0 0 0 0
0 0 0 0
0 0 0 0
0 0 0 0
0 0 0 0
0 0 0 0
0 0 0 0
0 0 0 0
0 0 0 0
0 0 0 0
0 0 0 0
0 0 0 0
0 0 0 0
0 0 0 0
0 0 0 0
0 0 0 0
0 0 0 0
0 0 0 0
0 0 0 0
0 0 0 0
0 0 0 0
0 0 0 0
0 0 0 0
0 0 0 0
0 0 0 0
0 0 0 0
0 0 0 0
0 0 0 0
0 0 0 0
0 0 0 0
0 0 0 0
0 0 0 0
0 0 0 0
0 0 0 0
0 0 0 0
0 0 0 0
0 0 0 0
0 0 0 0
0 0 0 0
0 0 0 0
0 0 0 0
0 0 0 0
0 0 0 0
0 0 0 0
0 0 0 0
0 0 0 0
0 0 0 0
0 0 0 0
0 0 0 0
0 0 0 0
0 0 0 0
0 0 0 0
0 0 0 0
0 0 0 0
0 0 0 0
0 0 0 0
0 0 0 0
0 0 0 0
0 0 0 0
0 0 0 0
0 0 0 0
0 0 0 0
0 0 0 0
0 0 0 0
0 0 0 0
0 0 0 0
0 0 0 0
0 0 0 0
0 0 0 0
0 0 0 0
0 0 0 0
0 0 0 0
0 0 0 0
0 0 0 0
0 0 0 0
0 0 0 0
0 0 0 0
0 0 0 0
0 0 0 0
0 0 0 0
0 0 0 0
0 0 0 0
0 0 0 0
0 0 0 0
0 0 0 0
0 0 0 0
0 0 0 0
0 0 0 0
0 0 0 0
0 0 0 0
0 0 0 0
0 0 0 0
0 0 0 0
0 0 0 0
0 0 0 0
0 0 0 0
0 0 0 0
0 0 0 0
0 0 0 0
0 0 0 0
0 0 0 0
0 0 0 0
0 0 0 0
0 0 0 0
0 0 0 0
0 0 0 0
0 0 0 0
0 0 0 0
0 0 0 0
0 0 0 0
0 0 0 0