lat,lon,Place,Reason
42.36089,-71.08774,MIT Media Lab,
40.42883,-86.91323,Purdue University,
-26.54087,151.83932,Kingaroy,
-33.86749,151.20699,Sydney,
-27.47101,153.02345,Brisbane,
12.9716,77.59456,Bangalore,
12.99233,80.23685,IIT Madras,
19.13084,72.9168,IIT Bombay,
42.50009,-71.58284,Harvard,
25.80115,-80.20238,Lab Miami/Flomio,
24.55506,-81.77999,Key West,