<?xml version="1.0" encoding="iso-8859-1"?>
<!-- Generator: Adobe Illustrator 19.0.1, SVG Export Plug-In . SVG Version: 6.00 Build 0)  -->
<svg version="1.1" id="Layer_1" xmlns="http://www.w3.org/2000/svg" xmlns:xlink="http://www.w3.org/1999/xlink" x="0px" y="0px"
	 viewBox="0 0 500 500" style="enable-background:new 0 0 500 500;" xml:space="preserve">
<g>
	<path style="fill:#929292;" d="M162.578,189.21c-5.51,5.235-11.304,9.988-15.514,16.747c-8.303,0-16.498,0.091-24.69-0.044
		c-3.34-0.055-5.762,0.88-6.883,4.231c0.641,2.552,2.434,3.714,4.798,4.332c1.98,0.518,3.957,1.085,5.878,1.788
		c7.92,2.898,11.037,8.569,9.109,16.654c-3.406,14.287-12.454,22.507-26.188,24.245c-17.51,2.216-35.046,0.289-53.362,1.209
		c2.377-6.666,4.418-12.391,6.269-17.582c2.156-1.639,4.045-1.237,5.842-1.241c11.434-0.026,22.869-0.009,34.303-0.018
		c1.828-0.002,3.657-0.036,5.484-0.116c2.249-0.098,4.08-0.988,4.602-3.332c0.652-2.93-1.558-4.122-3.68-4.977
		c-2.312-0.931-4.82-1.362-7.18-2.188c-7.761-2.716-11.615-8.871-8.524-17.186c1.513-4.07,2.958-8.084,5.309-11.785
		c4.106-6.463,9.919-9.703,17.468-10.486C131.126,187.852,146.662,189.214,162.578,189.21z"/>
	<path style="fill:#929292;" d="M345.07,257.901c-1.753-7.02-3.504-14.031-5.493-21.995c-4.643,7.151-5.628,15.15-9.563,22.035
		c-6.741,0-13.543,0-21.205,0c8.437-23.166,16.727-45.924,25.119-68.967c11.079-0.65,22.015-0.811,32.794,1.011
		c9.892,1.673,13.847,9.069,11.099,18.833c-1.82,6.467-5.564,11.454-11.03,15.17c-2.62,1.782-5.449,3.257-8.287,4.931
		c4.057,9.269,6.886,18.842,8.924,28.981C360.014,257.901,352.778,257.901,345.07,257.901z"/>
	<path style="fill:#929292;" d="M139.757,238.914c0.112-21.869,17.122-44.712,37.122-49.91c4.743-1.233,9.582-1.22,14.272-0.37
		c9.117,1.652,14.134,7.872,14.623,17.227c0.267,5.109-0.944,9.961-2.555,14.725c-4.151,12.269-9.76,23.667-20.598,31.507
		c-7.867,5.691-16.663,7.837-26.444,6.519C146.055,257.247,138.84,250.227,139.757,238.914z"/>
	<path style="fill:#929292;" d="M297.057,188.161c14.276,0.035,20.571,5.256,22.221,17.031c0.457,3.261-0.189,6.488-0.927,9.448
		c-3.36,13.482-8.918,25.979-19.623,35.35c-8.081,7.074-17.604,9.798-28.484,8.697c-14.09-1.426-19.086-12.809-17.076-23.9
		c2.064-11.392,6.742-21.683,14.107-30.769c4.428-5.462,9.781-9.602,16.016-12.599C288.058,189.128,293.111,187.657,297.057,188.161
		z"/>
	<path style="fill:#929292;" d="M231.964,216.186c5.664,0,11.011,0,16.735,0c-0.445,5.675-2.809,9.846-4.655,14.577
		c-5.853,0-11.761,0-18.003,0c-1.742,4.641-3.417,9.062-5.062,13.494c-1.652,4.453-3.274,8.918-4.967,13.536
		c-7.084,0.677-13.86,0.418-21.235,0.184c3.151-8.755,6.119-17.071,9.137-25.369c2.876-7.908,6.046-15.717,8.66-23.709
		c5.084-15.538,13.011-19.859,28.612-20.167c11.657-0.231,23.322-0.046,35.451-0.046c-2.064,3.971-6.182,5.278-8.893,8.07
		c-2.854,2.939-6.202,5.399-10.709,9.241c-5.562,0-13.305,0-20.94,0C233.396,208.823,232.434,211.946,231.964,216.186z"/>
	<path style="fill:#929292;" d="M395.732,206.059c-4.221,0-7.82,0-11.844,0c-0.347-6.262-1.011-12.119-6.948-16.918
		c23.469,0,45.65,0,68.21,0c-0.557,6.111-3.495,11.003-5.458,16.719c-8.068,0-16.002,0-24.166,0
		c-6.456,17.639-12.765,34.874-19.073,52.106c-6.354,0-12.249,0-19.104,0C382.925,240.351,389.946,223.735,395.732,206.059z"/>
	<path style="fill:#3B3B3B;" d="M224.584,285.184c-2.799,7.56-5.253,13.909-7.489,20.334c-1.321,3.796-3.643,4.069-7.154,2.62
		c0.889-5.133,3.193-9.585,4.761-14.259c1.445-4.307,3.097-8.546,4.703-12.798c2.81-7.44,3.868-7.955,12.037-5.666
		c1.188,6.711,2.412,13.621,3.825,21.599c2.524-6.913,4.647-12.954,6.939-18.93c1.559-4.064,1.991-4.161,7.76-2.922
		c-3.732,10.252-7.261,20.504-11.23,30.584c-1.658,4.209-5.461,3.05-9.256,2.243C226.812,301.039,227.256,293.296,224.584,285.184z"
		/>
	<path style="fill:#3B3B3B;" d="M145.024,275.76c1.173,6.671,2.377,13.515,3.761,21.383c2.489-6.895,4.567-12.884,6.817-18.809
		c1.603-4.221,1.751-4.204,7.528-3.491c-0.544,4.534-2.764,8.528-4.124,12.759c-1.667,5.185-3.623,10.281-5.555,15.378
		c-2.221,5.86-2.712,6.072-10.164,5.031c-3.531-6.726-1.78-15.02-5.37-22.353c-2.505,6.833-4.94,13.205-7.166,19.649
		c-1.261,3.652-3.573,4.213-6.591,3.286c-1.308-2.052,0.01-3.388,0.516-4.809c2.742-7.702,5.483-15.405,8.338-23.065
		C135.694,273.526,137.31,272.876,145.024,275.76z"/>
	<path style="fill:#3C3C3C;" d="M271.856,295.232c-1.444-1.778-3.63-0.266-5.198-1.465c-0.7-0.406-0.424-1.151-0.325-1.762
		c0.337-2.069,1.506-3.291,3.706-3.216c3.603,0.123,7.252-0.426,11.188,0.528c-0.743,5.912-3.462,10.915-5.374,16.157
		c-0.272,0.745-1.189,1.518-1.972,1.773c-5.698,1.854-11.458,3.01-17.398,0.967c-4.201-1.445-6.527-4.547-6.341-8.771
		c0.735-16.689,15.876-28.929,31.26-25.102c1.316,0.327,2.682,0.657,3.812,1.972c1.172,2.157,0.368,4.131-1.024,5.693
		c-0.942,0.891-1.555,0.354-2.072,0.055c-10.346-5.976-19.873,1.034-22.902,9.743c-2.709,7.789,0.046,11.54,8.199,10.783
		c0.664-0.062,1.305-0.366,2.323-0.665C270.58,299.849,272.004,297.785,271.856,295.232z"/>
	<path style="fill:#3B3B3B;" d="M55.528,307.686c3.91-10.605,7.613-20.601,11.276-30.613c0.854-2.334,2.763-2.946,4.884-3.064
		c3.43-0.191,6.853-0.044,10.244,0.632c6.079,1.212,7.722,5.08,4.523,10.509c-1.068,1.813-2.716,3.021-4.117,4.464
		c3.765,7.02,1.39,13.443-6.246,17.015C71.22,308.908,64.138,309.373,55.528,307.686z"/>
	<path style="fill:#3C3C3C;" d="M116.317,307.865c-2.288,1.56-4.398,1.507-6.732,0.344c-0.982-2.136,0.676-4.492-0.539-6.653
		c-1.824-1.118-3.931-0.467-5.939-0.572c-2.035-0.106-4.079-0.023-5.649-0.023c-3.098,2.5-3.703,6.544-7.308,7.724
		c-1.53,0.501-3.144,0.732-4.562-0.835c-0.338-1.971,1.336-3.18,2.298-4.562c5.745-8.251,11.834-16.269,17.377-24.65
		c3.07-4.643,6.721-5.6,12.347-3.804C117.087,285.885,118.199,296.949,116.317,307.865z"/>
	<path style="fill:#3C3C3C;" d="M178.76,308.181c-1.454-4.797-2.826-9.323-4.471-14.747c-2.67,4.212-3.347,8.154-4.891,11.715
		c-1.712,3.95-1.935,4.02-8.3,2.714c4.035-11.16,8.026-22.203,11.831-32.726c2.611-1.416,4.558-1.519,6.663-0.221
		c0.932,3.687-2.94,6.523-2.119,10.849c3.301-1.075,5.061-3.741,7.285-5.739c1.87-1.68,3.508-3.728,5.616-5.007
		c2.12-1.286,4.701-1.937,7.156,0.45c-4.344,5.357-9.976,9.3-15.008,14.101c-0.491,6.27,3.853,11.572,3.832,17.683
		C183.005,308.815,183.005,308.815,178.76,308.181z"/>
	<path style="fill:#3D3D3D;" d="M204.695,275.097c2.517-0.954,4.454-1.69,6.435-0.219c0.919,1.6-0.031,2.986-0.565,4.454
		c-3.017,8.292-5.962,16.61-9.017,24.888c-1.702,4.614-1.777,4.586-8.163,4.153c0.328-5.974,3.518-11.022,5.279-16.451
		C200.48,286.327,202.622,280.839,204.695,275.097z"/>
	<path style="fill:#FCFCFC;" d="M342.254,219.536c2.043-5.471,3.934-10.535,5.814-15.571c3.688-0.726,6.977-0.862,9.834,1.38
		C358.913,215.028,353.618,220.018,342.254,219.536z"/>
	<path style="fill:#FEFEFE;" d="M160.181,234.691c1.513-8.913,4.903-18.434,11.595-26.539c0.981-1.188,2.371-2.189,3.773-2.849
		c2.765-1.301,5.83-1.847,8.434,0.104c2.358,1.766,1.737,4.689,1.179,7.02c-2.01,8.399-4.685,16.582-9.34,23.973
		c-1.606,2.55-3.504,4.717-6.406,5.886C163.701,244.587,159.973,242.109,160.181,234.691z"/>
	<path style="fill:#FDFDFD;" d="M299.174,210.168c-1.231,6.333-3.51,12.972-6.323,19.413c-1.266,2.899-2.971,5.615-4.576,8.356
		c-1.185,2.023-2.979,3.387-5.148,4.308c-6.224,2.645-10.904-0.575-9.668-7.162c1.597-8.511,4.449-16.689,9.37-23.938
		c2.19-3.226,4.875-6.097,8.9-7.07C296.005,203.041,299.131,205.395,299.174,210.168z"/>
	<path style="fill:#F9F9F9;" d="M65.115,302.612c0.332-3.166,1.597-5.703,2.672-8.089c1.729-0.954,3.325-0.621,4.876-0.595
		c1.639,0.027,3.241,0.353,3.827,2.148c0.553,1.696-0.355,3.123-1.436,4.266C72.306,303.246,68.931,303.549,65.115,302.612z"/>
	<path style="fill:#EEEEEE;" d="M73.462,279.839c2.367-0.333,4.465-0.069,6.3,1.297c-0.841,6.285-2.398,7.368-9.489,6.684
		C70.905,284.985,71.729,282.264,73.462,279.839z"/>
	<path style="fill:#ECECEC;" d="M109.347,282.447c1.028,4.766,0.288,8.332,0.246,12.125c-2.552,1.284-5.16,0.686-8.167,0.494
		C103.092,290.489,106.339,287.36,109.347,282.447z"/>
</g>
</svg>
