<?xml version="1.0" encoding="iso-8859-1"?>
<!-- Generator: Adobe Illustrator 18.1.1, SVG Export Plug-In . SVG Version: 6.00 Build 0)  -->
<svg version="1.1" id="Layer_1" xmlns="http://www.w3.org/2000/svg" xmlns:xlink="http://www.w3.org/1999/xlink" x="0px" y="0px"
	 viewBox="0 0 612 792" style="enable-background:new 0 0 612 792;" xml:space="preserve">
<path d="M0,175.844L85.844,90L612,616.156L526.156,702L0,175.844z"/>
<path d="M609.491,177.828L524.213,92.55L2.509,614.172l85.278,85.318L609.491,177.828z"/>
</svg>
