<?xml version="1.0" encoding="iso-8859-1"?>
<!-- Generator: Adobe Illustrator 18.1.1, SVG Export Plug-In . SVG Version: 6.00 Build 0)  -->
<svg version="1.1" id="Layer_1" xmlns="http://www.w3.org/2000/svg" xmlns:xlink="http://www.w3.org/1999/xlink" x="0px" y="0px"
	 viewBox="0 0 45 45" style="enable-background:new 0 0 45 45;" xml:space="preserve">
<path d="M0,0v45h45V0H0z M33.637,17.396c-1.258,7.081-8.281,13.08-10.394,14.45c-2.113,1.37-4.042-0.549-4.739-2
	c-0.802-1.656-3.2-10.623-3.827-11.366c-0.628-0.742-2.513,0.743-2.513,0.743l-0.913-1.198c0,0,3.826-4.57,6.737-5.143
	c3.089-0.606,3.085,4.742,3.827,7.71c0.718,2.871,1.202,4.513,1.828,4.513c0.629,0,1.828-1.601,3.141-4.055
	c1.314-2.457-0.056-4.628-2.627-3.084C25.183,11.798,34.894,10.315,33.637,17.396z"/>
</svg>
