[
  {
    "_id": "5c9ccad4cb10fe87347c6b06",
    "date_added": "22-02-19 9:50",
    "name": "Daktronics Other",
    "unique_id": "5c9c9460e33c9438c0bf2646"
  },
  {
    "_id": "5c9ccad4cb10fe87347c6b0b",
    "date_added": "27-02-19 9:50",
    "name": "FairPlay MP69",
    "unique_id": "5c9c9460e33c9438c0bf264b"
  },
  {
    "_id": "5c9ccad4cb10fe87347c6b0c",
    "date_added": "28-02-19 9:50",
    "name": "FairPlay MP70",
    "unique_id": "5c9c9460e33c9438c0bf264c"
  },
  {
    "_id": "5c9ccad4cb10fe87347c6b10",
    "date_added": "04-03-19 9:50",
    "name": "Nevco MPC-5",
    "unique_id": "5c9c9460e33c9438c0bf2650"
  },
  {
    "_id": "5c9ccad4cb10fe87347c6b0d",
    "date_added": "01-03-19 9:50",
    "name": "FairPlay MP73",
    "unique_id": "5c9c9460e33c9438c0bf264d"
  },
  {
    "_id": "5c9ccad4cb10fe87347c6afc",
    "date_added": "12-02-19 9:50",
    "name": "All-American",
    "unique_id": "5c9c9460e33c9438c0bf263c"
  },
  {
    "_id": "5c9ccad4cb10fe87347c6b02",
    "date_added": "18-02-19 9:50",
    "name": "Daktronics All-Sport 4000",
    "unique_id": "5c9c9460e33c9438c0bf2642"
  },
  {
    "_id": "5c9ccad4cb10fe87347c6b03",
    "date_added": "19-02-19 9:50",
    "name": "Daktronics All-Sport 5000",
    "unique_id": "5c9c9460e33c9438c0bf2643"
  },
  {
    "_id": "5c9ccad4cb10fe87347c6b15",
    "date_added": "09-03-19 9:50",
    "name": "scoreboard",
    "unique_id": "5c9c9460e33c9438c0bf2655"
  },
  {
    "_id": "5c9ccad4cb10fe87347c6b16",
    "date_added": "10-03-19 9:50",
    "name": "Scorevision",
    "unique_id": "5c9c9460e33c9438c0bf2656"
  },
  {
    "_id": "5c9ccad4cb10fe87347c6b04",
    "date_added": "20-02-19 9:50",
    "name": "Daktronics All-Sport 5100",
    "unique_id": "5c9c9460e33c9438c0bf2644"
  },
  {
    "_id": "5c9ccad4cb10fe87347c6b19",
    "date_added": "13-03-19 9:50",
    "name": "Varsity",
    "unique_id": "5c9c9460e33c9438c0bf2659"
  },
  {
    "_id": "5c9ccad4cb10fe87347c6aff",
    "date_added": "15-02-19 9:50",
    "name": "Daktronics All-Sport 1600",
    "unique_id": "5c9c9460e33c9438c0bf263f"
  },
  {
    "_id": "5c9ccad4cb10fe87347c6b0e",
    "date_added": "02-03-19 9:50",
    "name": "FairPlay MP80",
    "unique_id": "5c9c9460e33c9438c0bf264e"
  },
  {
    "_id": "5c9ccad4cb10fe87347c6b11",
    "date_added": "05-03-19 9:50",
    "name": "Nevco MPCW-6",
    "unique_id": "5c9c9460e33c9438c0bf2651"
  },
  {
    "_id": "5c9ccad4cb10fe87347c6b12",
    "date_added": "06-03-19 9:50",
    "name": "Nevco MPCW-7",
    "unique_id": "5c9c9460e33c9438c0bf2652"
  },
  {
    "_id": "5c9ccad4cb10fe87347c6b13",
    "date_added": "07-03-19 9:50",
    "name": "Nevco Other",
    "unique_id": "5c9c9460e33c9438c0bf2653"
  },
  {
    "_id": "5c9ccad4cb10fe87347c6b18",
    "date_added": "12-03-19 9:50",
    "name": "Sportable",
    "unique_id": "5c9c9460e33c9438c0bf2658"
  },
  {
    "_id": "5c9ccad4cb10fe87347c6afd",
    "date_added": "13-02-19 9:50",
    "name": "All-Star",
    "unique_id": "5c9c9460e33c9438c0bf263d"
  },
  {
    "_id": "5c9ccad4cb10fe87347c6afe",
    "date_added": "14-02-19 9:50",
    "name": "Colorado Time Systems",
    "unique_id": "5c9c9460e33c9438c0bf263e"
  },
  {
    "_id": "5c9ccad4cb10fe87347c6b00",
    "date_added": "16-02-19 9:50",
    "name": "Daktronics All-Sport 2510",
    "unique_id": "5c9c9460e33c9438c0bf2640"
  },
  {
    "_id": "5c9ccad4cb10fe87347c6b07",
    "date_added": "23-02-19 9:50",
    "name": "ElectroMech MM-Series",
    "unique_id": "5c9c9460e33c9438c0bf2647"
  },
  {
    "_id": "5c9ccad4cb10fe87347c6b0a",
    "date_added": "26-02-19 9:50",
    "name": "FairPlay MP50",
    "unique_id": "5c9c9460e33c9438c0bf264a"
  },
  {
    "_id": "5c9ccad4cb10fe87347c6b0f",
    "date_added": "03-03-19 9:50",
    "name": "FairPlay Other",
    "unique_id": "5c9c9460e33c9438c0bf264f"
  },
  {
    "_id": "5c9ccad4cb10fe87347c6b05",
    "date_added": "21-02-19 9:50",
    "name": "Daktronics All-Sport 5500",
    "unique_id": "5c9c9460e33c9438c0bf2645"
  },
  {
    "_id": "5c9ccad4cb10fe87347c6b17",
    "date_added": "11-03-19 9:50",
    "name": "Spectrum",
    "unique_id": "5c9c9460e33c9438c0bf2657"
  },
  {
    "_id": "5c9ccad4cb10fe87347c6b09",
    "date_added": "25-02-19 9:50",
    "name": "ElectroMech Other",
    "unique_id": "5c9c9460e33c9438c0bf2649"
  },
  {
    "_id": "5c9ccad4cb10fe87347c6b14",
    "date_added": "08-03-19 9:50",
    "name": "Other",
    "unique_id": "5c9c9460e33c9438c0bf2654"
  },
  {
    "_id": "5c9ccad4cb10fe87347c6b01",
    "date_added": "17-02-19 9:50",
    "name": "Daktronics All-Sport 3000",
    "unique_id": "5c9c9460e33c9438c0bf2641"
  },
  {
    "_id": "5c9ccad4cb10fe87347c6b08",
    "date_added": "24-02-19 9:50",
    "name": "ElectroMech MP-Series",
    "unique_id": "5c9c9460e33c9438c0bf2648"
  }
]
