<?xml version="1.0" encoding="UTF-8"?>
<svg width="17px" height="17px" viewBox="0 0 17 17" version="1.1" xmlns="http://www.w3.org/2000/svg" xmlns:xlink="http://www.w3.org/1999/xlink">
    <!-- Generator: Sketch 53.2 (72643) - https://sketchapp.com -->
    <title>standard/social/office-building</title>
    <desc>Created with Sketch.</desc>
    <defs>
        <path d="M16.6175361,16.625 C16.6230926,16.625 16.625,4.37070313 16.625,4.37070313 C16.625,4.37545067 9.63246392,4.375 9.63246392,4.375 C9.62690736,4.375 9.625,16.625 9.625,16.625 L16.6175361,16.625 Z M7.875,4.37070313 C7.875,3.40657791 8.66420656,2.625 9.63246392,2.625 L16.6175361,2.625 C17.5881566,2.625 18.375,3.40604495 18.375,4.37070313 L18.375,16.6292969 C18.375,17.5934221 17.5857934,18.375 16.6175361,18.375 L7.875,18.375 L7.875,4.37070313 Z M7,5.25 L4.38246392,5.25 C3.41420656,5.25 2.625,6.09192517 2.625,7.13049249 L2.625,16.4945075 C2.625,17.5340061 3.4118434,18.375 4.38246392,18.375 L9.18376804,18.375 L7,18.375 L7,16.4978206 C5.58595802,16.4968874 4.375,16.495731 4.375,16.4945075 C4.375,16.4945075 4.37900471,7.125 4.38246392,7.125 C4.38246392,7.125 5.58916331,7.12544046 7,7.1261662 L7,5.25 L7,5.25 Z M10.5,6.125 L12.25,6.125 L12.25,7.875 L10.5,7.875 L10.5,6.125 Z M5.25,8.75 L7,8.75 L7,10.5 L5.25,10.5 L5.25,8.75 Z M5.25,11.375 L7,11.375 L7,13.125 L5.25,13.125 L5.25,11.375 Z M10.5,8.75 L12.25,8.75 L12.25,10.5 L10.5,10.5 L10.5,8.75 Z M10.5,11.375 L12.25,11.375 L12.25,13.125 L10.5,13.125 L10.5,11.375 Z M12.25,14 L14,14 L14,16.625 L12.25,16.625 L12.25,14 Z M14,6.125 L15.75,6.125 L15.75,7.875 L14,7.875 L14,6.125 Z M14,8.75 L15.75,8.75 L15.75,10.5 L14,10.5 L14,8.75 Z M14,11.375 L15.75,11.375 L15.75,13.125 L14,13.125 L14,11.375 Z" id="path-1"></path>
    </defs>
    <g id="Page-1" stroke="none" stroke-width="1" fill="none" fill-rule="evenodd">
        <g id="standard/social/office-building" transform="translate(-2.000000, -2.000000)">
            <mask id="mask-2" fill="white">
                <use xlink:href="#path-1"></use>
            </mask>
            <use id="Rectangle-3" fill="#42526E" fill-rule="nonzero" xlink:href="#path-1"></use>
            <g id="Blue-/-B300" mask="url(#mask-2)" fill="#0065FF" fill-rule="evenodd">
                <rect id="B300" x="0" y="0" width="21" height="21"></rect>
            </g>
        </g>
    </g>
</svg>