<?xml version="1.0" encoding="UTF-8"?>
<svg width="18px" height="18px" viewBox="0 0 18 18" version="1.1" xmlns="http://www.w3.org/2000/svg" xmlns:xlink="http://www.w3.org/1999/xlink">
    <!-- Generator: Sketch 53.2 (72643) - https://sketchapp.com -->
    <title>menu_back</title>
    <desc>Created with Sketch.</desc>
    <g id="Page-1" stroke="none" stroke-width="1" fill="none" fill-rule="evenodd">
        <path d="M9,18 C4.02943725,18 0,13.9705627 0,9 C0,4.02943725 4.02943725,0 9,0 C13.9705627,0 18,4.02943725 18,9 C18,13.9705627 13.9705627,18 9,18 Z M7.10383051,8.18181818 L8.73373344,6.55191526 C9.08875552,6.19689317 9.08875552,5.62128865 8.73373344,5.26626656 C8.37871135,4.91124448 7.80310683,4.91124448 7.44808474,5.26626656 L4.26626656,8.44808474 C3.91124448,8.80310683 3.91124448,9.37871135 4.26626656,9.73373344 L7.44808474,12.9155516 C7.80310683,13.2705737 8.37871135,13.2705737 8.73373344,12.9155516 C9.08875552,12.5605295 9.08875552,11.984925 8.73373344,11.6299029 L7.10383051,10 L13.0909091,10 C13.5929861,10 14,9.59298614 14,9.09090909 C14,8.58883205 13.5929861,8.18181818 13.0909091,8.18181818 L7.10383051,8.18181818 Z" id="Combined-Shape" fill="#0352CC" fill-rule="nonzero"></path>
    </g>
</svg>