<?xml version="1.0" encoding="UTF-8"?>
<svg width="9px" height="14px" viewBox="0 0 9 14" version="1.1" xmlns="http://www.w3.org/2000/svg" xmlns:xlink="http://www.w3.org/1999/xlink">
    <!-- Generator: Sketch 53.2 (72643) - https://sketchapp.com -->
    <title>arrow_right</title>
    <desc>Created with Sketch.</desc>
    <g id="Page-1" stroke="none" stroke-width="1" fill="none" fill-rule="evenodd">
        <polygon id="Shape-Copy-4" fill="#5D5D5D" transform="translate(4.200000, 6.810811) rotate(-90.000000) translate(-4.200000, -6.810811) " points="9.42162162 2.61081081 4.2 7.83243243 -1.02162162 2.61081081 -2.61081081 4.2 4.2 11.0108108 11.0108108 4.2"></polygon>
    </g>
</svg>