%YAML 1.1
%TAG !u! tag:unity3d.com,2011:
--- !u!29 &1
OcclusionCullingSettings:
  m_ObjectHideFlags: 0
  serializedVersion: 2
  m_OcclusionBakeSettings:
    smallestOccluder: 5
    smallestHole: 0.25
    backfaceThreshold: 100
  m_SceneGUID: 00000000000000000000000000000000
  m_OcclusionCullingData: {fileID: 0}
--- !u!104 &2
RenderSettings:
  m_ObjectHideFlags: 0
  serializedVersion: 9
  m_Fog: 0
  m_FogColor: {r: 0.5, g: 0.5, b: 0.5, a: 1}
  m_FogMode: 3
  m_FogDensity: 0.01
  m_LinearFogStart: 0
  m_LinearFogEnd: 300
  m_AmbientSkyColor: {r: 0.212, g: 0.227, b: 0.259, a: 1}
  m_AmbientEquatorColor: {r: 0.114, g: 0.125, b: 0.133, a: 1}
  m_AmbientGroundColor: {r: 0.047, g: 0.043, b: 0.035, a: 1}
  m_AmbientIntensity: 1
  m_AmbientMode: 0
  m_SubtractiveShadowColor: {r: 0.42, g: 0.478, b: 0.627, a: 1}
  m_SkyboxMaterial: {fileID: 10304, guid: 0000000000000000f000000000000000, type: 0}
  m_HaloStrength: 0.5
  m_FlareStrength: 1
  m_FlareFadeSpeed: 3
  m_HaloTexture: {fileID: 0}
  m_SpotCookie: {fileID: 10001, guid: 0000000000000000e000000000000000, type: 0}
  m_DefaultReflectionMode: 0
  m_DefaultReflectionResolution: 128
  m_ReflectionBounces: 1
  m_ReflectionIntensity: 1
  m_CustomReflection: {fileID: 0}
  m_Sun: {fileID: 0}
  m_IndirectSpecularColor: {r: 0.44657856, g: 0.49641234, b: 0.57481724, a: 1}
  m_UseRadianceAmbientProbe: 0
--- !u!157 &3
LightmapSettings:
  m_ObjectHideFlags: 0
  serializedVersion: 11
  m_GIWorkflowMode: 0
  m_GISettings:
    serializedVersion: 2
    m_BounceScale: 1
    m_IndirectOutputScale: 1
    m_AlbedoBoost: 1
    m_EnvironmentLightingMode: 0
    m_EnableBakedLightmaps: 1
    m_EnableRealtimeLightmaps: 1
  m_LightmapEditorSettings:
    serializedVersion: 10
    m_Resolution: 2
    m_BakeResolution: 40
    m_AtlasSize: 1024
    m_AO: 0
    m_AOMaxDistance: 1
    m_CompAOExponent: 1
    m_CompAOExponentDirect: 0
    m_Padding: 2
    m_LightmapParameters: {fileID: 0}
    m_LightmapsBakeMode: 1
    m_TextureCompression: 1
    m_FinalGather: 0
    m_FinalGatherFiltering: 1
    m_FinalGatherRayCount: 256
    m_ReflectionCompression: 2
    m_MixedBakeMode: 2
    m_BakeBackend: 1
    m_PVRSampling: 1
    m_PVRDirectSampleCount: 32
    m_PVRSampleCount: 500
    m_PVRBounces: 2
    m_PVRFilterTypeDirect: 0
    m_PVRFilterTypeIndirect: 0
    m_PVRFilterTypeAO: 0
    m_PVRFilteringMode: 1
    m_PVRCulling: 1
    m_PVRFilteringGaussRadiusDirect: 1
    m_PVRFilteringGaussRadiusIndirect: 5
    m_PVRFilteringGaussRadiusAO: 2
    m_PVRFilteringAtrousPositionSigmaDirect: 0.5
    m_PVRFilteringAtrousPositionSigmaIndirect: 2
    m_PVRFilteringAtrousPositionSigmaAO: 1
    m_ShowResolutionOverlay: 1
  m_LightingDataAsset: {fileID: 0}
  m_UseShadowmask: 1
--- !u!196 &4
NavMeshSettings:
  serializedVersion: 2
  m_ObjectHideFlags: 0
  m_BuildSettings:
    serializedVersion: 2
    agentTypeID: 0
    agentRadius: 0.5
    agentHeight: 2
    agentSlope: 45
    agentClimb: 0.4
    ledgeDropHeight: 0
    maxJumpAcrossDistance: 0
    minRegionArea: 2
    manualCellSize: 0
    cellSize: 0.16666667
    manualTileSize: 0
    tileSize: 256
    accuratePlacement: 0
    debug:
      m_Flags: 0
  m_NavMeshData: {fileID: 0}
--- !u!20 &145767011 stripped
Camera:
  m_CorrespondingSourceObject: {fileID: 3088300322429301812, guid: e4f3fc4f9d26f4e5fa1dbbe3f586c514,
    type: 3}
  m_PrefabInstance: {fileID: 391860220}
  m_PrefabAsset: {fileID: 0}
--- !u!1001 &391860220
PrefabInstance:
  m_ObjectHideFlags: 0
  serializedVersion: 2
  m_Modification:
    m_TransformParent: {fileID: 0}
    m_Modifications:
    - target: {fileID: 3088300322429301813, guid: e4f3fc4f9d26f4e5fa1dbbe3f586c514,
        type: 3}
      propertyPath: m_Name
      value: Right Camera
      objectReference: {fileID: 0}
    - target: {fileID: 3088300322429301812, guid: e4f3fc4f9d26f4e5fa1dbbe3f586c514,
        type: 3}
      propertyPath: m_NormalizedViewPortRect.x
      value: 0
      objectReference: {fileID: 0}
    - target: {fileID: 3088300322429301812, guid: e4f3fc4f9d26f4e5fa1dbbe3f586c514,
        type: 3}
      propertyPath: m_NormalizedViewPortRect.width
      value: 1
      objectReference: {fileID: 0}
    - target: {fileID: 3088300322429301812, guid: e4f3fc4f9d26f4e5fa1dbbe3f586c514,
        type: 3}
      propertyPath: m_NormalizedViewPortRect.height
      value: 0.5
      objectReference: {fileID: 0}
    - target: {fileID: 3088300322429301812, guid: e4f3fc4f9d26f4e5fa1dbbe3f586c514,
        type: 3}
      propertyPath: m_ClearFlags
      value: 2
      objectReference: {fileID: 0}
    - target: {fileID: 3088300322429301812, guid: e4f3fc4f9d26f4e5fa1dbbe3f586c514,
        type: 3}
      propertyPath: m_BackGroundColor.r
      value: 0
      objectReference: {fileID: 0}
    - target: {fileID: 3088300322429301812, guid: e4f3fc4f9d26f4e5fa1dbbe3f586c514,
        type: 3}
      propertyPath: m_BackGroundColor.g
      value: 0
      objectReference: {fileID: 0}
    - target: {fileID: 3088300322429301812, guid: e4f3fc4f9d26f4e5fa1dbbe3f586c514,
        type: 3}
      propertyPath: m_BackGroundColor.b
      value: 0
      objectReference: {fileID: 0}
    - target: {fileID: 3088300322429301812, guid: e4f3fc4f9d26f4e5fa1dbbe3f586c514,
        type: 3}
      propertyPath: field of view
      value: 69
      objectReference: {fileID: 0}
    - target: {fileID: 3088300322429301814, guid: e4f3fc4f9d26f4e5fa1dbbe3f586c514,
        type: 3}
      propertyPath: m_LocalPosition.x
      value: -1.65
      objectReference: {fileID: 0}
    - target: {fileID: 3088300322429301814, guid: e4f3fc4f9d26f4e5fa1dbbe3f586c514,
        type: 3}
      propertyPath: m_LocalPosition.y
      value: 1
      objectReference: {fileID: 0}
    - target: {fileID: 3088300322429301814, guid: e4f3fc4f9d26f4e5fa1dbbe3f586c514,
        type: 3}
      propertyPath: m_LocalPosition.z
      value: 0.59
      objectReference: {fileID: 0}
    - target: {fileID: 3088300322429301814, guid: e4f3fc4f9d26f4e5fa1dbbe3f586c514,
        type: 3}
      propertyPath: m_LocalRotation.x
      value: -0
      objectReference: {fileID: 0}
    - target: {fileID: 3088300322429301814, guid: e4f3fc4f9d26f4e5fa1dbbe3f586c514,
        type: 3}
      propertyPath: m_LocalRotation.y
      value: 0.17633909
      objectReference: {fileID: 0}
    - target: {fileID: 3088300322429301814, guid: e4f3fc4f9d26f4e5fa1dbbe3f586c514,
        type: 3}
      propertyPath: m_LocalRotation.z
      value: -0
      objectReference: {fileID: 0}
    - target: {fileID: 3088300322429301814, guid: e4f3fc4f9d26f4e5fa1dbbe3f586c514,
        type: 3}
      propertyPath: m_LocalRotation.w
      value: 0.98432946
      objectReference: {fileID: 0}
    - target: {fileID: 3088300322429301814, guid: e4f3fc4f9d26f4e5fa1dbbe3f586c514,
        type: 3}
      propertyPath: m_RootOrder
      value: 3
      objectReference: {fileID: 0}
    - target: {fileID: 3088300322429301814, guid: e4f3fc4f9d26f4e5fa1dbbe3f586c514,
        type: 3}
      propertyPath: m_LocalEulerAnglesHint.x
      value: 0
      objectReference: {fileID: 0}
    - target: {fileID: 3088300322429301814, guid: e4f3fc4f9d26f4e5fa1dbbe3f586c514,
        type: 3}
      propertyPath: m_LocalEulerAnglesHint.y
      value: 20.313002
      objectReference: {fileID: 0}
    - target: {fileID: 3088300322429301814, guid: e4f3fc4f9d26f4e5fa1dbbe3f586c514,
        type: 3}
      propertyPath: m_LocalEulerAnglesHint.z
      value: 0
      objectReference: {fileID: 0}
    m_RemovedComponents: []
  m_SourcePrefab: {fileID: 100100000, guid: e4f3fc4f9d26f4e5fa1dbbe3f586c514, type: 3}
--- !u!20 &517780691 stripped
Camera:
  m_CorrespondingSourceObject: {fileID: 1006722095457574617, guid: df8c23499ab3c449fa42be30f09bbf0d,
    type: 3}
  m_PrefabInstance: {fileID: 1574644482}
  m_PrefabAsset: {fileID: 0}
--- !u!1 &919982717
GameObject:
  m_ObjectHideFlags: 0
  m_CorrespondingSourceObject: {fileID: 0}
  m_PrefabInstance: {fileID: 0}
  m_PrefabAsset: {fileID: 0}
  serializedVersion: 6
  m_Component:
  - component: {fileID: 919982719}
  - component: {fileID: 919982718}
  m_Layer: 0
  m_Name: Directional Light
  m_TagString: Untagged
  m_Icon: {fileID: 0}
  m_NavMeshLayer: 0
  m_StaticEditorFlags: 0
  m_IsActive: 1
--- !u!108 &919982718
Light:
  m_ObjectHideFlags: 0
  m_CorrespondingSourceObject: {fileID: 0}
  m_PrefabInstance: {fileID: 0}
  m_PrefabAsset: {fileID: 0}
  m_GameObject: {fileID: 919982717}
  m_Enabled: 1
  serializedVersion: 8
  m_Type: 1
  m_Color: {r: 1, g: 0.95686275, b: 0.8392157, a: 1}
  m_Intensity: 1
  m_Range: 10
  m_SpotAngle: 30
  m_CookieSize: 10
  m_Shadows:
    m_Type: 2
    m_Resolution: -1
    m_CustomResolution: -1
    m_Strength: 1
    m_Bias: 0.05
    m_NormalBias: 0.4
    m_NearPlane: 0.2
  m_Cookie: {fileID: 0}
  m_DrawHalo: 0
  m_Flare: {fileID: 0}
  m_RenderMode: 0
  m_CullingMask:
    serializedVersion: 2
    m_Bits: 4294967295
  m_Lightmapping: 4
  m_LightShadowCasterMode: 0
  m_AreaSize: {x: 1, y: 1}
  m_BounceIntensity: 1
  m_ColorTemperature: 6570
  m_UseColorTemperature: 0
  m_ShadowRadius: 0
  m_ShadowAngle: 0
--- !u!4 &919982719
Transform:
  m_ObjectHideFlags: 0
  m_CorrespondingSourceObject: {fileID: 0}
  m_PrefabInstance: {fileID: 0}
  m_PrefabAsset: {fileID: 0}
  m_GameObject: {fileID: 919982717}
  m_LocalRotation: {x: 0.40821788, y: -0.23456968, z: 0.10938163, w: 0.8754261}
  m_LocalPosition: {x: 0, y: 3, z: 0}
  m_LocalScale: {x: 1, y: 1, z: 1}
  m_Children: []
  m_Father: {fileID: 0}
  m_RootOrder: 0
  m_LocalEulerAnglesHint: {x: 50, y: -30, z: 0}
--- !u!1 &1027909721
GameObject:
  m_ObjectHideFlags: 0
  m_CorrespondingSourceObject: {fileID: 0}
  m_PrefabInstance: {fileID: 0}
  m_PrefabAsset: {fileID: 0}
  serializedVersion: 6
  m_Component:
  - component: {fileID: 1027909725}
  - component: {fileID: 1027909724}
  - component: {fileID: 1027909723}
  - component: {fileID: 1027909722}
  m_Layer: 0
  m_Name: Plane
  m_TagString: Untagged
  m_Icon: {fileID: 0}
  m_NavMeshLayer: 0
  m_StaticEditorFlags: 0
  m_IsActive: 1
--- !u!64 &1027909722
MeshCollider:
  m_ObjectHideFlags: 0
  m_CorrespondingSourceObject: {fileID: 0}
  m_PrefabInstance: {fileID: 0}
  m_PrefabAsset: {fileID: 0}
  m_GameObject: {fileID: 1027909721}
  m_Material: {fileID: 0}
  m_IsTrigger: 0
  m_Enabled: 1
  serializedVersion: 3
  m_Convex: 0
  m_CookingOptions: 14
  m_Mesh: {fileID: 10209, guid: 0000000000000000e000000000000000, type: 0}
--- !u!23 &1027909723
MeshRenderer:
  m_ObjectHideFlags: 0
  m_CorrespondingSourceObject: {fileID: 0}
  m_PrefabInstance: {fileID: 0}
  m_PrefabAsset: {fileID: 0}
  m_GameObject: {fileID: 1027909721}
  m_Enabled: 1
  m_CastShadows: 1
  m_ReceiveShadows: 1
  m_DynamicOccludee: 1
  m_MotionVectors: 1
  m_LightProbeUsage: 1
  m_ReflectionProbeUsage: 1
  m_RenderingLayerMask: 1
  m_RendererPriority: 0
  m_Materials:
  - {fileID: 2100000, guid: a5a258d43783b44cf9d37cf675dd1f46, type: 2}
  m_StaticBatchInfo:
    firstSubMesh: 0
    subMeshCount: 0
  m_StaticBatchRoot: {fileID: 0}
  m_ProbeAnchor: {fileID: 0}
  m_LightProbeVolumeOverride: {fileID: 0}
  m_ScaleInLightmap: 1
  m_PreserveUVs: 0
  m_IgnoreNormalsForChartDetection: 0
  m_ImportantGI: 0
  m_StitchLightmapSeams: 0
  m_SelectedEditorRenderState: 3
  m_MinimumChartSize: 4
  m_AutoUVMaxDistance: 0.5
  m_AutoUVMaxAngle: 89
  m_LightmapParameters: {fileID: 0}
  m_SortingLayerID: 0
  m_SortingLayer: 0
  m_SortingOrder: 0
--- !u!33 &1027909724
MeshFilter:
  m_ObjectHideFlags: 0
  m_CorrespondingSourceObject: {fileID: 0}
  m_PrefabInstance: {fileID: 0}
  m_PrefabAsset: {fileID: 0}
  m_GameObject: {fileID: 1027909721}
  m_Mesh: {fileID: 10209, guid: 0000000000000000e000000000000000, type: 0}
--- !u!4 &1027909725
Transform:
  m_ObjectHideFlags: 0
  m_CorrespondingSourceObject: {fileID: 0}
  m_PrefabInstance: {fileID: 0}
  m_PrefabAsset: {fileID: 0}
  m_GameObject: {fileID: 1027909721}
  m_LocalRotation: {x: 0, y: 0, z: 0, w: 1}
  m_LocalPosition: {x: 2.32, y: 0, z: -3.99}
  m_LocalScale: {x: 10, y: 10, z: 10}
  m_Children: []
  m_Father: {fileID: 0}
  m_RootOrder: 4
  m_LocalEulerAnglesHint: {x: 0, y: 0, z: 0}
--- !u!1 &1179646718
GameObject:
  m_ObjectHideFlags: 0
  m_CorrespondingSourceObject: {fileID: 0}
  m_PrefabInstance: {fileID: 0}
  m_PrefabAsset: {fileID: 0}
  serializedVersion: 6
  m_Component:
  - component: {fileID: 1179646721}
  - component: {fileID: 1179646720}
  - component: {fileID: 1179646719}
  m_Layer: 0
  m_Name: EventSystem
  m_TagString: Untagged
  m_Icon: {fileID: 0}
  m_NavMeshLayer: 0
  m_StaticEditorFlags: 0
  m_IsActive: 0
--- !u!114 &1179646719
MonoBehaviour:
  m_ObjectHideFlags: 0
  m_CorrespondingSourceObject: {fileID: 0}
  m_PrefabInstance: {fileID: 0}
  m_PrefabAsset: {fileID: 0}
  m_GameObject: {fileID: 1179646718}
  m_Enabled: 1
  m_EditorHideFlags: 0
  m_Script: {fileID: 1077351063, guid: f70555f144d8491a825f0804e09c671c, type: 3}
  m_Name: 
  m_EditorClassIdentifier: 
  m_HorizontalAxis: Horizontal
  m_VerticalAxis: Vertical
  m_SubmitButton: Submit
  m_CancelButton: Cancel
  m_InputActionsPerSecond: 10
  m_RepeatDelay: 0.5
  m_ForceModuleActive: 0
--- !u!114 &1179646720
MonoBehaviour:
  m_ObjectHideFlags: 0
  m_CorrespondingSourceObject: {fileID: 0}
  m_PrefabInstance: {fileID: 0}
  m_PrefabAsset: {fileID: 0}
  m_GameObject: {fileID: 1179646718}
  m_Enabled: 1
  m_EditorHideFlags: 0
  m_Script: {fileID: -619905303, guid: f70555f144d8491a825f0804e09c671c, type: 3}
  m_Name: 
  m_EditorClassIdentifier: 
  m_FirstSelected: {fileID: 0}
  m_sendNavigationEvents: 1
  m_DragThreshold: 10
--- !u!4 &1179646721
Transform:
  m_ObjectHideFlags: 0
  m_CorrespondingSourceObject: {fileID: 0}
  m_PrefabInstance: {fileID: 0}
  m_PrefabAsset: {fileID: 0}
  m_GameObject: {fileID: 1179646718}
  m_LocalRotation: {x: -0, y: -0, z: -0, w: 1}
  m_LocalPosition: {x: 0, y: 0, z: 0}
  m_LocalScale: {x: 1, y: 1, z: 1}
  m_Children: []
  m_Father: {fileID: 0}
  m_RootOrder: 5
  m_LocalEulerAnglesHint: {x: 0, y: 0, z: 0}
--- !u!1001 &1574644482
PrefabInstance:
  m_ObjectHideFlags: 0
  serializedVersion: 2
  m_Modification:
    m_TransformParent: {fileID: 0}
    m_Modifications:
    - target: {fileID: 1006722095457574616, guid: df8c23499ab3c449fa42be30f09bbf0d,
        type: 3}
      propertyPath: m_Name
      value: Left Camera
      objectReference: {fileID: 0}
    - target: {fileID: 1006722095457574617, guid: df8c23499ab3c449fa42be30f09bbf0d,
        type: 3}
      propertyPath: m_ClearFlags
      value: 2
      objectReference: {fileID: 0}
    - target: {fileID: 1006722095457574617, guid: df8c23499ab3c449fa42be30f09bbf0d,
        type: 3}
      propertyPath: m_BackGroundColor.r
      value: 0
      objectReference: {fileID: 0}
    - target: {fileID: 1006722095457574617, guid: df8c23499ab3c449fa42be30f09bbf0d,
        type: 3}
      propertyPath: m_BackGroundColor.g
      value: 0
      objectReference: {fileID: 0}
    - target: {fileID: 1006722095457574617, guid: df8c23499ab3c449fa42be30f09bbf0d,
        type: 3}
      propertyPath: m_BackGroundColor.b
      value: 0
      objectReference: {fileID: 0}
    - target: {fileID: 1006722095457574617, guid: df8c23499ab3c449fa42be30f09bbf0d,
        type: 3}
      propertyPath: m_NormalizedViewPortRect.x
      value: 0
      objectReference: {fileID: 0}
    - target: {fileID: 1006722095457574619, guid: df8c23499ab3c449fa42be30f09bbf0d,
        type: 3}
      propertyPath: m_LocalPosition.x
      value: 2.32
      objectReference: {fileID: 0}
    - target: {fileID: 1006722095457574619, guid: df8c23499ab3c449fa42be30f09bbf0d,
        type: 3}
      propertyPath: m_LocalPosition.y
      value: 1
      objectReference: {fileID: 0}
    - target: {fileID: 1006722095457574619, guid: df8c23499ab3c449fa42be30f09bbf0d,
        type: 3}
      propertyPath: m_LocalPosition.z
      value: -3.99
      objectReference: {fileID: 0}
    - target: {fileID: 1006722095457574619, guid: df8c23499ab3c449fa42be30f09bbf0d,
        type: 3}
      propertyPath: m_LocalRotation.x
      value: -0
      objectReference: {fileID: 0}
    - target: {fileID: 1006722095457574619, guid: df8c23499ab3c449fa42be30f09bbf0d,
        type: 3}
      propertyPath: m_LocalRotation.y
      value: -0.2583222
      objectReference: {fileID: 0}
    - target: {fileID: 1006722095457574619, guid: df8c23499ab3c449fa42be30f09bbf0d,
        type: 3}
      propertyPath: m_LocalRotation.z
      value: -0
      objectReference: {fileID: 0}
    - target: {fileID: 1006722095457574619, guid: df8c23499ab3c449fa42be30f09bbf0d,
        type: 3}
      propertyPath: m_LocalRotation.w
      value: 0.9660589
      objectReference: {fileID: 0}
    - target: {fileID: 1006722095457574619, guid: df8c23499ab3c449fa42be30f09bbf0d,
        type: 3}
      propertyPath: m_RootOrder
      value: 2
      objectReference: {fileID: 0}
    - target: {fileID: 1006722095457574619, guid: df8c23499ab3c449fa42be30f09bbf0d,
        type: 3}
      propertyPath: m_LocalEulerAnglesHint.x
      value: 0
      objectReference: {fileID: 0}
    - target: {fileID: 1006722095457574619, guid: df8c23499ab3c449fa42be30f09bbf0d,
        type: 3}
      propertyPath: m_LocalEulerAnglesHint.y
      value: -29.941002
      objectReference: {fileID: 0}
    - target: {fileID: 1006722095457574619, guid: df8c23499ab3c449fa42be30f09bbf0d,
        type: 3}
      propertyPath: m_LocalEulerAnglesHint.z
      value: 0
      objectReference: {fileID: 0}
    - target: {fileID: 1006722095457574614, guid: df8c23499ab3c449fa42be30f09bbf0d,
        type: 3}
      propertyPath: m_Enabled
      value: 0
      objectReference: {fileID: 0}
    - target: {fileID: 1006722095457574612, guid: df8c23499ab3c449fa42be30f09bbf0d,
        type: 3}
      propertyPath: m_Enabled
      value: 0
      objectReference: {fileID: 0}
    - target: {fileID: 1006722094357719021, guid: df8c23499ab3c449fa42be30f09bbf0d,
        type: 3}
      propertyPath: m_IsActive
      value: 0
      objectReference: {fileID: 0}
    m_RemovedComponents: []
  m_SourcePrefab: {fileID: 100100000, guid: df8c23499ab3c449fa42be30f09bbf0d, type: 3}
--- !u!1001 &1902630257
PrefabInstance:
  m_ObjectHideFlags: 0
  serializedVersion: 2
  m_Modification:
    m_TransformParent: {fileID: 0}
    m_Modifications:
    - target: {fileID: 3506059913345060030, guid: b7b5ac023d1974d2b9d6a1b7583f119b,
        type: 3}
      propertyPath: playerHolyWater.Array.size
      value: 2
      objectReference: {fileID: 0}
    - target: {fileID: 3506059913345060030, guid: b7b5ac023d1974d2b9d6a1b7583f119b,
        type: 3}
      propertyPath: playerScore.Array.size
      value: 2
      objectReference: {fileID: 0}
    - target: {fileID: 3506059913345060030, guid: b7b5ac023d1974d2b9d6a1b7583f119b,
        type: 3}
      propertyPath: playerHealth.Array.data[0]
      value: 
      objectReference: {fileID: 4398247302603073416}
    - target: {fileID: 3506059913345060030, guid: b7b5ac023d1974d2b9d6a1b7583f119b,
        type: 3}
      propertyPath: playerHealth.Array.data[1]
      value: 
      objectReference: {fileID: 4398247300898467343}
    - target: {fileID: 3506059913345060030, guid: b7b5ac023d1974d2b9d6a1b7583f119b,
        type: 3}
      propertyPath: playerHolyWater.Array.data[0]
      value: 
      objectReference: {fileID: 4857568945217500661}
    - target: {fileID: 3506059913345060030, guid: b7b5ac023d1974d2b9d6a1b7583f119b,
        type: 3}
      propertyPath: playerHolyWater.Array.data[1]
      value: 
      objectReference: {fileID: 4398247301214768842}
    - target: {fileID: 3506059913345060030, guid: b7b5ac023d1974d2b9d6a1b7583f119b,
        type: 3}
      propertyPath: playerScore.Array.data[0]
      value: 
      objectReference: {fileID: 1963053047685704664}
    - target: {fileID: 3506059913345060030, guid: b7b5ac023d1974d2b9d6a1b7583f119b,
        type: 3}
      propertyPath: playerScore.Array.data[1]
      value: 
      objectReference: {fileID: 9143274200084467904}
    - target: {fileID: 3506059913345060030, guid: b7b5ac023d1974d2b9d6a1b7583f119b,
        type: 3}
      propertyPath: CurrentTime
      value: 
      objectReference: {fileID: 7665712160199505935}
    - target: {fileID: 3506059913345060030, guid: b7b5ac023d1974d2b9d6a1b7583f119b,
        type: 3}
      propertyPath: currentTime
      value: 
      objectReference: {fileID: 7665712160199505935}
    - target: {fileID: 6311222100997071621, guid: b7b5ac023d1974d2b9d6a1b7583f119b,
        type: 3}
      propertyPath: m_Name
      value: Managers
      objectReference: {fileID: 0}
    - target: {fileID: 6311222100997071619, guid: b7b5ac023d1974d2b9d6a1b7583f119b,
        type: 3}
      propertyPath: m_LocalPosition.x
      value: -1.65
      objectReference: {fileID: 0}
    - target: {fileID: 6311222100997071619, guid: b7b5ac023d1974d2b9d6a1b7583f119b,
        type: 3}
      propertyPath: m_LocalPosition.y
      value: 0.75
      objectReference: {fileID: 0}
    - target: {fileID: 6311222100997071619, guid: b7b5ac023d1974d2b9d6a1b7583f119b,
        type: 3}
      propertyPath: m_LocalPosition.z
      value: 0.5899999
      objectReference: {fileID: 0}
    - target: {fileID: 6311222100997071619, guid: b7b5ac023d1974d2b9d6a1b7583f119b,
        type: 3}
      propertyPath: m_LocalRotation.x
      value: 0
      objectReference: {fileID: 0}
    - target: {fileID: 6311222100997071619, guid: b7b5ac023d1974d2b9d6a1b7583f119b,
        type: 3}
      propertyPath: m_LocalRotation.y
      value: 0
      objectReference: {fileID: 0}
    - target: {fileID: 6311222100997071619, guid: b7b5ac023d1974d2b9d6a1b7583f119b,
        type: 3}
      propertyPath: m_LocalRotation.z
      value: 0
      objectReference: {fileID: 0}
    - target: {fileID: 6311222100997071619, guid: b7b5ac023d1974d2b9d6a1b7583f119b,
        type: 3}
      propertyPath: m_LocalRotation.w
      value: 1
      objectReference: {fileID: 0}
    - target: {fileID: 6311222100997071619, guid: b7b5ac023d1974d2b9d6a1b7583f119b,
        type: 3}
      propertyPath: m_RootOrder
      value: 1
      objectReference: {fileID: 0}
    - target: {fileID: 6311222100997071619, guid: b7b5ac023d1974d2b9d6a1b7583f119b,
        type: 3}
      propertyPath: m_LocalEulerAnglesHint.x
      value: 0
      objectReference: {fileID: 0}
    - target: {fileID: 6311222100997071619, guid: b7b5ac023d1974d2b9d6a1b7583f119b,
        type: 3}
      propertyPath: m_LocalEulerAnglesHint.y
      value: 0
      objectReference: {fileID: 0}
    - target: {fileID: 6311222100997071619, guid: b7b5ac023d1974d2b9d6a1b7583f119b,
        type: 3}
      propertyPath: m_LocalEulerAnglesHint.z
      value: 0
      objectReference: {fileID: 0}
    - target: {fileID: 6311222100997071618, guid: b7b5ac023d1974d2b9d6a1b7583f119b,
        type: 3}
      propertyPath: horizontalView
      value: 1
      objectReference: {fileID: 0}
    - target: {fileID: 6311222100997071618, guid: b7b5ac023d1974d2b9d6a1b7583f119b,
        type: 3}
      propertyPath: cameraArray.Array.data[0]
      value: 
      objectReference: {fileID: 517780691}
    - target: {fileID: 6311222100997071618, guid: b7b5ac023d1974d2b9d6a1b7583f119b,
        type: 3}
      propertyPath: cameraArray.Array.data[1]
      value: 
      objectReference: {fileID: 145767011}
    m_RemovedComponents: []
  m_SourcePrefab: {fileID: 100100000, guid: b7b5ac023d1974d2b9d6a1b7583f119b, type: 3}
--- !u!1 &1963053047685704664 stripped
GameObject:
  m_CorrespondingSourceObject: {fileID: 540135135749591241, guid: 2e17cc19b956a4a7a89a13be858da31b,
    type: 3}
  m_PrefabInstance: {fileID: 2035864886046767889}
  m_PrefabAsset: {fileID: 0}
--- !u!1001 &2035864886046767889
PrefabInstance:
  m_ObjectHideFlags: 0
  serializedVersion: 2
  m_Modification:
    m_TransformParent: {fileID: 0}
    m_Modifications:
    - target: {fileID: 3442182750427587788, guid: 2e17cc19b956a4a7a89a13be858da31b,
        type: 3}
      propertyPath: m_havePropertiesChanged
      value: 1
      objectReference: {fileID: 0}
    - target: {fileID: 3442182750427587788, guid: 2e17cc19b956a4a7a89a13be858da31b,
        type: 3}
      propertyPath: m_isInputParsingRequired
      value: 1
      objectReference: {fileID: 0}
    - target: {fileID: 4398247301907404137, guid: 2e17cc19b956a4a7a89a13be858da31b,
        type: 3}
      propertyPath: m_Name
      value: Canvas Wrapper
      objectReference: {fileID: 0}
    - target: {fileID: 4398247301907404138, guid: 2e17cc19b956a4a7a89a13be858da31b,
        type: 3}
      propertyPath: m_LocalPosition.x
      value: 0
      objectReference: {fileID: 0}
    - target: {fileID: 4398247301907404138, guid: 2e17cc19b956a4a7a89a13be858da31b,
        type: 3}
      propertyPath: m_LocalPosition.y
      value: 0
      objectReference: {fileID: 0}
    - target: {fileID: 4398247301907404138, guid: 2e17cc19b956a4a7a89a13be858da31b,
        type: 3}
      propertyPath: m_LocalPosition.z
      value: 0
      objectReference: {fileID: 0}
    - target: {fileID: 4398247301907404138, guid: 2e17cc19b956a4a7a89a13be858da31b,
        type: 3}
      propertyPath: m_LocalRotation.x
      value: 0
      objectReference: {fileID: 0}
    - target: {fileID: 4398247301907404138, guid: 2e17cc19b956a4a7a89a13be858da31b,
        type: 3}
      propertyPath: m_LocalRotation.y
      value: 0
      objectReference: {fileID: 0}
    - target: {fileID: 4398247301907404138, guid: 2e17cc19b956a4a7a89a13be858da31b,
        type: 3}
      propertyPath: m_LocalRotation.z
      value: 0
      objectReference: {fileID: 0}
    - target: {fileID: 4398247301907404138, guid: 2e17cc19b956a4a7a89a13be858da31b,
        type: 3}
      propertyPath: m_LocalRotation.w
      value: 1
      objectReference: {fileID: 0}
    - target: {fileID: 4398247301907404138, guid: 2e17cc19b956a4a7a89a13be858da31b,
        type: 3}
      propertyPath: m_RootOrder
      value: 6
      objectReference: {fileID: 0}
    - target: {fileID: 4398247301907404138, guid: 2e17cc19b956a4a7a89a13be858da31b,
        type: 3}
      propertyPath: m_LocalEulerAnglesHint.x
      value: 0
      objectReference: {fileID: 0}
    - target: {fileID: 4398247301907404138, guid: 2e17cc19b956a4a7a89a13be858da31b,
        type: 3}
      propertyPath: m_LocalEulerAnglesHint.y
      value: 0
      objectReference: {fileID: 0}
    - target: {fileID: 4398247301907404138, guid: 2e17cc19b956a4a7a89a13be858da31b,
        type: 3}
      propertyPath: m_LocalEulerAnglesHint.z
      value: 0
      objectReference: {fileID: 0}
    - target: {fileID: 4398247302468049639, guid: 2e17cc19b956a4a7a89a13be858da31b,
        type: 3}
      propertyPath: m_Camera
      value: 
      objectReference: {fileID: 517780691}
    - target: {fileID: 4398247301002233170, guid: 2e17cc19b956a4a7a89a13be858da31b,
        type: 3}
      propertyPath: m_Camera
      value: 
      objectReference: {fileID: 145767011}
    - target: {fileID: 3712600700828279720, guid: 2e17cc19b956a4a7a89a13be858da31b,
        type: 3}
      propertyPath: m_havePropertiesChanged
      value: 1
      objectReference: {fileID: 0}
    - target: {fileID: 3712600700828279720, guid: 2e17cc19b956a4a7a89a13be858da31b,
        type: 3}
      propertyPath: m_isInputParsingRequired
      value: 1
      objectReference: {fileID: 0}
    - target: {fileID: 2398570106719147296, guid: 2e17cc19b956a4a7a89a13be858da31b,
        type: 3}
      propertyPath: m_havePropertiesChanged
      value: 1
      objectReference: {fileID: 0}
    - target: {fileID: 2398570106719147296, guid: 2e17cc19b956a4a7a89a13be858da31b,
        type: 3}
      propertyPath: m_isInputParsingRequired
      value: 1
      objectReference: {fileID: 0}
    - target: {fileID: 3148586044551830843, guid: 2e17cc19b956a4a7a89a13be858da31b,
        type: 3}
      propertyPath: m_havePropertiesChanged
      value: 1
      objectReference: {fileID: 0}
    - target: {fileID: 3148586044551830843, guid: 2e17cc19b956a4a7a89a13be858da31b,
        type: 3}
      propertyPath: m_isInputParsingRequired
      value: 1
      objectReference: {fileID: 0}
    - target: {fileID: 671433237122063737, guid: 2e17cc19b956a4a7a89a13be858da31b,
        type: 3}
      propertyPath: m_havePropertiesChanged
      value: 1
      objectReference: {fileID: 0}
    - target: {fileID: 671433237122063737, guid: 2e17cc19b956a4a7a89a13be858da31b,
        type: 3}
      propertyPath: m_isInputParsingRequired
      value: 1
      objectReference: {fileID: 0}
    m_RemovedComponents: []
  m_SourcePrefab: {fileID: 100100000, guid: 2e17cc19b956a4a7a89a13be858da31b, type: 3}
--- !u!1 &4398247300898467343 stripped
GameObject:
  m_CorrespondingSourceObject: {fileID: 2398570106719147294, guid: 2e17cc19b956a4a7a89a13be858da31b,
    type: 3}
  m_PrefabInstance: {fileID: 2035864886046767889}
  m_PrefabAsset: {fileID: 0}
--- !u!1 &4398247301214768842 stripped
GameObject:
  m_CorrespondingSourceObject: {fileID: 2398570106934801883, guid: 2e17cc19b956a4a7a89a13be858da31b,
    type: 3}
  m_PrefabInstance: {fileID: 2035864886046767889}
  m_PrefabAsset: {fileID: 0}
--- !u!1 &4398247302603073416 stripped
GameObject:
  m_CorrespondingSourceObject: {fileID: 1963053048372991917, guid: 2e17cc19b956a4a7a89a13be858da31b,
    type: 3}
  m_PrefabInstance: {fileID: 2035864886046767889}
  m_PrefabAsset: {fileID: 0}
--- !u!1 &4857568945217500661 stripped
GameObject:
  m_CorrespondingSourceObject: {fileID: 6857105829257694948, guid: 2e17cc19b956a4a7a89a13be858da31b,
    type: 3}
  m_PrefabInstance: {fileID: 2035864886046767889}
  m_PrefabAsset: {fileID: 0}
--- !u!1 &7665712160199505935 stripped
GameObject:
  m_CorrespondingSourceObject: {fileID: 8512591420561244958, guid: 2e17cc19b956a4a7a89a13be858da31b,
    type: 3}
  m_PrefabInstance: {fileID: 2035864886046767889}
  m_PrefabAsset: {fileID: 0}
--- !u!1 &9143274200084467904 stripped
GameObject:
  m_CorrespondingSourceObject: {fileID: 7107725997126282193, guid: 2e17cc19b956a4a7a89a13be858da31b,
    type: 3}
  m_PrefabInstance: {fileID: 2035864886046767889}
  m_PrefabAsset: {fileID: 0}
