%YAML 1.1
%TAG !u! tag:unity3d.com,2011:
--- !u!1045 &1
EditorBuildSettings:
  m_ObjectHideFlags: 0
  serializedVersion: 2
  m_Scenes:
  - enabled: 1
    path: Assets/Scenes/DONE/START.unity
    guid: 840062389e2354647a1204769d1bff57
  - enabled: 1
    path: Assets/Scenes/DONE/MAIN.unity
    guid: 0641dccf3520b46ecbf0d085f6a7fbc5
  m_configObjects: {}
