%YAML 1.1
%TAG !u! tag:unity3d.com,2011:
--- !u!114 &11400000
MonoBehaviour:
  m_ObjectHideFlags: 0
  m_CorrespondingSourceObject: {fileID: 0}
  m_PrefabInstance: {fileID: 0}
  m_PrefabAsset: {fileID: 0}
  m_GameObject: {fileID: 0}
  m_Enabled: 1
  m_EditorHideFlags: 0
  m_Script: {fileID: 11500000, guid: 113816c7d0ea947d88e0323dd59e8728, type: 3}
  m_Name: Level Two
  m_EditorClassIdentifier: 
  name: 
  levelPrefab: {fileID: 2277624579721688250, guid: fd107d33671c70f419461b6e59a8cbe7,
    type: 3}
  coin: {fileID: 0}
  stars:
    ONE: 5
    TWO: 3
    THREE: 2
  isUnlocked: 1
  currentStars: 3
  startPoint: {fileID: 0}
  endPoint: {fileID: 0}
