%YAML 1.1
%TAG !u! tag:unity3d.com,2011:
--- !u!1 &1148821696479539829
GameObject:
  m_ObjectHideFlags: 0
  m_CorrespondingSourceObject: {fileID: 0}
  m_PrefabInstance: {fileID: 0}
  m_PrefabAsset: {fileID: 0}
  serializedVersion: 6
  m_Component:
  - component: {fileID: 1766856814106652185}
  m_Layer: 0
  m_Name: Trampoline
  m_TagString: Untagged
  m_Icon: {fileID: 0}
  m_NavMeshLayer: 0
  m_StaticEditorFlags: 0
  m_IsActive: 1
--- !u!4 &1766856814106652185
Transform:
  m_ObjectHideFlags: 0
  m_CorrespondingSourceObject: {fileID: 0}
  m_PrefabInstance: {fileID: 0}
  m_PrefabAsset: {fileID: 0}
  m_GameObject: {fileID: 1148821696479539829}
  m_LocalRotation: {x: 0, y: 0, z: 0, w: 1}
  m_LocalPosition: {x: 0, y: 0, z: 0}
  m_LocalScale: {x: 1, y: 1, z: 1}
  m_Children:
  - {fileID: 573496313310830240}
  - {fileID: 3878825646542899419}
  m_Father: {fileID: 0}
  m_RootOrder: 0
  m_LocalEulerAnglesHint: {x: 0, y: 0, z: 0}
--- !u!1001 &2447618908684633826
PrefabInstance:
  m_ObjectHideFlags: 0
  serializedVersion: 2
  m_Modification:
    m_TransformParent: {fileID: 1766856814106652185}
    m_Modifications:
    - target: {fileID: 1178146976053127761, guid: 804f709e570d93845ac09a639d6cb16f,
        type: 3}
      propertyPath: m_Name
      value: Credit card
      objectReference: {fileID: 0}
    - target: {fileID: 2738971108686305346, guid: 804f709e570d93845ac09a639d6cb16f,
        type: 3}
      propertyPath: m_LocalPosition.x
      value: 0.40025154
      objectReference: {fileID: 0}
    - target: {fileID: 2738971108686305346, guid: 804f709e570d93845ac09a639d6cb16f,
        type: 3}
      propertyPath: m_LocalPosition.y
      value: 0.0144
      objectReference: {fileID: 0}
    - target: {fileID: 2738971108686305346, guid: 804f709e570d93845ac09a639d6cb16f,
        type: 3}
      propertyPath: m_LocalPosition.z
      value: 0.6513463
      objectReference: {fileID: 0}
    - target: {fileID: 2738971108686305346, guid: 804f709e570d93845ac09a639d6cb16f,
        type: 3}
      propertyPath: m_LocalRotation.x
      value: -0.27500713
      objectReference: {fileID: 0}
    - target: {fileID: 2738971108686305346, guid: 804f709e570d93845ac09a639d6cb16f,
        type: 3}
      propertyPath: m_LocalRotation.y
      value: -0.7016651
      objectReference: {fileID: 0}
    - target: {fileID: 2738971108686305346, guid: 804f709e570d93845ac09a639d6cb16f,
        type: 3}
      propertyPath: m_LocalRotation.z
      value: -0.65143764
      objectReference: {fileID: 0}
    - target: {fileID: 2738971108686305346, guid: 804f709e570d93845ac09a639d6cb16f,
        type: 3}
      propertyPath: m_LocalRotation.w
      value: 0.087556966
      objectReference: {fileID: 0}
    - target: {fileID: 2738971108686305346, guid: 804f709e570d93845ac09a639d6cb16f,
        type: 3}
      propertyPath: m_RootOrder
      value: 0
      objectReference: {fileID: 0}
    - target: {fileID: 2738971108686305346, guid: 804f709e570d93845ac09a639d6cb16f,
        type: 3}
      propertyPath: m_LocalEulerAnglesHint.x
      value: -105.773994
      objectReference: {fileID: 0}
    - target: {fileID: 2738971108686305346, guid: 804f709e570d93845ac09a639d6cb16f,
        type: 3}
      propertyPath: m_LocalEulerAnglesHint.y
      value: -60
      objectReference: {fileID: 0}
    - target: {fileID: 2738971108686305346, guid: 804f709e570d93845ac09a639d6cb16f,
        type: 3}
      propertyPath: m_LocalEulerAnglesHint.z
      value: -90
      objectReference: {fileID: 0}
    m_RemovedComponents: []
  m_SourcePrefab: {fileID: 100100000, guid: 804f709e570d93845ac09a639d6cb16f, type: 3}
--- !u!4 &573496313310830240 stripped
Transform:
  m_CorrespondingSourceObject: {fileID: 2738971108686305346, guid: 804f709e570d93845ac09a639d6cb16f,
    type: 3}
  m_PrefabInstance: {fileID: 2447618908684633826}
  m_PrefabAsset: {fileID: 0}
--- !u!1001 &5006490311084069369
PrefabInstance:
  m_ObjectHideFlags: 0
  serializedVersion: 2
  m_Modification:
    m_TransformParent: {fileID: 1766856814106652185}
    m_Modifications:
    - target: {fileID: 5113172097649240881, guid: f76bc534d0e244d4a87835ede1011540,
        type: 3}
      propertyPath: m_Name
      value: Unlucky_strikes (1)
      objectReference: {fileID: 0}
    - target: {fileID: 5113172097649240881, guid: f76bc534d0e244d4a87835ede1011540,
        type: 3}
      propertyPath: m_StaticEditorFlags
      value: 0
      objectReference: {fileID: 0}
    - target: {fileID: 8119703389493041442, guid: f76bc534d0e244d4a87835ede1011540,
        type: 3}
      propertyPath: m_LocalPosition.x
      value: 0.3439
      objectReference: {fileID: 0}
    - target: {fileID: 8119703389493041442, guid: f76bc534d0e244d4a87835ede1011540,
        type: 3}
      propertyPath: m_LocalPosition.y
      value: 0
      objectReference: {fileID: 0}
    - target: {fileID: 8119703389493041442, guid: f76bc534d0e244d4a87835ede1011540,
        type: 3}
      propertyPath: m_LocalPosition.z
      value: 0.6758001
      objectReference: {fileID: 0}
    - target: {fileID: 8119703389493041442, guid: f76bc534d0e244d4a87835ede1011540,
        type: 3}
      propertyPath: m_LocalRotation.x
      value: -0.17191884
      objectReference: {fileID: 0}
    - target: {fileID: 8119703389493041442, guid: f76bc534d0e244d4a87835ede1011540,
        type: 3}
      propertyPath: m_LocalRotation.y
      value: 0.17191884
      objectReference: {fileID: 0}
    - target: {fileID: 8119703389493041442, guid: f76bc534d0e244d4a87835ede1011540,
        type: 3}
      propertyPath: m_LocalRotation.z
      value: -0.6858891
      objectReference: {fileID: 0}
    - target: {fileID: 8119703389493041442, guid: f76bc534d0e244d4a87835ede1011540,
        type: 3}
      propertyPath: m_LocalRotation.w
      value: 0.6858891
      objectReference: {fileID: 0}
    - target: {fileID: 8119703389493041442, guid: f76bc534d0e244d4a87835ede1011540,
        type: 3}
      propertyPath: m_RootOrder
      value: 1
      objectReference: {fileID: 0}
    - target: {fileID: 8119703389493041442, guid: f76bc534d0e244d4a87835ede1011540,
        type: 3}
      propertyPath: m_LocalEulerAnglesHint.x
      value: 0
      objectReference: {fileID: 0}
    - target: {fileID: 8119703389493041442, guid: f76bc534d0e244d4a87835ede1011540,
        type: 3}
      propertyPath: m_LocalEulerAnglesHint.y
      value: 28.143002
      objectReference: {fileID: 0}
    - target: {fileID: 8119703389493041442, guid: f76bc534d0e244d4a87835ede1011540,
        type: 3}
      propertyPath: m_LocalEulerAnglesHint.z
      value: -90.00001
      objectReference: {fileID: 0}
    m_RemovedComponents: []
  m_SourcePrefab: {fileID: 100100000, guid: f76bc534d0e244d4a87835ede1011540, type: 3}
--- !u!4 &3878825646542899419 stripped
Transform:
  m_CorrespondingSourceObject: {fileID: 8119703389493041442, guid: f76bc534d0e244d4a87835ede1011540,
    type: 3}
  m_PrefabInstance: {fileID: 5006490311084069369}
  m_PrefabAsset: {fileID: 0}
