%YAML 1.1
%TAG !u! tag:unity3d.com,2011:
--- !u!29 &1
OcclusionCullingSettings:
  m_ObjectHideFlags: 0
  serializedVersion: 2
  m_OcclusionBakeSettings:
    smallestOccluder: 5
    smallestHole: 0.25
    backfaceThreshold: 100
  m_SceneGUID: 00000000000000000000000000000000
  m_OcclusionCullingData: {fileID: 0}
--- !u!104 &2
RenderSettings:
  m_ObjectHideFlags: 0
  serializedVersion: 9
  m_Fog: 0
  m_FogColor: {r: 0.5, g: 0.5, b: 0.5, a: 1}
  m_FogMode: 3
  m_FogDensity: 0.01
  m_LinearFogStart: 0
  m_LinearFogEnd: 300
  m_AmbientSkyColor: {r: 0.9528302, g: 0.82203525, b: 0.68765575, a: 1}
  m_AmbientEquatorColor: {r: 0.114, g: 0.125, b: 0.133, a: 1}
  m_AmbientGroundColor: {r: 0.047, g: 0.043, b: 0.035, a: 1}
  m_AmbientIntensity: 1
  m_AmbientMode: 3
  m_SubtractiveShadowColor: {r: 0.42, g: 0.478, b: 0.627, a: 1}
  m_SkyboxMaterial: {fileID: 10304, guid: 0000000000000000f000000000000000, type: 0}
  m_HaloStrength: 0.5
  m_FlareStrength: 1
  m_FlareFadeSpeed: 3
  m_HaloTexture: {fileID: 0}
  m_SpotCookie: {fileID: 10001, guid: 0000000000000000e000000000000000, type: 0}
  m_DefaultReflectionMode: 0
  m_DefaultReflectionResolution: 128
  m_ReflectionBounces: 1
  m_ReflectionIntensity: 1
  m_CustomReflection: {fileID: 0}
  m_Sun: {fileID: 0}
  m_IndirectSpecularColor: {r: 0.45416778, g: 0.5038631, b: 0.5836689, a: 1}
  m_UseRadianceAmbientProbe: 0
--- !u!157 &3
LightmapSettings:
  m_ObjectHideFlags: 0
  serializedVersion: 11
  m_GIWorkflowMode: 1
  m_GISettings:
    serializedVersion: 2
    m_BounceScale: 1
    m_IndirectOutputScale: 1
    m_AlbedoBoost: 1
    m_EnvironmentLightingMode: 0
    m_EnableBakedLightmaps: 0
    m_EnableRealtimeLightmaps: 1
  m_LightmapEditorSettings:
    serializedVersion: 12
    m_Resolution: 2
    m_BakeResolution: 40
    m_AtlasSize: 1024
    m_AO: 0
    m_AOMaxDistance: 1
    m_CompAOExponent: 1
    m_CompAOExponentDirect: 0
    m_ExtractAmbientOcclusion: 0
    m_Padding: 2
    m_LightmapParameters: {fileID: 0}
    m_LightmapsBakeMode: 1
    m_TextureCompression: 1
    m_FinalGather: 0
    m_FinalGatherFiltering: 1
    m_FinalGatherRayCount: 256
    m_ReflectionCompression: 2
    m_MixedBakeMode: 2
    m_BakeBackend: 1
    m_PVRSampling: 1
    m_PVRDirectSampleCount: 32
    m_PVRSampleCount: 500
    m_PVRBounces: 2
    m_PVREnvironmentSampleCount: 500
    m_PVREnvironmentReferencePointCount: 2048
    m_PVRFilteringMode: 2
    m_PVRDenoiserTypeDirect: 0
    m_PVRDenoiserTypeIndirect: 0
    m_PVRDenoiserTypeAO: 0
    m_PVRFilterTypeDirect: 0
    m_PVRFilterTypeIndirect: 0
    m_PVRFilterTypeAO: 0
    m_PVREnvironmentMIS: 0
    m_PVRCulling: 1
    m_PVRFilteringGaussRadiusDirect: 1
    m_PVRFilteringGaussRadiusIndirect: 5
    m_PVRFilteringGaussRadiusAO: 2
    m_PVRFilteringAtrousPositionSigmaDirect: 0.5
    m_PVRFilteringAtrousPositionSigmaIndirect: 2
    m_PVRFilteringAtrousPositionSigmaAO: 1
    m_ShowResolutionOverlay: 1
    m_ExportTrainingData: 0
  m_LightingDataAsset: {fileID: 112000002, guid: d55ac99d922c1fe4bb3095911b75cd52,
    type: 2}
  m_UseShadowmask: 1
--- !u!196 &4
NavMeshSettings:
  serializedVersion: 2
  m_ObjectHideFlags: 0
  m_BuildSettings:
    serializedVersion: 2
    agentTypeID: 0
    agentRadius: 0.3
    agentHeight: 2
    agentSlope: 0
    agentClimb: 0.01
    ledgeDropHeight: 0
    maxJumpAcrossDistance: 0
    minRegionArea: 2
    manualCellSize: 0
    cellSize: 0.1
    manualTileSize: 0
    tileSize: 256
    accuratePlacement: 0
    debug:
      m_Flags: 0
  m_NavMeshData: {fileID: 23800000, guid: 559d45e1010c5e04da89488ca34f3ade, type: 2}
--- !u!1 &152330286
GameObject:
  m_ObjectHideFlags: 0
  m_CorrespondingSourceObject: {fileID: 0}
  m_PrefabInstance: {fileID: 0}
  m_PrefabAsset: {fileID: 0}
  serializedVersion: 6
  m_Component:
  - component: {fileID: 152330287}
  m_Layer: 0
  m_Name: Utility
  m_TagString: Untagged
  m_Icon: {fileID: 0}
  m_NavMeshLayer: 0
  m_StaticEditorFlags: 0
  m_IsActive: 1
--- !u!4 &152330287
Transform:
  m_ObjectHideFlags: 0
  m_CorrespondingSourceObject: {fileID: 0}
  m_PrefabInstance: {fileID: 0}
  m_PrefabAsset: {fileID: 0}
  m_GameObject: {fileID: 152330286}
  m_LocalRotation: {x: 0, y: 0, z: 0, w: 1}
  m_LocalPosition: {x: -1.8905578, y: 5.3689795, z: 4.5179553}
  m_LocalScale: {x: 1, y: 1, z: 1}
  m_Children:
  - {fileID: 1068996852}
  - {fileID: 1895556221}
  - {fileID: 1508067708}
  - {fileID: 1947499673}
  - {fileID: 1906362990}
  m_Father: {fileID: 0}
  m_RootOrder: 4
  m_LocalEulerAnglesHint: {x: 0, y: 0, z: 0}
--- !u!1001 &164165048
PrefabInstance:
  m_ObjectHideFlags: 0
  serializedVersion: 2
  m_Modification:
    m_TransformParent: {fileID: 0}
    m_Modifications:
    - target: {fileID: 224045295884908652, guid: d7c3d3ef77ae845598ef316ed1a5c750,
        type: 3}
      propertyPath: m_LocalPosition.x
      value: 0
      objectReference: {fileID: 0}
    - target: {fileID: 224045295884908652, guid: d7c3d3ef77ae845598ef316ed1a5c750,
        type: 3}
      propertyPath: m_LocalPosition.y
      value: 0
      objectReference: {fileID: 0}
    - target: {fileID: 224045295884908652, guid: d7c3d3ef77ae845598ef316ed1a5c750,
        type: 3}
      propertyPath: m_LocalPosition.z
      value: 0
      objectReference: {fileID: 0}
    - target: {fileID: 224045295884908652, guid: d7c3d3ef77ae845598ef316ed1a5c750,
        type: 3}
      propertyPath: m_LocalRotation.x
      value: -0
      objectReference: {fileID: 0}
    - target: {fileID: 224045295884908652, guid: d7c3d3ef77ae845598ef316ed1a5c750,
        type: 3}
      propertyPath: m_LocalRotation.y
      value: -0
      objectReference: {fileID: 0}
    - target: {fileID: 224045295884908652, guid: d7c3d3ef77ae845598ef316ed1a5c750,
        type: 3}
      propertyPath: m_LocalRotation.z
      value: -0
      objectReference: {fileID: 0}
    - target: {fileID: 224045295884908652, guid: d7c3d3ef77ae845598ef316ed1a5c750,
        type: 3}
      propertyPath: m_LocalRotation.w
      value: 1
      objectReference: {fileID: 0}
    - target: {fileID: 224045295884908652, guid: d7c3d3ef77ae845598ef316ed1a5c750,
        type: 3}
      propertyPath: m_RootOrder
      value: 0
      objectReference: {fileID: 0}
    - target: {fileID: 224045295884908652, guid: d7c3d3ef77ae845598ef316ed1a5c750,
        type: 3}
      propertyPath: m_AnchoredPosition.x
      value: 0
      objectReference: {fileID: 0}
    - target: {fileID: 224045295884908652, guid: d7c3d3ef77ae845598ef316ed1a5c750,
        type: 3}
      propertyPath: m_AnchoredPosition.y
      value: 0
      objectReference: {fileID: 0}
    - target: {fileID: 224045295884908652, guid: d7c3d3ef77ae845598ef316ed1a5c750,
        type: 3}
      propertyPath: m_SizeDelta.x
      value: 100
      objectReference: {fileID: 0}
    - target: {fileID: 224045295884908652, guid: d7c3d3ef77ae845598ef316ed1a5c750,
        type: 3}
      propertyPath: m_SizeDelta.y
      value: 100
      objectReference: {fileID: 0}
    - target: {fileID: 224045295884908652, guid: d7c3d3ef77ae845598ef316ed1a5c750,
        type: 3}
      propertyPath: m_AnchorMin.x
      value: 0.5
      objectReference: {fileID: 0}
    - target: {fileID: 224045295884908652, guid: d7c3d3ef77ae845598ef316ed1a5c750,
        type: 3}
      propertyPath: m_AnchorMin.y
      value: 0.5
      objectReference: {fileID: 0}
    - target: {fileID: 224045295884908652, guid: d7c3d3ef77ae845598ef316ed1a5c750,
        type: 3}
      propertyPath: m_AnchorMax.x
      value: 0.5
      objectReference: {fileID: 0}
    - target: {fileID: 224045295884908652, guid: d7c3d3ef77ae845598ef316ed1a5c750,
        type: 3}
      propertyPath: m_AnchorMax.y
      value: 0.5
      objectReference: {fileID: 0}
    - target: {fileID: 224045295884908652, guid: d7c3d3ef77ae845598ef316ed1a5c750,
        type: 3}
      propertyPath: m_Pivot.x
      value: 0.5
      objectReference: {fileID: 0}
    - target: {fileID: 224045295884908652, guid: d7c3d3ef77ae845598ef316ed1a5c750,
        type: 3}
      propertyPath: m_Pivot.y
      value: 0.5
      objectReference: {fileID: 0}
    - target: {fileID: 114054745111725362, guid: d7c3d3ef77ae845598ef316ed1a5c750,
        type: 3}
      propertyPath: endPanel
      value: 
      objectReference: {fileID: 3788869890365400339}
    m_RemovedComponents: []
  m_SourcePrefab: {fileID: 100100000, guid: d7c3d3ef77ae845598ef316ed1a5c750, type: 3}
--- !u!114 &164165049 stripped
MonoBehaviour:
  m_CorrespondingSourceObject: {fileID: 114706618314963990, guid: d7c3d3ef77ae845598ef316ed1a5c750,
    type: 3}
  m_PrefabInstance: {fileID: 164165048}
  m_PrefabAsset: {fileID: 0}
  m_GameObject: {fileID: 0}
  m_Enabled: 1
  m_EditorHideFlags: 0
  m_Script: {fileID: 11500000, guid: c776763e5b3b9435098df363a30a96a2, type: 3}
  m_Name: 
  m_EditorClassIdentifier: 
--- !u!1001 &668460759
PrefabInstance:
  m_ObjectHideFlags: 0
  serializedVersion: 2
  m_Modification:
    m_TransformParent: {fileID: 0}
    m_Modifications:
    - target: {fileID: 0}
      propertyPath: m_Enabled
      value: 0
      objectReference: {fileID: 0}
    - target: {fileID: 4379564748290460, guid: cd730d29b3478874699365248e38c385, type: 3}
      propertyPath: m_LocalPosition.x
      value: -1.8905578
      objectReference: {fileID: 0}
    - target: {fileID: 4379564748290460, guid: cd730d29b3478874699365248e38c385, type: 3}
      propertyPath: m_LocalPosition.y
      value: 5.3689795
      objectReference: {fileID: 0}
    - target: {fileID: 4379564748290460, guid: cd730d29b3478874699365248e38c385, type: 3}
      propertyPath: m_LocalPosition.z
      value: 4.5179553
      objectReference: {fileID: 0}
    - target: {fileID: 4379564748290460, guid: cd730d29b3478874699365248e38c385, type: 3}
      propertyPath: m_LocalRotation.x
      value: 0
      objectReference: {fileID: 0}
    - target: {fileID: 4379564748290460, guid: cd730d29b3478874699365248e38c385, type: 3}
      propertyPath: m_LocalRotation.y
      value: 0
      objectReference: {fileID: 0}
    - target: {fileID: 4379564748290460, guid: cd730d29b3478874699365248e38c385, type: 3}
      propertyPath: m_LocalRotation.z
      value: 0
      objectReference: {fileID: 0}
    - target: {fileID: 4379564748290460, guid: cd730d29b3478874699365248e38c385, type: 3}
      propertyPath: m_LocalRotation.w
      value: 1
      objectReference: {fileID: 0}
    - target: {fileID: 4379564748290460, guid: cd730d29b3478874699365248e38c385, type: 3}
      propertyPath: m_RootOrder
      value: 3
      objectReference: {fileID: 0}
    - target: {fileID: 1388544103539650, guid: cd730d29b3478874699365248e38c385, type: 3}
      propertyPath: m_Layer
      value: 0
      objectReference: {fileID: 0}
    - target: {fileID: 4715320176018048, guid: cd730d29b3478874699365248e38c385, type: 3}
      propertyPath: m_LocalPosition.z
      value: -2.82
      objectReference: {fileID: 0}
    - target: {fileID: 1788931884719430, guid: cd730d29b3478874699365248e38c385, type: 3}
      propertyPath: m_TagString
      value: "VISP\u0100R\u012AGIE JAUT\u0100JUMI"
      objectReference: {fileID: 0}
    - target: {fileID: 4852839648367802, guid: cd730d29b3478874699365248e38c385, type: 3}
      propertyPath: m_LocalScale.x
      value: 2
      objectReference: {fileID: 0}
    - target: {fileID: 4852839648367802, guid: cd730d29b3478874699365248e38c385, type: 3}
      propertyPath: m_LocalScale.y
      value: 2
      objectReference: {fileID: 0}
    - target: {fileID: 4852839648367802, guid: cd730d29b3478874699365248e38c385, type: 3}
      propertyPath: m_LocalScale.z
      value: 2
      objectReference: {fileID: 0}
    - target: {fileID: 4288035879125904, guid: cd730d29b3478874699365248e38c385, type: 3}
      propertyPath: m_LocalScale.x
      value: 2
      objectReference: {fileID: 0}
    - target: {fileID: 4288035879125904, guid: cd730d29b3478874699365248e38c385, type: 3}
      propertyPath: m_LocalScale.y
      value: 2
      objectReference: {fileID: 0}
    - target: {fileID: 4288035879125904, guid: cd730d29b3478874699365248e38c385, type: 3}
      propertyPath: m_LocalScale.z
      value: 2
      objectReference: {fileID: 0}
    - target: {fileID: 4564081272729418, guid: cd730d29b3478874699365248e38c385, type: 3}
      propertyPath: m_LocalScale.x
      value: 2
      objectReference: {fileID: 0}
    - target: {fileID: 4564081272729418, guid: cd730d29b3478874699365248e38c385, type: 3}
      propertyPath: m_LocalScale.y
      value: 2
      objectReference: {fileID: 0}
    - target: {fileID: 4564081272729418, guid: cd730d29b3478874699365248e38c385, type: 3}
      propertyPath: m_LocalScale.z
      value: 2
      objectReference: {fileID: 0}
    - target: {fileID: 4236114192121306, guid: cd730d29b3478874699365248e38c385, type: 3}
      propertyPath: m_LocalScale.y
      value: 2
      objectReference: {fileID: 0}
    - target: {fileID: 4236114192121306, guid: cd730d29b3478874699365248e38c385, type: 3}
      propertyPath: m_LocalScale.x
      value: 2
      objectReference: {fileID: 0}
    - target: {fileID: 4236114192121306, guid: cd730d29b3478874699365248e38c385, type: 3}
      propertyPath: m_LocalScale.z
      value: 2
      objectReference: {fileID: 0}
    - target: {fileID: 4395640179689016, guid: cd730d29b3478874699365248e38c385, type: 3}
      propertyPath: m_LocalScale.x
      value: 2
      objectReference: {fileID: 0}
    - target: {fileID: 4395640179689016, guid: cd730d29b3478874699365248e38c385, type: 3}
      propertyPath: m_LocalScale.y
      value: 2
      objectReference: {fileID: 0}
    - target: {fileID: 4395640179689016, guid: cd730d29b3478874699365248e38c385, type: 3}
      propertyPath: m_LocalScale.z
      value: 2
      objectReference: {fileID: 0}
    - target: {fileID: 4395640179689016, guid: cd730d29b3478874699365248e38c385, type: 3}
      propertyPath: m_LocalPosition.y
      value: 3.858
      objectReference: {fileID: 0}
    - target: {fileID: 4455790691782114, guid: cd730d29b3478874699365248e38c385, type: 3}
      propertyPath: m_LocalScale.x
      value: 2
      objectReference: {fileID: 0}
    - target: {fileID: 4455790691782114, guid: cd730d29b3478874699365248e38c385, type: 3}
      propertyPath: m_LocalScale.y
      value: 2
      objectReference: {fileID: 0}
    - target: {fileID: 4455790691782114, guid: cd730d29b3478874699365248e38c385, type: 3}
      propertyPath: m_LocalScale.z
      value: 2
      objectReference: {fileID: 0}
    - target: {fileID: 1733163044488446, guid: cd730d29b3478874699365248e38c385, type: 3}
      propertyPath: m_IsActive
      value: 0
      objectReference: {fileID: 0}
    - target: {fileID: 1330390883212752, guid: cd730d29b3478874699365248e38c385, type: 3}
      propertyPath: m_IsActive
      value: 0
      objectReference: {fileID: 0}
    - target: {fileID: 4064467295711822, guid: cd730d29b3478874699365248e38c385, type: 3}
      propertyPath: m_LocalPosition.y
      value: -0.0128
      objectReference: {fileID: 0}
    - target: {fileID: 4064467295711822, guid: cd730d29b3478874699365248e38c385, type: 3}
      propertyPath: m_LocalPosition.z
      value: -0.0285
      objectReference: {fileID: 0}
    - target: {fileID: 4064467295711822, guid: cd730d29b3478874699365248e38c385, type: 3}
      propertyPath: m_LocalPosition.x
      value: -0.0031
      objectReference: {fileID: 0}
    - target: {fileID: 1606326480205068, guid: cd730d29b3478874699365248e38c385, type: 3}
      propertyPath: m_IsActive
      value: 0
      objectReference: {fileID: 0}
    - target: {fileID: 1588891774628306, guid: cd730d29b3478874699365248e38c385, type: 3}
      propertyPath: m_Layer
      value: 0
      objectReference: {fileID: 0}
    - target: {fileID: 1588891774628306, guid: cd730d29b3478874699365248e38c385, type: 3}
      propertyPath: m_IsActive
      value: 0
      objectReference: {fileID: 0}
    - target: {fileID: 1780830060280134, guid: cd730d29b3478874699365248e38c385, type: 3}
      propertyPath: m_IsActive
      value: 1
      objectReference: {fileID: 0}
    - target: {fileID: 1434793540105410, guid: cd730d29b3478874699365248e38c385, type: 3}
      propertyPath: m_Layer
      value: 31
      objectReference: {fileID: 0}
    - target: {fileID: 1434793540105410, guid: cd730d29b3478874699365248e38c385, type: 3}
      propertyPath: m_TagString
      value: INFEKCIJAS
      objectReference: {fileID: 0}
    - target: {fileID: 1091297904152856, guid: cd730d29b3478874699365248e38c385, type: 3}
      propertyPath: m_IsActive
      value: 1
      objectReference: {fileID: 0}
    - target: {fileID: 5519866400404228052, guid: cd730d29b3478874699365248e38c385,
        type: 3}
      propertyPath: m_Layer
      value: 31
      objectReference: {fileID: 0}
    - target: {fileID: 3737524014533707023, guid: cd730d29b3478874699365248e38c385,
        type: 3}
      propertyPath: m_Layer
      value: 31
      objectReference: {fileID: 0}
    - target: {fileID: 399033434022883391, guid: cd730d29b3478874699365248e38c385,
        type: 3}
      propertyPath: m_Layer
      value: 31
      objectReference: {fileID: 0}
    m_RemovedComponents: []
  m_SourcePrefab: {fileID: 100100000, guid: cd730d29b3478874699365248e38c385, type: 3}
--- !u!1 &1068996850
GameObject:
  m_ObjectHideFlags: 0
  m_CorrespondingSourceObject: {fileID: 0}
  m_PrefabInstance: {fileID: 0}
  m_PrefabAsset: {fileID: 0}
  serializedVersion: 6
  m_Component:
  - component: {fileID: 1068996852}
  - component: {fileID: 1068996851}
  m_Layer: 0
  m_Name: Directional Light
  m_TagString: Untagged
  m_Icon: {fileID: 0}
  m_NavMeshLayer: 0
  m_StaticEditorFlags: 0
  m_IsActive: 1
--- !u!108 &1068996851
Light:
  m_ObjectHideFlags: 0
  m_CorrespondingSourceObject: {fileID: 0}
  m_PrefabInstance: {fileID: 0}
  m_PrefabAsset: {fileID: 0}
  m_GameObject: {fileID: 1068996850}
  m_Enabled: 1
  serializedVersion: 9
  m_Type: 1
  m_Color: {r: 1, g: 0.95686275, b: 0.8392157, a: 1}
  m_Intensity: 1
  m_Range: 10
  m_SpotAngle: 30
  m_InnerSpotAngle: 21.802082
  m_CookieSize: 10
  m_Shadows:
    m_Type: 2
    m_Resolution: -1
    m_CustomResolution: -1
    m_Strength: 1
    m_Bias: 0.05
    m_NormalBias: 0.4
    m_NearPlane: 0.2
    m_CullingMatrixOverride:
      e00: 1
      e01: 0
      e02: 0
      e03: 0
      e10: 0
      e11: 1
      e12: 0
      e13: 0
      e20: 0
      e21: 0
      e22: 1
      e23: 0
      e30: 0
      e31: 0
      e32: 0
      e33: 1
    m_UseCullingMatrixOverride: 0
  m_Cookie: {fileID: 0}
  m_DrawHalo: 0
  m_Flare: {fileID: 0}
  m_RenderMode: 0
  m_CullingMask:
    serializedVersion: 2
    m_Bits: 4294967295
  m_RenderingLayerMask: 1
  m_Lightmapping: 4
  m_LightShadowCasterMode: 0
  m_AreaSize: {x: 1, y: 1}
  m_BounceIntensity: 1
  m_ColorTemperature: 6570
  m_UseColorTemperature: 0
  m_BoundingSphereOverride: {x: 0, y: 0, z: 0, w: 0}
  m_UseBoundingSphereOverride: 0
  m_ShadowRadius: 0
  m_ShadowAngle: 0
--- !u!4 &1068996852
Transform:
  m_ObjectHideFlags: 0
  m_CorrespondingSourceObject: {fileID: 0}
  m_PrefabInstance: {fileID: 0}
  m_PrefabAsset: {fileID: 0}
  m_GameObject: {fileID: 1068996850}
  m_LocalRotation: {x: -0.15895161, y: -0.7636202, z: 0.5911514, w: -0.20532584}
  m_LocalPosition: {x: 1.8905578, y: -2.3689795, z: -4.5179553}
  m_LocalScale: {x: 1, y: 1, z: 1}
  m_Children: []
  m_Father: {fileID: 152330287}
  m_RootOrder: 0
  m_LocalEulerAnglesHint: {x: 75.49, y: -210.1, z: 0}
--- !u!1 &1334670278
GameObject:
  m_ObjectHideFlags: 0
  m_CorrespondingSourceObject: {fileID: 0}
  m_PrefabInstance: {fileID: 0}
  m_PrefabAsset: {fileID: 0}
  serializedVersion: 6
  m_Component:
  - component: {fileID: 1334670279}
  - component: {fileID: 1334670282}
  - component: {fileID: 1334670281}
  - component: {fileID: 1334670280}
  m_Layer: 0
  m_Name: Canvas
  m_TagString: Untagged
  m_Icon: {fileID: 0}
  m_NavMeshLayer: 0
  m_StaticEditorFlags: 0
  m_IsActive: 1
--- !u!224 &1334670279
RectTransform:
  m_ObjectHideFlags: 0
  m_CorrespondingSourceObject: {fileID: 0}
  m_PrefabInstance: {fileID: 0}
  m_PrefabAsset: {fileID: 0}
  m_GameObject: {fileID: 1334670278}
  m_LocalRotation: {x: 0, y: 0, z: 0, w: 1}
  m_LocalPosition: {x: 0, y: 0, z: 0}
  m_LocalScale: {x: 0, y: 0, z: 0}
  m_Children:
  - {fileID: 4001943198161847591}
  m_Father: {fileID: 0}
  m_RootOrder: 2
  m_LocalEulerAnglesHint: {x: 0, y: 0, z: 0}
  m_AnchorMin: {x: 0, y: 0}
  m_AnchorMax: {x: 0, y: 0}
  m_AnchoredPosition: {x: 0, y: 0}
  m_SizeDelta: {x: 0, y: 0}
  m_Pivot: {x: 0, y: 0}
--- !u!114 &1334670280
MonoBehaviour:
  m_ObjectHideFlags: 0
  m_CorrespondingSourceObject: {fileID: 0}
  m_PrefabInstance: {fileID: 0}
  m_PrefabAsset: {fileID: 0}
  m_GameObject: {fileID: 1334670278}
  m_Enabled: 1
  m_EditorHideFlags: 0
  m_Script: {fileID: 1301386320, guid: f70555f144d8491a825f0804e09c671c, type: 3}
  m_Name: 
  m_EditorClassIdentifier: 
  m_IgnoreReversedGraphics: 0
  m_BlockingObjects: 0
  m_BlockingMask:
    serializedVersion: 2
    m_Bits: 4294967295
--- !u!114 &1334670281
MonoBehaviour:
  m_ObjectHideFlags: 0
  m_CorrespondingSourceObject: {fileID: 0}
  m_PrefabInstance: {fileID: 0}
  m_PrefabAsset: {fileID: 0}
  m_GameObject: {fileID: 1334670278}
  m_Enabled: 1
  m_EditorHideFlags: 0
  m_Script: {fileID: 1980459831, guid: f70555f144d8491a825f0804e09c671c, type: 3}
  m_Name: 
  m_EditorClassIdentifier: 
  m_UiScaleMode: 1
  m_ReferencePixelsPerUnit: 100
  m_ScaleFactor: 1
  m_ReferenceResolution: {x: 1280, y: 720}
  m_ScreenMatchMode: 0
  m_MatchWidthOrHeight: 0
  m_PhysicalUnit: 3
  m_FallbackScreenDPI: 96
  m_DefaultSpriteDPI: 96
  m_DynamicPixelsPerUnit: 1
--- !u!223 &1334670282
Canvas:
  m_ObjectHideFlags: 0
  m_CorrespondingSourceObject: {fileID: 0}
  m_PrefabInstance: {fileID: 0}
  m_PrefabAsset: {fileID: 0}
  m_GameObject: {fileID: 1334670278}
  m_Enabled: 1
  serializedVersion: 3
  m_RenderMode: 0
  m_Camera: {fileID: 0}
  m_PlaneDistance: 100
  m_PixelPerfect: 0
  m_ReceivesEvents: 1
  m_OverrideSorting: 0
  m_OverridePixelPerfect: 0
  m_SortingBucketNormalizedSize: 0
  m_AdditionalShaderChannelsFlag: 25
  m_SortingLayerID: 0
  m_SortingOrder: 0
  m_TargetDisplay: 0
--- !u!1 &1508067705
GameObject:
  m_ObjectHideFlags: 0
  m_CorrespondingSourceObject: {fileID: 0}
  m_PrefabInstance: {fileID: 0}
  m_PrefabAsset: {fileID: 0}
  serializedVersion: 6
  m_Component:
  - component: {fileID: 1508067708}
  - component: {fileID: 1508067707}
  - component: {fileID: 1508067706}
  m_Layer: 0
  m_Name: Main Camera
  m_TagString: MainCamera
  m_Icon: {fileID: 0}
  m_NavMeshLayer: 0
  m_StaticEditorFlags: 0
  m_IsActive: 0
--- !u!81 &1508067706
AudioListener:
  m_ObjectHideFlags: 0
  m_CorrespondingSourceObject: {fileID: 0}
  m_PrefabInstance: {fileID: 0}
  m_PrefabAsset: {fileID: 0}
  m_GameObject: {fileID: 1508067705}
  m_Enabled: 1
--- !u!20 &1508067707
Camera:
  m_ObjectHideFlags: 0
  m_CorrespondingSourceObject: {fileID: 0}
  m_PrefabInstance: {fileID: 0}
  m_PrefabAsset: {fileID: 0}
  m_GameObject: {fileID: 1508067705}
  m_Enabled: 1
  serializedVersion: 2
  m_ClearFlags: 2
  m_BackGroundColor: {r: 0.25765398, g: 0.2675181, b: 0.2830189, a: 0}
  m_projectionMatrixMode: 1
  m_GateFitMode: 2
  m_FOVAxisMode: 0
  m_SensorSize: {x: 36, y: 24}
  m_LensShift: {x: 0, y: 0}
  m_FocalLength: 50
  m_NormalizedViewPortRect:
    serializedVersion: 2
    x: 0
    y: 0
    width: 1
    height: 1
  near clip plane: -20
  far clip plane: 1000
  field of view: 60
  orthographic: 1
  orthographic size: 6
  m_Depth: -1
  m_CullingMask:
    serializedVersion: 2
    m_Bits: 4294967295
  m_RenderingPath: -1
  m_TargetTexture: {fileID: 0}
  m_TargetDisplay: 0
  m_TargetEye: 3
  m_HDR: 1
  m_AllowMSAA: 0
  m_AllowDynamicResolution: 0
  m_ForceIntoRT: 0
  m_OcclusionCulling: 1
  m_StereoConvergence: 10
  m_StereoSeparation: 0.022
--- !u!4 &1508067708
Transform:
  m_ObjectHideFlags: 0
  m_CorrespondingSourceObject: {fileID: 0}
  m_PrefabInstance: {fileID: 0}
  m_PrefabAsset: {fileID: 0}
  m_GameObject: {fileID: 1508067705}
  m_LocalRotation: {x: 0.11936087, y: 0.8703752, z: -0.2586908, w: 0.4015956}
  m_LocalPosition: {x: 1.1932693, y: 0.9908228, z: -1.5459847}
  m_LocalScale: {x: 1, y: 1, z: 1}
  m_Children: []
  m_Father: {fileID: 152330287}
  m_RootOrder: 2
  m_LocalEulerAnglesHint: {x: 0, y: 0, z: 0}
--- !u!1001 &1726750803
PrefabInstance:
  m_ObjectHideFlags: 0
  serializedVersion: 2
  m_Modification:
    m_TransformParent: {fileID: 0}
    m_Modifications:
    - target: {fileID: 4367402560740766, guid: 1ca3ec92b64f44e43aa7fd3d39348a08, type: 3}
      propertyPath: m_LocalPosition.x
      value: 2.81
      objectReference: {fileID: 0}
    - target: {fileID: 4367402560740766, guid: 1ca3ec92b64f44e43aa7fd3d39348a08, type: 3}
      propertyPath: m_LocalPosition.y
      value: 3.599
      objectReference: {fileID: 0}
    - target: {fileID: 4367402560740766, guid: 1ca3ec92b64f44e43aa7fd3d39348a08, type: 3}
      propertyPath: m_LocalPosition.z
      value: -0.51
      objectReference: {fileID: 0}
    - target: {fileID: 4367402560740766, guid: 1ca3ec92b64f44e43aa7fd3d39348a08, type: 3}
      propertyPath: m_LocalRotation.x
      value: 0
      objectReference: {fileID: 0}
    - target: {fileID: 4367402560740766, guid: 1ca3ec92b64f44e43aa7fd3d39348a08, type: 3}
      propertyPath: m_LocalRotation.y
      value: 0
      objectReference: {fileID: 0}
    - target: {fileID: 4367402560740766, guid: 1ca3ec92b64f44e43aa7fd3d39348a08, type: 3}
      propertyPath: m_LocalRotation.z
      value: 0
      objectReference: {fileID: 0}
    - target: {fileID: 4367402560740766, guid: 1ca3ec92b64f44e43aa7fd3d39348a08, type: 3}
      propertyPath: m_LocalRotation.w
      value: 1
      objectReference: {fileID: 0}
    - target: {fileID: 4367402560740766, guid: 1ca3ec92b64f44e43aa7fd3d39348a08, type: 3}
      propertyPath: m_RootOrder
      value: 1
      objectReference: {fileID: 0}
    - target: {fileID: 114273094828504122, guid: 1ca3ec92b64f44e43aa7fd3d39348a08,
        type: 3}
      propertyPath: _marker
      value: 
      objectReference: {fileID: 1895556219}
    - target: {fileID: 114273094828504122, guid: 1ca3ec92b64f44e43aa7fd3d39348a08,
        type: 3}
      propertyPath: canvasPanels.Array.data[0]
      value: 
      objectReference: {fileID: 3787987155841548243}
    - target: {fileID: 114273094828504122, guid: 1ca3ec92b64f44e43aa7fd3d39348a08,
        type: 3}
      propertyPath: canvasPanels.Array.data[1]
      value: 
      objectReference: {fileID: 3788869890365400339}
    - target: {fileID: 4959431465594182, guid: 1ca3ec92b64f44e43aa7fd3d39348a08, type: 3}
      propertyPath: m_LocalPosition.x
      value: 1.8626451e-11
      objectReference: {fileID: 0}
    - target: {fileID: 4959431465594182, guid: 1ca3ec92b64f44e43aa7fd3d39348a08, type: 3}
      propertyPath: m_LocalPosition.y
      value: 0.0007719939
      objectReference: {fileID: 0}
    - target: {fileID: 4959431465594182, guid: 1ca3ec92b64f44e43aa7fd3d39348a08, type: 3}
      propertyPath: m_LocalPosition.z
      value: 2.6077032e-10
      objectReference: {fileID: 0}
    - target: {fileID: 4959431465594182, guid: 1ca3ec92b64f44e43aa7fd3d39348a08, type: 3}
      propertyPath: m_LocalScale.y
      value: 0.99999994
      objectReference: {fileID: 0}
    - target: {fileID: 4959431465594182, guid: 1ca3ec92b64f44e43aa7fd3d39348a08, type: 3}
      propertyPath: m_LocalScale.z
      value: 0.99999994
      objectReference: {fileID: 0}
    - target: {fileID: 4854158399730214, guid: 1ca3ec92b64f44e43aa7fd3d39348a08, type: 3}
      propertyPath: m_LocalRotation.x
      value: -6.123235e-17
      objectReference: {fileID: 0}
    - target: {fileID: 4854158399730214, guid: 1ca3ec92b64f44e43aa7fd3d39348a08, type: 3}
      propertyPath: m_LocalRotation.z
      value: 6.123235e-17
      objectReference: {fileID: 0}
    - target: {fileID: 4905361554804652, guid: 1ca3ec92b64f44e43aa7fd3d39348a08, type: 3}
      propertyPath: m_LocalRotation.y
      value: 0
      objectReference: {fileID: 0}
    - target: {fileID: 4905361554804652, guid: 1ca3ec92b64f44e43aa7fd3d39348a08, type: 3}
      propertyPath: m_LocalPosition.x
      value: -0
      objectReference: {fileID: 0}
    - target: {fileID: 4905361554804652, guid: 1ca3ec92b64f44e43aa7fd3d39348a08, type: 3}
      propertyPath: m_LocalScale.y
      value: 36.430786
      objectReference: {fileID: 0}
    - target: {fileID: 4905361554804652, guid: 1ca3ec92b64f44e43aa7fd3d39348a08, type: 3}
      propertyPath: m_LocalScale.z
      value: 36.430786
      objectReference: {fileID: 0}
    - target: {fileID: 4090207528846112, guid: 1ca3ec92b64f44e43aa7fd3d39348a08, type: 3}
      propertyPath: m_LocalPosition.x
      value: 3.4924594e-11
      objectReference: {fileID: 0}
    - target: {fileID: 4090207528846112, guid: 1ca3ec92b64f44e43aa7fd3d39348a08, type: 3}
      propertyPath: m_LocalPosition.y
      value: 0.0008831252
      objectReference: {fileID: 0}
    - target: {fileID: 4090207528846112, guid: 1ca3ec92b64f44e43aa7fd3d39348a08, type: 3}
      propertyPath: m_LocalPosition.z
      value: 2.7187524e-10
      objectReference: {fileID: 0}
    - target: {fileID: 4725525865215990, guid: 1ca3ec92b64f44e43aa7fd3d39348a08, type: 3}
      propertyPath: m_LocalPosition.y
      value: 0.00043568196
      objectReference: {fileID: 0}
    - target: {fileID: 4725525865215990, guid: 1ca3ec92b64f44e43aa7fd3d39348a08, type: 3}
      propertyPath: m_LocalPosition.z
      value: 0.000451487
      objectReference: {fileID: 0}
    - target: {fileID: 4783175513050168, guid: 1ca3ec92b64f44e43aa7fd3d39348a08, type: 3}
      propertyPath: m_LocalPosition.x
      value: -2.561137e-11
      objectReference: {fileID: 0}
    - target: {fileID: 4783175513050168, guid: 1ca3ec92b64f44e43aa7fd3d39348a08, type: 3}
      propertyPath: m_LocalPosition.y
      value: 0.0012422028
      objectReference: {fileID: 0}
    - target: {fileID: 4783175513050168, guid: 1ca3ec92b64f44e43aa7fd3d39348a08, type: 3}
      propertyPath: m_LocalPosition.z
      value: -5.6258614e-10
      objectReference: {fileID: 0}
    - target: {fileID: 4145020709774880, guid: 1ca3ec92b64f44e43aa7fd3d39348a08, type: 3}
      propertyPath: m_LocalRotation.x
      value: -6.123235e-17
      objectReference: {fileID: 0}
    - target: {fileID: 4145020709774880, guid: 1ca3ec92b64f44e43aa7fd3d39348a08, type: 3}
      propertyPath: m_LocalRotation.z
      value: 6.123235e-17
      objectReference: {fileID: 0}
    - target: {fileID: 4645585311668512, guid: 1ca3ec92b64f44e43aa7fd3d39348a08, type: 3}
      propertyPath: m_LocalRotation.x
      value: -6.123235e-17
      objectReference: {fileID: 0}
    - target: {fileID: 4645585311668512, guid: 1ca3ec92b64f44e43aa7fd3d39348a08, type: 3}
      propertyPath: m_LocalRotation.z
      value: 6.123235e-17
      objectReference: {fileID: 0}
    - target: {fileID: 4767732248968882, guid: 1ca3ec92b64f44e43aa7fd3d39348a08, type: 3}
      propertyPath: m_LocalRotation.y
      value: 0.71598226
      objectReference: {fileID: 0}
    - target: {fileID: 4767732248968882, guid: 1ca3ec92b64f44e43aa7fd3d39348a08, type: 3}
      propertyPath: m_LocalRotation.w
      value: -0.26122177
      objectReference: {fileID: 0}
    - target: {fileID: 4471153384098086, guid: 1ca3ec92b64f44e43aa7fd3d39348a08, type: 3}
      propertyPath: m_LocalRotation.x
      value: -6.123235e-17
      objectReference: {fileID: 0}
    - target: {fileID: 4471153384098086, guid: 1ca3ec92b64f44e43aa7fd3d39348a08, type: 3}
      propertyPath: m_LocalRotation.z
      value: 6.123235e-17
      objectReference: {fileID: 0}
    - target: {fileID: 4797042557265132, guid: 1ca3ec92b64f44e43aa7fd3d39348a08, type: 3}
      propertyPath: m_LocalScale.x
      value: 0.99999964
      objectReference: {fileID: 0}
    - target: {fileID: 4797042557265132, guid: 1ca3ec92b64f44e43aa7fd3d39348a08, type: 3}
      propertyPath: m_LocalScale.z
      value: 0.99999964
      objectReference: {fileID: 0}
    m_RemovedComponents: []
  m_SourcePrefab: {fileID: 100100000, guid: 1ca3ec92b64f44e43aa7fd3d39348a08, type: 3}
--- !u!1 &1895556219
GameObject:
  m_ObjectHideFlags: 0
  m_CorrespondingSourceObject: {fileID: 1989353167606524, guid: 1ca3ec92b64f44e43aa7fd3d39348a08,
    type: 3}
  m_PrefabInstance: {fileID: 0}
  m_PrefabAsset: {fileID: 0}
  serializedVersion: 6
  m_Component:
  - component: {fileID: 1895556221}
  - component: {fileID: 1895556220}
  m_Layer: 0
  m_Name: Marker
  m_TagString: Untagged
  m_Icon: {fileID: 0}
  m_NavMeshLayer: 0
  m_StaticEditorFlags: 0
  m_IsActive: 1
--- !u!212 &1895556220
SpriteRenderer:
  m_ObjectHideFlags: 0
  m_CorrespondingSourceObject: {fileID: 212589825846820656, guid: 1ca3ec92b64f44e43aa7fd3d39348a08,
    type: 3}
  m_PrefabInstance: {fileID: 0}
  m_PrefabAsset: {fileID: 0}
  m_GameObject: {fileID: 1895556219}
  m_Enabled: 1
  m_CastShadows: 0
  m_ReceiveShadows: 0
  m_DynamicOccludee: 1
  m_MotionVectors: 1
  m_LightProbeUsage: 1
  m_ReflectionProbeUsage: 1
  m_RenderingLayerMask: 4294967295
  m_RendererPriority: 0
  m_Materials:
  - {fileID: 10754, guid: 0000000000000000f000000000000000, type: 0}
  m_StaticBatchInfo:
    firstSubMesh: 0
    subMeshCount: 0
  m_StaticBatchRoot: {fileID: 0}
  m_ProbeAnchor: {fileID: 0}
  m_LightProbeVolumeOverride: {fileID: 0}
  m_ScaleInLightmap: 1
  m_PreserveUVs: 0
  m_IgnoreNormalsForChartDetection: 0
  m_ImportantGI: 0
  m_StitchLightmapSeams: 0
  m_SelectedEditorRenderState: 0
  m_MinimumChartSize: 4
  m_AutoUVMaxDistance: 0.5
  m_AutoUVMaxAngle: 89
  m_LightmapParameters: {fileID: 0}
  m_SortingLayerID: 0
  m_SortingLayer: 0
  m_SortingOrder: 0
  m_Sprite: {fileID: 21300002, guid: 8150ed976721744d8b9c182c27c4d5f8, type: 3}
  m_Color: {r: 1, g: 0.709386, b: 0.25943398, a: 1}
  m_FlipX: 0
  m_FlipY: 0
  m_DrawMode: 0
  m_Size: {x: 0.37, y: 0.36}
  m_AdaptiveModeThreshold: 0.5
  m_SpriteTileMode: 0
  m_WasSpriteAssigned: 1
  m_MaskInteraction: 0
  m_SpriteSortPoint: 0
--- !u!4 &1895556221
Transform:
  m_ObjectHideFlags: 0
  m_CorrespondingSourceObject: {fileID: 4881878030462686, guid: 1ca3ec92b64f44e43aa7fd3d39348a08,
    type: 3}
  m_PrefabInstance: {fileID: 0}
  m_PrefabAsset: {fileID: 0}
  m_GameObject: {fileID: 1895556219}
  m_LocalRotation: {x: -0.70710576, y: -0, z: -0, w: 0.70710784}
  m_LocalPosition: {x: 0, y: 0.123, z: 0}
  m_LocalScale: {x: 0.8, y: 0.8, z: 0.8}
  m_Children: []
  m_Father: {fileID: 152330287}
  m_RootOrder: 1
  m_LocalEulerAnglesHint: {x: -90.00001, y: 0, z: 0}
--- !u!1 &1906362989
GameObject:
  m_ObjectHideFlags: 0
  m_CorrespondingSourceObject: {fileID: 0}
  m_PrefabInstance: {fileID: 0}
  m_PrefabAsset: {fileID: 0}
  serializedVersion: 6
  m_Component:
  - component: {fileID: 1906362990}
  - component: {fileID: 1906362992}
  - component: {fileID: 1906362991}
  m_Layer: 0
  m_Name: Camera
  m_TagString: MainCamera
  m_Icon: {fileID: 0}
  m_NavMeshLayer: 0
  m_StaticEditorFlags: 0
  m_IsActive: 1
--- !u!4 &1906362990
Transform:
  m_ObjectHideFlags: 0
  m_CorrespondingSourceObject: {fileID: 0}
  m_PrefabInstance: {fileID: 0}
  m_PrefabAsset: {fileID: 0}
  m_GameObject: {fileID: 1906362989}
  m_LocalRotation: {x: 0.11936087, y: 0.8703752, z: -0.2586908, w: 0.4015956}
  m_LocalPosition: {x: 1.1932693, y: 0.9908228, z: -1.5459847}
  m_LocalScale: {x: 1, y: 1, z: 1}
  m_Children: []
  m_Father: {fileID: 152330287}
  m_RootOrder: 4
  m_LocalEulerAnglesHint: {x: 0, y: 0, z: 0}
--- !u!81 &1906362991
AudioListener:
  m_ObjectHideFlags: 0
  m_CorrespondingSourceObject: {fileID: 0}
  m_PrefabInstance: {fileID: 0}
  m_PrefabAsset: {fileID: 0}
  m_GameObject: {fileID: 1906362989}
  m_Enabled: 1
--- !u!20 &1906362992
Camera:
  m_ObjectHideFlags: 0
  m_CorrespondingSourceObject: {fileID: 0}
  m_PrefabInstance: {fileID: 0}
  m_PrefabAsset: {fileID: 0}
  m_GameObject: {fileID: 1906362989}
  m_Enabled: 1
  serializedVersion: 2
  m_ClearFlags: 2
  m_BackGroundColor: {r: 0.25765398, g: 0.2675181, b: 0.2830189, a: 0}
  m_projectionMatrixMode: 1
  m_GateFitMode: 2
  m_FOVAxisMode: 0
  m_SensorSize: {x: 36, y: 24}
  m_LensShift: {x: 0, y: 0}
  m_FocalLength: 50
  m_NormalizedViewPortRect:
    serializedVersion: 2
    x: 0
    y: 0
    width: 1
    height: 1
  near clip plane: -20
  far clip plane: 1000
  field of view: 60
  orthographic: 1
  orthographic size: 6
  m_Depth: -1
  m_CullingMask:
    serializedVersion: 2
    m_Bits: 4294967295
  m_RenderingPath: -1
  m_TargetTexture: {fileID: 0}
  m_TargetDisplay: 0
  m_TargetEye: 3
  m_HDR: 1
  m_AllowMSAA: 0
  m_AllowDynamicResolution: 0
  m_ForceIntoRT: 0
  m_OcclusionCulling: 1
  m_StereoConvergence: 10
  m_StereoSeparation: 0.022
--- !u!1 &1947499672
GameObject:
  m_ObjectHideFlags: 0
  m_CorrespondingSourceObject: {fileID: 0}
  m_PrefabInstance: {fileID: 0}
  m_PrefabAsset: {fileID: 0}
  serializedVersion: 6
  m_Component:
  - component: {fileID: 1947499673}
  - component: {fileID: 1947499675}
  - component: {fileID: 1947499674}
  m_Layer: 0
  m_Name: EventSystem
  m_TagString: Untagged
  m_Icon: {fileID: 0}
  m_NavMeshLayer: 0
  m_StaticEditorFlags: 0
  m_IsActive: 1
--- !u!4 &1947499673
Transform:
  m_ObjectHideFlags: 0
  m_CorrespondingSourceObject: {fileID: 0}
  m_PrefabInstance: {fileID: 0}
  m_PrefabAsset: {fileID: 0}
  m_GameObject: {fileID: 1947499672}
  m_LocalRotation: {x: 0, y: 0, z: 0, w: 1}
  m_LocalPosition: {x: 0, y: 0, z: 0}
  m_LocalScale: {x: 1, y: 1, z: 1}
  m_Children: []
  m_Father: {fileID: 152330287}
  m_RootOrder: 3
  m_LocalEulerAnglesHint: {x: 0, y: 0, z: 0}
--- !u!114 &1947499674
MonoBehaviour:
  m_ObjectHideFlags: 0
  m_CorrespondingSourceObject: {fileID: 0}
  m_PrefabInstance: {fileID: 0}
  m_PrefabAsset: {fileID: 0}
  m_GameObject: {fileID: 1947499672}
  m_Enabled: 1
  m_EditorHideFlags: 0
  m_Script: {fileID: 1077351063, guid: f70555f144d8491a825f0804e09c671c, type: 3}
  m_Name: 
  m_EditorClassIdentifier: 
  m_HorizontalAxis: Horizontal
  m_VerticalAxis: Vertical
  m_SubmitButton: Submit
  m_CancelButton: Cancel
  m_InputActionsPerSecond: 10
  m_RepeatDelay: 0.5
  m_ForceModuleActive: 0
--- !u!114 &1947499675
MonoBehaviour:
  m_ObjectHideFlags: 0
  m_CorrespondingSourceObject: {fileID: 0}
  m_PrefabInstance: {fileID: 0}
  m_PrefabAsset: {fileID: 0}
  m_GameObject: {fileID: 1947499672}
  m_Enabled: 1
  m_EditorHideFlags: 0
  m_Script: {fileID: -619905303, guid: f70555f144d8491a825f0804e09c671c, type: 3}
  m_Name: 
  m_EditorClassIdentifier: 
  m_FirstSelected: {fileID: 0}
  m_sendNavigationEvents: 1
  m_DragThreshold: 10
--- !u!1001 &778398511978233295
PrefabInstance:
  m_ObjectHideFlags: 0
  serializedVersion: 2
  m_Modification:
    m_TransformParent: {fileID: 1334670279}
    m_Modifications:
    - target: {fileID: 1455154436397684, guid: d217b6971454f481cac1e722660f65f2, type: 3}
      propertyPath: m_Name
      value: Quiz Manager
      objectReference: {fileID: 0}
    - target: {fileID: 778398511978233386, guid: d217b6971454f481cac1e722660f65f2,
        type: 3}
      propertyPath: m_Value
      value: 2
      objectReference: {fileID: 0}
    - target: {fileID: 224879591050310894, guid: d217b6971454f481cac1e722660f65f2,
        type: 3}
      propertyPath: m_LocalPosition.x
      value: 0
      objectReference: {fileID: 0}
    - target: {fileID: 224879591050310894, guid: d217b6971454f481cac1e722660f65f2,
        type: 3}
      propertyPath: m_LocalPosition.y
      value: 0
      objectReference: {fileID: 0}
    - target: {fileID: 224879591050310894, guid: d217b6971454f481cac1e722660f65f2,
        type: 3}
      propertyPath: m_LocalPosition.z
      value: 0
      objectReference: {fileID: 0}
    - target: {fileID: 224879591050310894, guid: d217b6971454f481cac1e722660f65f2,
        type: 3}
      propertyPath: m_LocalRotation.x
      value: -0
      objectReference: {fileID: 0}
    - target: {fileID: 224879591050310894, guid: d217b6971454f481cac1e722660f65f2,
        type: 3}
      propertyPath: m_LocalRotation.y
      value: -0
      objectReference: {fileID: 0}
    - target: {fileID: 224879591050310894, guid: d217b6971454f481cac1e722660f65f2,
        type: 3}
      propertyPath: m_LocalRotation.z
      value: -0
      objectReference: {fileID: 0}
    - target: {fileID: 224879591050310894, guid: d217b6971454f481cac1e722660f65f2,
        type: 3}
      propertyPath: m_LocalRotation.w
      value: 1
      objectReference: {fileID: 0}
    - target: {fileID: 224879591050310894, guid: d217b6971454f481cac1e722660f65f2,
        type: 3}
      propertyPath: m_RootOrder
      value: 0
      objectReference: {fileID: 0}
    - target: {fileID: 224879591050310894, guid: d217b6971454f481cac1e722660f65f2,
        type: 3}
      propertyPath: m_LocalEulerAnglesHint.x
      value: 0
      objectReference: {fileID: 0}
    - target: {fileID: 224879591050310894, guid: d217b6971454f481cac1e722660f65f2,
        type: 3}
      propertyPath: m_LocalEulerAnglesHint.y
      value: 0
      objectReference: {fileID: 0}
    - target: {fileID: 224879591050310894, guid: d217b6971454f481cac1e722660f65f2,
        type: 3}
      propertyPath: m_LocalEulerAnglesHint.z
      value: 0
      objectReference: {fileID: 0}
    - target: {fileID: 224879591050310894, guid: d217b6971454f481cac1e722660f65f2,
        type: 3}
      propertyPath: m_AnchoredPosition.x
      value: 0
      objectReference: {fileID: 0}
    - target: {fileID: 224879591050310894, guid: d217b6971454f481cac1e722660f65f2,
        type: 3}
      propertyPath: m_AnchoredPosition.y
      value: 0
      objectReference: {fileID: 0}
    - target: {fileID: 224879591050310894, guid: d217b6971454f481cac1e722660f65f2,
        type: 3}
      propertyPath: m_SizeDelta.x
      value: 0
      objectReference: {fileID: 0}
    - target: {fileID: 224879591050310894, guid: d217b6971454f481cac1e722660f65f2,
        type: 3}
      propertyPath: m_SizeDelta.y
      value: 0
      objectReference: {fileID: 0}
    - target: {fileID: 224879591050310894, guid: d217b6971454f481cac1e722660f65f2,
        type: 3}
      propertyPath: m_AnchorMin.x
      value: 0
      objectReference: {fileID: 0}
    - target: {fileID: 224879591050310894, guid: d217b6971454f481cac1e722660f65f2,
        type: 3}
      propertyPath: m_AnchorMin.y
      value: 0
      objectReference: {fileID: 0}
    - target: {fileID: 224879591050310894, guid: d217b6971454f481cac1e722660f65f2,
        type: 3}
      propertyPath: m_AnchorMax.x
      value: 1
      objectReference: {fileID: 0}
    - target: {fileID: 224879591050310894, guid: d217b6971454f481cac1e722660f65f2,
        type: 3}
      propertyPath: m_AnchorMax.y
      value: 1
      objectReference: {fileID: 0}
    - target: {fileID: 224879591050310894, guid: d217b6971454f481cac1e722660f65f2,
        type: 3}
      propertyPath: m_Pivot.x
      value: 0.5
      objectReference: {fileID: 0}
    - target: {fileID: 224879591050310894, guid: d217b6971454f481cac1e722660f65f2,
        type: 3}
      propertyPath: m_Pivot.y
      value: 0.5
      objectReference: {fileID: 0}
    - target: {fileID: 224164791514700684, guid: d217b6971454f481cac1e722660f65f2,
        type: 3}
      propertyPath: m_AnchorMin.y
      value: 0
      objectReference: {fileID: 0}
    - target: {fileID: 224164791514700684, guid: d217b6971454f481cac1e722660f65f2,
        type: 3}
      propertyPath: m_AnchorMax.y
      value: 0
      objectReference: {fileID: 0}
    - target: {fileID: 224164791514700684, guid: d217b6971454f481cac1e722660f65f2,
        type: 3}
      propertyPath: m_AnchoredPosition.x
      value: 0
      objectReference: {fileID: 0}
    - target: {fileID: 224164791514700684, guid: d217b6971454f481cac1e722660f65f2,
        type: 3}
      propertyPath: m_AnchoredPosition.y
      value: 0
      objectReference: {fileID: 0}
    - target: {fileID: 224164791514700684, guid: d217b6971454f481cac1e722660f65f2,
        type: 3}
      propertyPath: m_SizeDelta.x
      value: 0
      objectReference: {fileID: 0}
    - target: {fileID: 224164791514700684, guid: d217b6971454f481cac1e722660f65f2,
        type: 3}
      propertyPath: m_SizeDelta.y
      value: 0
      objectReference: {fileID: 0}
    - target: {fileID: 224542953482683292, guid: d217b6971454f481cac1e722660f65f2,
        type: 3}
      propertyPath: m_AnchorMin.y
      value: 0
      objectReference: {fileID: 0}
    - target: {fileID: 224542953482683292, guid: d217b6971454f481cac1e722660f65f2,
        type: 3}
      propertyPath: m_AnchorMax.y
      value: 0
      objectReference: {fileID: 0}
    - target: {fileID: 224542953482683292, guid: d217b6971454f481cac1e722660f65f2,
        type: 3}
      propertyPath: m_AnchoredPosition.x
      value: 0
      objectReference: {fileID: 0}
    - target: {fileID: 224542953482683292, guid: d217b6971454f481cac1e722660f65f2,
        type: 3}
      propertyPath: m_AnchoredPosition.y
      value: 0
      objectReference: {fileID: 0}
    - target: {fileID: 224542953482683292, guid: d217b6971454f481cac1e722660f65f2,
        type: 3}
      propertyPath: m_SizeDelta.x
      value: 0
      objectReference: {fileID: 0}
    - target: {fileID: 224542953482683292, guid: d217b6971454f481cac1e722660f65f2,
        type: 3}
      propertyPath: m_SizeDelta.y
      value: 0
      objectReference: {fileID: 0}
    - target: {fileID: 224495384876833450, guid: d217b6971454f481cac1e722660f65f2,
        type: 3}
      propertyPath: m_AnchorMin.y
      value: 0
      objectReference: {fileID: 0}
    - target: {fileID: 224495384876833450, guid: d217b6971454f481cac1e722660f65f2,
        type: 3}
      propertyPath: m_AnchorMax.y
      value: 0
      objectReference: {fileID: 0}
    - target: {fileID: 224495384876833450, guid: d217b6971454f481cac1e722660f65f2,
        type: 3}
      propertyPath: m_AnchoredPosition.x
      value: 0
      objectReference: {fileID: 0}
    - target: {fileID: 224495384876833450, guid: d217b6971454f481cac1e722660f65f2,
        type: 3}
      propertyPath: m_AnchoredPosition.y
      value: 0
      objectReference: {fileID: 0}
    - target: {fileID: 224495384876833450, guid: d217b6971454f481cac1e722660f65f2,
        type: 3}
      propertyPath: m_SizeDelta.x
      value: 0
      objectReference: {fileID: 0}
    - target: {fileID: 224495384876833450, guid: d217b6971454f481cac1e722660f65f2,
        type: 3}
      propertyPath: m_SizeDelta.y
      value: 0
      objectReference: {fileID: 0}
    - target: {fileID: 114715388612887794, guid: d217b6971454f481cac1e722660f65f2,
        type: 3}
      propertyPath: cameraZoom
      value: 
      objectReference: {fileID: 1906362992}
    - target: {fileID: 778398511978233308, guid: d217b6971454f481cac1e722660f65f2,
        type: 3}
      propertyPath: m_OnClick.m_PersistentCalls.m_Calls.Array.data[0].m_Target
      value: 
      objectReference: {fileID: 164165049}
    - target: {fileID: 778398511978233381, guid: d217b6971454f481cac1e722660f65f2,
        type: 3}
      propertyPath: m_OnClick.m_PersistentCalls.m_Calls.Array.data[0].m_Target
      value: 
      objectReference: {fileID: 164165049}
    - target: {fileID: 778398511978233459, guid: d217b6971454f481cac1e722660f65f2,
        type: 3}
      propertyPath: m_OnClick.m_PersistentCalls.m_Calls.Array.data[0].m_Target
      value: 
      objectReference: {fileID: 164165049}
    - target: {fileID: 778398511978233474, guid: d217b6971454f481cac1e722660f65f2,
        type: 3}
      propertyPath: m_OnClick.m_PersistentCalls.m_Calls.Array.data[0].m_Target
      value: 
      objectReference: {fileID: 164165049}
    - target: {fileID: 6767087079876948939, guid: d217b6971454f481cac1e722660f65f2,
        type: 3}
      propertyPath: m_AnchorMax.x
      value: 0
      objectReference: {fileID: 0}
    - target: {fileID: 6767087079876948939, guid: d217b6971454f481cac1e722660f65f2,
        type: 3}
      propertyPath: m_AnchorMax.y
      value: 0
      objectReference: {fileID: 0}
    - target: {fileID: 3761034618364080355, guid: d217b6971454f481cac1e722660f65f2,
        type: 3}
      propertyPath: m_AnchorMax.y
      value: 0
      objectReference: {fileID: 0}
    - target: {fileID: 3761034618364080355, guid: d217b6971454f481cac1e722660f65f2,
        type: 3}
      propertyPath: m_AnchorMin.x
      value: 0
      objectReference: {fileID: 0}
    - target: {fileID: 3761034618364080355, guid: d217b6971454f481cac1e722660f65f2,
        type: 3}
      propertyPath: m_AnchorMax.x
      value: 0
      objectReference: {fileID: 0}
    - target: {fileID: 3789546992481418203, guid: d217b6971454f481cac1e722660f65f2,
        type: 3}
      propertyPath: m_IsActive
      value: 0
      objectReference: {fileID: 0}
    - target: {fileID: 4210244574374086263, guid: d217b6971454f481cac1e722660f65f2,
        type: 3}
      propertyPath: m_AnchorMin.x
      value: 0
      objectReference: {fileID: 0}
    - target: {fileID: 4210244574374086263, guid: d217b6971454f481cac1e722660f65f2,
        type: 3}
      propertyPath: m_AnchorMax.x
      value: 0
      objectReference: {fileID: 0}
    - target: {fileID: 4210244574374086263, guid: d217b6971454f481cac1e722660f65f2,
        type: 3}
      propertyPath: m_AnchorMax.y
      value: 0
      objectReference: {fileID: 0}
    - target: {fileID: 4210075240780927599, guid: d217b6971454f481cac1e722660f65f2,
        type: 3}
      propertyPath: m_AnchorMax.x
      value: 0
      objectReference: {fileID: 0}
    - target: {fileID: 4210075240780927599, guid: d217b6971454f481cac1e722660f65f2,
        type: 3}
      propertyPath: m_AnchorMax.y
      value: 0
      objectReference: {fileID: 0}
    m_RemovedComponents: []
  m_SourcePrefab: {fileID: 100100000, guid: d217b6971454f481cac1e722660f65f2, type: 3}
--- !u!1 &3787987155841548243 stripped
GameObject:
  m_CorrespondingSourceObject: {fileID: 1845903826538010, guid: d217b6971454f481cac1e722660f65f2,
    type: 3}
  m_PrefabInstance: {fileID: 778398511978233295}
  m_PrefabAsset: {fileID: 0}
--- !u!1 &3788869890365400339 stripped
GameObject:
  m_CorrespondingSourceObject: {fileID: 1101702448321754, guid: d217b6971454f481cac1e722660f65f2,
    type: 3}
  m_PrefabInstance: {fileID: 778398511978233295}
  m_PrefabAsset: {fileID: 0}
--- !u!224 &4001943198161847591 stripped
RectTransform:
  m_CorrespondingSourceObject: {fileID: 224879591050310894, guid: d217b6971454f481cac1e722660f65f2,
    type: 3}
  m_PrefabInstance: {fileID: 778398511978233295}
  m_PrefabAsset: {fileID: 0}
