<svg id="Facebook_6_" xmlns="http://www.w3.org/2000/svg" width="37.283" height="37.283" viewBox="0 0 37.283 37.283">
  <path id="Path_50" data-name="Path 50" d="M348.241,286.583a18.641,18.641,0,1,1,18.641-18.641A18.651,18.651,0,0,1,348.241,286.583Zm0-35.867a17.226,17.226,0,1,0,17.226,17.226A17.261,17.261,0,0,0,348.241,250.716Z" transform="translate(-329.6 -249.3)" fill="#fff"/>
  <path id="Facebook_1_" d="M367.767,286.076a.947.947,0,0,1-.944.944h-4.436v-6.7h2.265l.33-2.6h-2.6v-1.652c0-.755.189-1.274,1.274-1.274h1.369v-2.36a15.456,15.456,0,0,0-2.029-.094,3.149,3.149,0,0,0-3.351,3.445v1.935h-2.265v2.6h2.265v6.7h-8.306a.947.947,0,0,1-.944-.944V270.644a.947.947,0,0,1,.944-.944h15.432a.947.947,0,0,1,.944.944v15.432Z" transform="translate(-340.584 -260.073)" fill="#fff"/>
</svg>
