{
    "key": "group_601e907abd788",
    "title": "Flexible Content",
    "fields": [
        {
            "key": "field_601e90c873aa5",
            "label": "Flexible Content",
            "name": "flexible_content",
            "type": "flexible_content",
            "instructions": "",
            "required": 0,
            "conditional_logic": 0,
            "wrapper": {
                "width": "",
                "class": "",
                "id": ""
            },
            "layouts": {
                "layout_601e90d518617": {
                    "key": "layout_601e90d518617",
                    "name": "introduction",
                    "label": "Introduction",
                    "display": "block",
                    "sub_fields": [
                        {
                            "key": "field_601e90eb73aa6",
                            "label": "Introduction",
                            "name": "introduction",
                            "type": "clone",
                            "instructions": "",
                            "required": 0,
                            "conditional_logic": 0,
                            "wrapper": {
                                "width": "",
                                "class": "",
                                "id": ""
                            },
                            "clone": [
                                "group_601e9095dca9c"
                            ],
                            "display": "seamless",
                            "layout": "block",
                            "prefix_label": 0,
                            "prefix_name": 0
                        }
                    ],
                    "min": "",
                    "max": ""
                },
                "layout_601e9830c56d7": {
                    "key": "layout_601e9830c56d7",
                    "name": "sticky_information",
                    "label": "Sticky Information",
                    "display": "block",
                    "sub_fields": [
                        {
                            "key": "field_601e9842c56d8",
                            "label": "Sticky Information",
                            "name": "sticky_information",
                            "type": "clone",
                            "instructions": "",
                            "required": 0,
                            "conditional_logic": 0,
                            "wrapper": {
                                "width": "",
                                "class": "",
                                "id": ""
                            },
                            "clone": [
                                "group_601e98571653f"
                            ],
                            "display": "seamless",
                            "layout": "block",
                            "prefix_label": 0,
                            "prefix_name": 0
                        }
                    ],
                    "min": "",
                    "max": ""
                },
                "layout_601e96e33adce": {
                    "key": "layout_601e96e33adce",
                    "name": "information",
                    "label": "Information",
                    "display": "block",
                    "sub_fields": [
                        {
                            "key": "field_601e96e33adcf",
                            "label": "Information",
                            "name": "information",
                            "type": "clone",
                            "instructions": "",
                            "required": 0,
                            "conditional_logic": 0,
                            "wrapper": {
                                "width": "",
                                "class": "",
                                "id": ""
                            },
                            "clone": [
                                "group_601e970a628b7"
                            ],
                            "display": "seamless",
                            "layout": "block",
                            "prefix_label": 0,
                            "prefix_name": 0
                        }
                    ],
                    "min": "",
                    "max": ""
                },
                "layout_601ea008364b1": {
                    "key": "layout_601ea008364b1",
                    "name": "video",
                    "label": "Video",
                    "display": "block",
                    "sub_fields": [
                        {
                            "key": "field_601ea009364b2",
                            "label": "Video",
                            "name": "video",
                            "type": "clone",
                            "instructions": "",
                            "required": 0,
                            "conditional_logic": 0,
                            "wrapper": {
                                "width": "",
                                "class": "",
                                "id": ""
                            },
                            "clone": [
                                "group_601e9fa458b55"
                            ],
                            "display": "seamless",
                            "layout": "block",
                            "prefix_label": 0,
                            "prefix_name": 0
                        }
                    ],
                    "min": "",
                    "max": ""
                },
                "layout_601fec8be3d56": {
                    "key": "layout_601fec8be3d56",
                    "name": "marquee",
                    "label": "Marquee",
                    "display": "block",
                    "sub_fields": [
                        {
                            "key": "field_601fec92e3d57",
                            "label": "Marquee",
                            "name": "marquee",
                            "type": "clone",
                            "instructions": "",
                            "required": 0,
                            "conditional_logic": 0,
                            "wrapper": {
                                "width": "",
                                "class": "",
                                "id": ""
                            },
                            "clone": [
                                "group_601fec3ec6c5f"
                            ],
                            "display": "seamless",
                            "layout": "block",
                            "prefix_label": 0,
                            "prefix_name": 0
                        }
                    ],
                    "min": "",
                    "max": ""
                },
                "layout_6027e0ab23439": {
                    "key": "layout_6027e0ab23439",
                    "name": "gallery",
                    "label": "Gallery",
                    "display": "block",
                    "sub_fields": [
                        {
                            "key": "field_6027e0ab2343a",
                            "label": "Gallery",
                            "name": "gallery",
                            "type": "clone",
                            "instructions": "",
                            "required": 0,
                            "conditional_logic": 0,
                            "wrapper": {
                                "width": "",
                                "class": "",
                                "id": ""
                            },
                            "clone": [
                                "group_6027e07ad90fc"
                            ],
                            "display": "seamless",
                            "layout": "block",
                            "prefix_label": 0,
                            "prefix_name": 0
                        }
                    ],
                    "min": "",
                    "max": ""
                }
            },
            "button_label": "Add Block",
            "min": "",
            "max": ""
        }
    ],
    "location": [
        [
            {
                "param": "post_type",
                "operator": "==",
                "value": "post"
            }
        ]
    ],
    "menu_order": 0,
    "position": "normal",
    "style": "default",
    "label_placement": "top",
    "instruction_placement": "label",
    "hide_on_screen": "",
    "active": false,
    "description": "",
    "modified": 1613298676
}