{
    "/js/app.js": "/js/app.js?id=6a9a0535d61e978a233e",
    "/css/app.css": "/css/app.css?id=7cd9516a98fa1769cdd8",
    "/js/manifest.js": "/js/manifest.js?id=41f053ba9a94d81b39f8",
    "/js/vendor.js": "/js/vendor.js?id=a0d0d71231c76e88ad6f"
}
