^D:\FACULDADE\3º SEMESTRE\PROJETO INTEGRADO\PROJETO_27-11-2010\AMSTERDAN5.3\AMSTERDAN5.3\AMSTERDAN5.0\AMSTERDAN\IBIZA\FORM1.RESX|D:\FACULDADE\3º SEMESTRE\PROJETO INTEGRADO\PROJETO_27-11-2010\AMSTERDAN5.3\AMSTERDAN5.3\AMSTERDAN5.0\AMSTERDAN\IBIZA\FORM2.RESX|D:\FACULDADE\3º SEMESTRE\PROJETO INTEGRADO\PROJETO_27-11-2010\AMSTERDAN5.3\AMSTERDAN5.3\AMSTERDAN5.0\AMSTERDAN\IBIZA\FORM3.RESX|D:\FACULDADE\3º SEMESTRE\PROJETO INTEGRADO\PROJETO_27-11-2010\AMSTERDAN5.3\AMSTERDAN5.3\AMSTERDAN5.0\AMSTERDAN\IBIZA\PROPERTIES\RESOURCES.RESX
D:\FACULDADE\3º SEMESTRE\PROJETO INTEGRADO\PROJETO_27-11-2010\AMSTERDAN5.3\AMSTERDAN5.3\AMSTERDAN5.0\AMSTERDAN\IBIZA\OBJ\RELEASE\AMSTERDAN.FORM1.RESOURCES
D:\FACULDADE\3º SEMESTRE\PROJETO INTEGRADO\PROJETO_27-11-2010\AMSTERDAN5.3\AMSTERDAN5.3\AMSTERDAN5.0\AMSTERDAN\IBIZA\OBJ\RELEASE\AMSTERDAN.FORM2.RESOURCES
D:\FACULDADE\3º SEMESTRE\PROJETO INTEGRADO\PROJETO_27-11-2010\AMSTERDAN5.3\AMSTERDAN5.3\AMSTERDAN5.0\AMSTERDAN\IBIZA\OBJ\RELEASE\AMSTERDAN.FORM3.RESOURCES
D:\FACULDADE\3º SEMESTRE\PROJETO INTEGRADO\PROJETO_27-11-2010\AMSTERDAN5.3\AMSTERDAN5.3\AMSTERDAN5.0\AMSTERDAN\IBIZA\OBJ\RELEASE\AMSTERDAN.PROPERTIES.RESOURCES.RESOURCES
