{
	"🎨 Improving structure / format of the code": {
		"prefix": "gm Update code",
		"body": ":art: Improve $1"
	},
	"⚡️ Improving performance": {
		"prefix": "gm Update performance",
		"body": ":zap: Improve $1"
	},
	"🔥 Removing code": {
		"prefix": "gm Remove code",
		"body": ":fire: Remove $1"
	},
	"🔥 Removing files": {
		"prefix": "gm Remove file",
		"body": ":fire: Remove $1"
	},
	"🐛 Fixing a bug": {
		"prefix": "gm Fix bug",
		"body": ":bug: Fix $1"
	},
	"🚑 Critical hotfix": {
		"prefix": "gm Fix",
		"body": ":ambulance: $1"
	},
	"✨ Introducing new features": {
		"prefix": "gm Add new",
		"body": ":sparkles: Add $1"
	},
	"📝 Writing docs": {
		"prefix": "gm Add Update doc",
		"body": ":memo: $1"
	},
	"🚀 Deploying stuff": {
		"prefix": "gm release deploy",
		"body": ":rocket: $1"
	},
	"💄 Updating the UI and style files": {
		"prefix": "gm Update file",
		"body": ":lipstick: Update $1"
	},
	"🎉 Initial commit": {
		"prefix": "gm Initial commit release",
		"body": ":tada: Initial commit $1"
	},
	"✅ Adding tests": {
		"prefix": "gm Add test",
		"body": ":white_check_mark: $1"
	},
	"🔒 Fixing security issues": {
		"prefix": "gm Fix security",
		"body": ":lock: Fix $1"
	},
	"🍎 Fixing something on macOS": {
		"prefix": "gm Fix macos",
		"body": ":apple: Fix $1"
	},
	"🐧 Fixing something on Linux": {
		"prefix": "gm Fix linux",
		"body": ":penguin: Fix $1"
	},
	"🏁 Fixing something on Windows": {
		"prefix": "gm Fix windows",
		"body": ":checkered_flag: Fix $1"
	},
	"🤖 Fixing something on Android": {
		"prefix": "gm Fix android",
		"body": ":robot: Fix $1"
	},
	"🍏 Fixing something on iOS": {
		"prefix": "gm Fix ios",
		"body": ":green_apple: Fix $1"
	},
	"🔖 Releasing / Version tags": {
		"prefix": "gm release version tag",
		"body": ":bookmark: $1"
	},
	"🚨 Removing linter warnings": {
		"prefix": "gm Update code linter",
		"body": ":rotating_light: $1"
	},
	"🚧 Work in progress": {
		"prefix": "gm work progress",
		"body": ":construction: $1"
	},
	"💚 Fixing CI Build": {
		"prefix": "gm Fix ci build",
		"body": ":green_heart: $1"
	},
	"⬆️ Upgrading dependencies": {
		"prefix": "gm Update dependency",
		"body": ":arrow_up: $1"
	},
	"⬇️ Downgrading dependencies": {
		"prefix": "gm Update dependency",
		"body": ":arrow_down: $1"
	},
	"👷 Adding CI build system": {
		"prefix": "gm Add ci build",
		"body": ":construction_worker: $1"
	},
	"📈 Adding analytics or tracking code": {
		"prefix": "gm Add analytics tracking code",
		"body": ":chart_with_upwards_trend: Add $1"
	},
	"🔨 Refactoring code": {
		"prefix": "gm Update code",
		"body": ":hammer: Refactor $1"
	},
	"➖ Removing a dependency": {
		"prefix": "gm Remove dependency",
		"body": ":heavy_minus_sign: Remove $1"
	},
	"🐳 Work about Docker": {
		"prefix": "gm work docker",
		"body": ":whale: $1"
	},
	"➕ Adding a dependency": {
		"prefix": "gm Add dependency",
		"body": ":heavy_plus_sign: Add $1"
	},
	"🔧 Changing configuration files": {
		"prefix": "gm Update file config",
		"body": ":wrench: Update $1"
	},
	"🌐 Internationalization and localization": {
		"prefix": "gm lang i18n l10n",
		"body": ":globe_with_meridians: $1"
	},
	"✏️ Fixing typos": {
		"prefix": "gm Fix typo",
		"body": ":pencil2: Fix $1"
	},
	"💩 Writing bad code that needs to be Improved": {
		"prefix": "gm bad code",
		"body": ":hankey: Write $1"
	},
	"⏪ Reverting changes": {
		"prefix": "gm Remove back",
		"body": ":rewind: Revert $1"
	},
	"🔀 Merging branches": {
		"prefix": "gm Update merge branch",
		"body": ":twisted_rightwards_arrows: Merge $1"
	},
	"📦 Updating compiled files or packages": {
		"prefix": "gm Update file",
		"body": ":package: $1"
	},
	"👽 Updating code due to external API changes": {
		"prefix": "gm Update code",
		"body": ":alien: Update $1"
	},
	"🚚 Moving files": {
		"prefix": "gm Update move file",
		"body": ":truck: Move $1"
	},
	"🚚 Renaming files": {
		"prefix": "gm Update rename file",
		"body": ":truck: Rename $1"
	},
	"📄 Adding license": {
		"prefix": "gm Add license",
		"body": ":page_facing_up: Add $1"
	},
	"📄 Updating license": {
		"prefix": "gm Update license",
		"body": ":page_facing_up: Update $1"
	},
	"💥 Introducing breaking changes": {
		"prefix": "gm Add new",
		"body": ":boom: Add $1"
	},
	"🍱 Adding assets": {
		"prefix": "gm Add file",
		"body": ":bento: Add $1"
	},
	"🍱 Updating assets": {
		"prefix": "gm Update file",
		"body": ":bento: Update $1"
	},
	"👌 Updating code due to code review changes": {
		"prefix": "gm Update code",
		"body": ":ok_hand: Update $1"
	},
	"♿️ Improving accessibility": {
		"prefix": "gm Improve accessibility",
		"body": ":wheelchair: Improve $1"
	},
	"💡 Documenting source code": {
		"prefix": "gm code documentation",
		"body": ":bulb: Document $1"
	},
	"🍻 Writing code drunkenly": {
		"prefix": "gm code drunk beer",
		"body": ":beers: Drunkenly code $1"
	},
	"💬 Adding text and literals": {
		"prefix": "gm Add text",
		"body": ":speech_balloon: Add $1"
	},
	"💬 Updating text and literals": {
		"prefix": "gm Update text",
		"body": ":speech_balloon: Update $1"
	},
	"🗃 Performing database related changes": {
		"prefix": "gm db database",
		"body": ":card_file_box: $1"
	},
	"🔊 Adding logs": {
		"prefix": "gm Add logs",
		"body": ":loud_sound: Add $1"
	},
	"🔇 Removing logs": {
		"prefix": "gm Remove logs",
		"body": ":mute: Remove $1"
	},
	"👥 Adding contributor(s)": {
		"prefix": "gm Add contributor",
		"body": ":busts_in_silhouette: Add $1"
	},
	"🚸 Improving user experience / usability": {
		"prefix": "gm Improve ux user experience usability",
		"body": ":children_crossing: Improve $1"
	},
	"🏗 Making architectural changes": {
		"prefix": "gm Update architecture changes",
		"body": ":building_construction: Change $1"
	},
	"📱 Working on responsive design": {
		"prefix": "gm responsive web design",
		"body": ":iphone: Adapt $1"
	},
	"🤡 Mocking things": {
		"prefix": "gm mocking",
		"body": ":clown_face: Mock $1"
	},
	"🍱 Commit Message Template": {
		"prefix": "gm template",
		"body": "$type $subject\n\n$description"
	}
}