^C:\USERS\STANISLAV\DESKTOP\УЧУСЬ\OSISP PART 2\LAB 6\INJECTION\DEBUG\MAIN.OBJ
C:\USERS\STANISLAV\DESKTOP\Учусь\OSISP PART 2\LAB 6\DEBUG\INJECTION.ILK
C:\USERS\STANISLAV\DESKTOP\Учусь\OSISP PART 2\LAB 6\DEBUG\INJECTION.EXE
C:\USERS\STANISLAV\DESKTOP\УЧУСЬ\OSISP PART 2\LAB 6\DEBUG\INJECTION.PDB
