^C:\USERS\STANISLAV\DESKTOP\УЧУСЬ\OSISPLAB2\OSISPLAB2\DEBUG\MAIN.OBJ
/OUT:"C:\USERS\STANISLAV\DESKTOP\УЧУСЬ\OSISPLAB2\DEBUG\OSISPLAB2.EXE" /INCREMENTAL /NOLOGO kernel32.lib user32.lib gdi32.lib winspool.lib comdlg32.lib advapi32.lib shell32.lib ole32.lib oleaut32.lib uuid.lib odbc32.lib odbccp32.lib /MANIFEST /MANIFESTUAC:"level='asInvoker' uiAccess='false'" /manifest:embed /DEBUG /PDB:"C:\USERS\STANISLAV\DESKTOP\УЧУСЬ\OSISPLAB2\DEBUG\OSISPLAB2.PDB" /TLBID:1 /DYNAMICBASE /NXCOMPAT /IMPLIB:"C:\USERS\STANISLAV\DESKTOP\УЧУСЬ\OSISPLAB2\DEBUG\OSISPLAB2.LIB" /MACHINE:X86 DEBUG\MAIN.OBJ
^C:\USERS\STANISLAV\DESKTOP\УЧУСЬ\OSISPLAB2\LAB2\OSISPLAB2\DEBUG\MAIN.OBJ
/OUT:"C:\USERS\STANISLAV\DESKTOP\УЧУСЬ\OSISPLAB2\LAB2\DEBUG\OSISPLAB2.EXE" /INCREMENTAL /NOLOGO kernel32.lib user32.lib gdi32.lib winspool.lib comdlg32.lib advapi32.lib shell32.lib ole32.lib oleaut32.lib uuid.lib odbc32.lib odbccp32.lib /MANIFEST /MANIFESTUAC:"level='asInvoker' uiAccess='false'" /manifest:embed /DEBUG /PDB:"C:\USERS\STANISLAV\DESKTOP\УЧУСЬ\OSISPLAB2\LAB2\DEBUG\OSISPLAB2.PDB" /TLBID:1 /DYNAMICBASE /NXCOMPAT /IMPLIB:"C:\USERS\STANISLAV\DESKTOP\УЧУСЬ\OSISPLAB2\LAB2\DEBUG\OSISPLAB2.LIB" /MACHINE:X86 DEBUG\MAIN.OBJ
