^C:\USERS\STANISLAV\DESKTOP\УЧУСЬ\OSISP PART 2\LAB 6\LAB 6\DEBUG\DLLMAIN.OBJ|C:\USERS\STANISLAV\DESKTOP\УЧУСЬ\OSISP PART 2\LAB 6\LAB 6\DEBUG\LAB 6.OBJ|C:\USERS\STANISLAV\DESKTOP\УЧУСЬ\OSISP PART 2\LAB 6\LAB 6\DEBUG\STDAFX.OBJ
C:\USERS\STANISLAV\DESKTOP\Учусь\OSISP PART 2\LAB 6\DEBUG\LAB 6.ILK
C:\USERS\STANISLAV\DESKTOP\Учусь\OSISP PART 2\LAB 6\DEBUG\LAB 6.DLL
C:\USERS\STANISLAV\DESKTOP\УЧУСЬ\OSISP PART 2\LAB 6\DEBUG\LAB 6.PDB
