^C:\USERS\STANISLAV\DESKTOP\УЧУСЬ\OSISPLAB2\LAB2\OSISPLAB2\DEBUG\MAIN.OBJ
C:\USERS\STANISLAV\DESKTOP\Учусь\OSISPLAB2\LAB2\DEBUG\OSISPLAB2.ILK
C:\USERS\STANISLAV\DESKTOP\Учусь\OSISPLAB2\LAB2\DEBUG\OSISPLAB2.EXE
C:\USERS\STANISLAV\DESKTOP\УЧУСЬ\OSISPLAB2\LAB2\DEBUG\OSISPLAB2.PDB
