{
	"info": {
		"_postman_id": "3d1c7358-e133-4728-b051-6a8abdd6077e",
		"name": "smart_solutions",
		"schema": "https://schema.getpostman.com/json/collection/v2.1.0/collection.json"
	},
	"item": [
		{
			"name": "Usuário",
			"item": [
				{
					"name": "Create",
					"request": {
						"method": "POST",
						"header": [
							{
								"key": "Content-Type",
								"name": "Content-Type",
								"value": "application/json",
								"type": "text"
							}
						],
						"body": {
							"mode": "raw",
							"raw": "{\n    \"nome\": \"lorem\",\n    \"sobrenome\": \"ipsum\",\n    \"email\": \"lorem@ipsum.com\",\n    \"senha\": \"123\"\n}"
						},
						"url": {
							"raw": "http://34.201.45.32:3005/app/v1/usuario",
							"protocol": "http",
							"host": [
								"34",
								"201",
								"45",
								"32"
							],
							"port": "3005",
							"path": [
								"app",
								"v1",
								"usuario"
							]
						},
						"description": "Cria um novo usuário"
					},
					"response": []
				},
				{
					"name": "Read",
					"request": {
						"method": "GET",
						"header": [],
						"body": {
							"mode": "raw",
							"raw": ""
						},
						"url": {
							"raw": "http://34.201.45.32:3005/app/v1/usuario/5cb343b4e2f36b0bbc821fec",
							"protocol": "http",
							"host": [
								"34",
								"201",
								"45",
								"32"
							],
							"port": "3005",
							"path": [
								"app",
								"v1",
								"usuario",
								"5cb343b4e2f36b0bbc821fec"
							]
						},
						"description": "Busca usuário por id"
					},
					"response": []
				},
				{
					"name": "Update",
					"request": {
						"method": "PUT",
						"header": [
							{
								"key": "Content-Type",
								"name": "Content-Type",
								"type": "text",
								"value": "application/json"
							}
						],
						"body": {
							"mode": "raw",
							"raw": "{\n    \"nome\": \"lorem\",\n    \"sobrenome\": \"ipsum\",\n    \"email\": \"lorem@ipsum.com\",\n    \"senha\": \"123456\"\n}"
						},
						"url": {
							"raw": "http://34.201.45.32:3005/app/v1/usuario/5ce2f8baa33d0b0d20efc198",
							"protocol": "http",
							"host": [
								"34",
								"201",
								"45",
								"32"
							],
							"port": "3005",
							"path": [
								"app",
								"v1",
								"usuario",
								"5ce2f8baa33d0b0d20efc198"
							]
						},
						"description": "Atualiza cadastro do usuário"
					},
					"response": []
				},
				{
					"name": "Delete",
					"request": {
						"method": "DELETE",
						"header": [],
						"body": {
							"mode": "raw",
							"raw": ""
						},
						"url": {
							"raw": "http://34.201.45.32:3005/app/v1/usuario/5ce2fb87a33d0b0d20efc19a",
							"protocol": "http",
							"host": [
								"34",
								"201",
								"45",
								"32"
							],
							"port": "3005",
							"path": [
								"app",
								"v1",
								"usuario",
								"5ce2fb87a33d0b0d20efc19a"
							]
						},
						"description": "Remove usuário por id"
					},
					"response": []
				},
				{
					"name": "List",
					"request": {
						"method": "GET",
						"header": [],
						"body": {
							"mode": "raw",
							"raw": ""
						},
						"url": {
							"raw": "http://34.201.45.32:3005/app/v1/usuario/listar",
							"protocol": "http",
							"host": [
								"34",
								"201",
								"45",
								"32"
							],
							"port": "3005",
							"path": [
								"app",
								"v1",
								"usuario",
								"listar"
							]
						},
						"description": "Lista todos usuários do sistema"
					},
					"response": []
				},
				{
					"name": "Find",
					"request": {
						"method": "GET",
						"header": [],
						"body": {
							"mode": "raw",
							"raw": ""
						},
						"url": {
							"raw": "http://34.201.45.32:3005/app/v1/usuario/buscar?nome=Felipe",
							"protocol": "http",
							"host": [
								"34",
								"201",
								"45",
								"32"
							],
							"port": "3005",
							"path": [
								"app",
								"v1",
								"usuario",
								"buscar"
							],
							"query": [
								{
									"key": "nome",
									"value": "Felipe"
								}
							]
						},
						"description": "Busca por querystring"
					},
					"response": []
				}
			]
		},
		{
			"name": "Automação",
			"item": [
				{
					"name": "Create",
					"request": {
						"method": "POST",
						"header": [
							{
								"key": "Content-Type",
								"name": "Content-Type",
								"value": "application/json",
								"type": "text"
							}
						],
						"body": {
							"mode": "raw",
							"raw": "{\n    \"usuario\": \"5cb343b4e2f36b0bbc821fec\",\n    \"em_casa\": true\n}"
						},
						"url": {
							"raw": "http://34.201.45.32:3005/app/v1/automacao",
							"protocol": "http",
							"host": [
								"34",
								"201",
								"45",
								"32"
							],
							"port": "3005",
							"path": [
								"app",
								"v1",
								"automacao"
							]
						},
						"description": "Cria uma nova automação para usuário"
					},
					"response": []
				},
				{
					"name": "Read",
					"request": {
						"method": "GET",
						"header": [],
						"body": {
							"mode": "raw",
							"raw": ""
						},
						"url": {
							"raw": "http://34.201.45.32:3005/app/v1/automacao/5ce2fd69a33d0b0d20efc19b",
							"protocol": "http",
							"host": [
								"34",
								"201",
								"45",
								"32"
							],
							"port": "3005",
							"path": [
								"app",
								"v1",
								"automacao",
								"5ce2fd69a33d0b0d20efc19b"
							]
						},
						"description": "Busca automação por id"
					},
					"response": []
				},
				{
					"name": "Update",
					"request": {
						"method": "PUT",
						"header": [
							{
								"key": "Content-Type",
								"name": "Content-Type",
								"type": "text",
								"value": "application/json"
							}
						],
						"body": {
							"mode": "raw",
							"raw": "{\n    \"usuario\": \"5cb343b4e2f36b0bbc821fec\",\n    \"em_casa\": false\n}"
						},
						"url": {
							"raw": "http://34.201.45.32:3005/app/v1/automacao/5ce2fd69a33d0b0d20efc19b",
							"protocol": "http",
							"host": [
								"34",
								"201",
								"45",
								"32"
							],
							"port": "3005",
							"path": [
								"app",
								"v1",
								"automacao",
								"5ce2fd69a33d0b0d20efc19b"
							]
						},
						"description": "Atualiza cadastro da automação"
					},
					"response": []
				},
				{
					"name": "Delete",
					"request": {
						"method": "DELETE",
						"header": [],
						"body": {
							"mode": "raw",
							"raw": ""
						},
						"url": {
							"raw": "http://34.201.45.32:3005/app/v1/automacao/5ce2fdf8a33d0b0d20efc19d",
							"protocol": "http",
							"host": [
								"34",
								"201",
								"45",
								"32"
							],
							"port": "3005",
							"path": [
								"app",
								"v1",
								"automacao",
								"5ce2fdf8a33d0b0d20efc19d"
							]
						},
						"description": "Remove automação por id"
					},
					"response": []
				},
				{
					"name": "List",
					"request": {
						"method": "GET",
						"header": [],
						"body": {
							"mode": "raw",
							"raw": ""
						},
						"url": {
							"raw": "http://34.201.45.32:3005/app/v1/automacao/listar",
							"protocol": "http",
							"host": [
								"34",
								"201",
								"45",
								"32"
							],
							"port": "3005",
							"path": [
								"app",
								"v1",
								"automacao",
								"listar"
							]
						},
						"description": "Lista todas as automações do sistema"
					},
					"response": []
				},
				{
					"name": "Find",
					"request": {
						"method": "GET",
						"header": [],
						"body": {
							"mode": "raw",
							"raw": ""
						},
						"url": {
							"raw": "http://34.201.45.32:3005/app/v1/automacao/buscar?usuario=5cb343b4e2f36b0bbc821fec",
							"protocol": "http",
							"host": [
								"34",
								"201",
								"45",
								"32"
							],
							"port": "3005",
							"path": [
								"app",
								"v1",
								"automacao",
								"buscar"
							],
							"query": [
								{
									"key": "usuario",
									"value": "5cb343b4e2f36b0bbc821fec"
								}
							]
						},
						"description": "Busca por querystring"
					},
					"response": []
				}
			],
			"event": [
				{
					"listen": "prerequest",
					"script": {
						"id": "13348aea-4d05-44ad-9cc7-63f40552da37",
						"type": "text/javascript",
						"exec": [
							""
						]
					}
				},
				{
					"listen": "test",
					"script": {
						"id": "5ba1cf74-fa74-4411-9671-487f776c95c9",
						"type": "text/javascript",
						"exec": [
							""
						]
					}
				}
			]
		},
		{
			"name": "Dispositivos",
			"item": [
				{
					"name": "Create",
					"request": {
						"method": "POST",
						"header": [
							{
								"key": "Content-Type",
								"name": "Content-Type",
								"type": "text",
								"value": "application/json"
							}
						],
						"body": {
							"mode": "raw",
							"raw": "{\n    \"usuario\": \"5cb343b4e2f36b0bbc821fec\",\n    \"ip\": \"127.0.0.1\",\n    \"nome\": \"tv\",\n    \"descricao\": \"quarto\",\n    \"ativo\": true,\n    \"consumo\": false\n}"
						},
						"url": {
							"raw": "http://34.201.45.32:3005/app/v1/dispositivos",
							"protocol": "http",
							"host": [
								"34",
								"201",
								"45",
								"32"
							],
							"port": "3005",
							"path": [
								"app",
								"v1",
								"dispositivos"
							]
						},
						"description": "Cria um novo dispositivo para usuário"
					},
					"response": []
				},
				{
					"name": "Read",
					"request": {
						"method": "GET",
						"header": [],
						"body": {
							"mode": "raw",
							"raw": ""
						},
						"url": {
							"raw": "http://34.201.45.32:3005/app/v1/dispositivos/5ce2ff64a33d0b0d20efc19e",
							"protocol": "http",
							"host": [
								"34",
								"201",
								"45",
								"32"
							],
							"port": "3005",
							"path": [
								"app",
								"v1",
								"dispositivos",
								"5ce2ff64a33d0b0d20efc19e"
							]
						},
						"description": "Busca dispositivo por id"
					},
					"response": []
				},
				{
					"name": "Update",
					"request": {
						"method": "PUT",
						"header": [
							{
								"key": "Content-Type",
								"name": "Content-Type",
								"type": "text",
								"value": "application/json"
							}
						],
						"body": {
							"mode": "raw",
							"raw": "{\n    \"_id\": \"5ce2ff64a33d0b0d20efc19e\",\n    \"usuario\": \"5cb343b4e2f36b0bbc821fec\",\n    \"ip\": \"127.0.0.1\",\n    \"nome\": \"tv\",\n    \"descricao\": \"quarto\",\n    \"ativo\": true,\n    \"consumo\": false\n}"
						},
						"url": {
							"raw": "http://34.201.45.32:3005/app/v1/dispositivos/5ce2ff64a33d0b0d20efc19e",
							"protocol": "http",
							"host": [
								"34",
								"201",
								"45",
								"32"
							],
							"port": "3005",
							"path": [
								"app",
								"v1",
								"dispositivos",
								"5ce2ff64a33d0b0d20efc19e"
							]
						},
						"description": "Atualiza cadastro do dispositivo"
					},
					"response": []
				},
				{
					"name": "Delete",
					"request": {
						"method": "DELETE",
						"header": [],
						"body": {
							"mode": "raw",
							"raw": ""
						},
						"url": {
							"raw": "http://34.201.45.32:3005/app/v1/dispositivos/5ce2ffe5a33d0b0d20efc1a0",
							"protocol": "http",
							"host": [
								"34",
								"201",
								"45",
								"32"
							],
							"port": "3005",
							"path": [
								"app",
								"v1",
								"dispositivos",
								"5ce2ffe5a33d0b0d20efc1a0"
							]
						},
						"description": "Remove dispositivo por id"
					},
					"response": []
				},
				{
					"name": "List",
					"request": {
						"method": "GET",
						"header": [],
						"body": {
							"mode": "raw",
							"raw": ""
						},
						"url": {
							"raw": "http://34.201.45.32:3005/app/v1/dispositivos/listar",
							"protocol": "http",
							"host": [
								"34",
								"201",
								"45",
								"32"
							],
							"port": "3005",
							"path": [
								"app",
								"v1",
								"dispositivos",
								"listar"
							]
						},
						"description": "Lista todos dispositivos cadastrados no sistema"
					},
					"response": []
				},
				{
					"name": "Find",
					"request": {
						"method": "GET",
						"header": [],
						"body": {
							"mode": "raw",
							"raw": ""
						},
						"url": {
							"raw": "http://34.201.45.32:3005/app/v1/dispositivos/buscar?usuario=5cb343b4e2f36b0bbc821fec",
							"protocol": "http",
							"host": [
								"34",
								"201",
								"45",
								"32"
							],
							"port": "3005",
							"path": [
								"app",
								"v1",
								"dispositivos",
								"buscar"
							],
							"query": [
								{
									"key": "usuario",
									"value": "5cb343b4e2f36b0bbc821fec"
								}
							]
						},
						"description": "Busca por querystring"
					},
					"response": []
				}
			],
			"event": [
				{
					"listen": "prerequest",
					"script": {
						"id": "13348aea-4d05-44ad-9cc7-63f40552da37",
						"type": "text/javascript",
						"exec": [
							""
						]
					}
				},
				{
					"listen": "test",
					"script": {
						"id": "5ba1cf74-fa74-4411-9671-487f776c95c9",
						"type": "text/javascript",
						"exec": [
							""
						]
					}
				}
			]
		},
		{
			"name": "Coleta Consumo",
			"item": [
				{
					"name": "Create",
					"request": {
						"method": "POST",
						"header": [
							{
								"key": "Content-Type",
								"name": "Content-Type",
								"type": "text",
								"value": "application/json"
							}
						],
						"body": {
							"mode": "raw",
							"raw": "{\n    \"dispositivo\": \"5cb35ab6a33d0b0d20efc193\",\n    \"power\": 0,\n    \"factor\": 0,\n    \"voltage\": 0,\n    \"current\": 0\n}"
						},
						"url": {
							"raw": "http://34.201.45.32:3005/app/v1/coleta-consumo",
							"protocol": "http",
							"host": [
								"34",
								"201",
								"45",
								"32"
							],
							"port": "3005",
							"path": [
								"app",
								"v1",
								"coleta-consumo"
							]
						},
						"description": "Cria um novo registro de consumo para um determinado dispositivo"
					},
					"response": []
				},
				{
					"name": "Read",
					"request": {
						"method": "GET",
						"header": [],
						"body": {
							"mode": "raw",
							"raw": ""
						},
						"url": {
							"raw": "http://34.201.45.32:3005/app/v1/coleta-consumo/5ce3010ba33d0b0d20efc1a1",
							"protocol": "http",
							"host": [
								"34",
								"201",
								"45",
								"32"
							],
							"port": "3005",
							"path": [
								"app",
								"v1",
								"coleta-consumo",
								"5ce3010ba33d0b0d20efc1a1"
							]
						},
						"description": "Busca uma coleta de consumo por id"
					},
					"response": []
				},
				{
					"name": "Update",
					"request": {
						"method": "PUT",
						"header": [
							{
								"key": "Content-Type",
								"name": "Content-Type",
								"type": "text",
								"value": "application/json"
							}
						],
						"body": {
							"mode": "raw",
							"raw": "{\n    \"dispositivo\": \"5cb35ab6a33d0b0d20efc193\",\n    \"power\": 1,\n    \"factor\": 1,\n    \"voltage\": 1,\n    \"current\": 1\n}"
						},
						"url": {
							"raw": "http://34.201.45.32:3005/app/v1/coleta-consumo/5ce3010ba33d0b0d20efc1a1",
							"protocol": "http",
							"host": [
								"34",
								"201",
								"45",
								"32"
							],
							"port": "3005",
							"path": [
								"app",
								"v1",
								"coleta-consumo",
								"5ce3010ba33d0b0d20efc1a1"
							]
						},
						"description": "Atualiza dados de consumo do dispositivo"
					},
					"response": []
				},
				{
					"name": "Delete",
					"request": {
						"method": "DELETE",
						"header": [],
						"body": {
							"mode": "raw",
							"raw": ""
						},
						"url": {
							"raw": "http://34.201.45.32:3005/app/v1/coleta-consumo/5ce30152a33d0b0d20efc1a3",
							"protocol": "http",
							"host": [
								"34",
								"201",
								"45",
								"32"
							],
							"port": "3005",
							"path": [
								"app",
								"v1",
								"coleta-consumo",
								"5ce30152a33d0b0d20efc1a3"
							]
						},
						"description": "Remove coleta de consumo por id"
					},
					"response": []
				},
				{
					"name": "List",
					"request": {
						"method": "GET",
						"header": [],
						"body": {
							"mode": "raw",
							"raw": ""
						},
						"url": {
							"raw": "http://34.201.45.32:3005/app/v1/coleta-consumo/listar",
							"protocol": "http",
							"host": [
								"34",
								"201",
								"45",
								"32"
							],
							"port": "3005",
							"path": [
								"app",
								"v1",
								"coleta-consumo",
								"listar"
							]
						},
						"description": "Lista todos registros de coleta de consumo cadastrados no sistema"
					},
					"response": []
				},
				{
					"name": "Find",
					"request": {
						"method": "GET",
						"header": [],
						"body": {
							"mode": "raw",
							"raw": ""
						},
						"url": {
							"raw": "http://34.201.45.32:3005/app/v1/coleta-consumo/buscar?dispositivo=5cb35ab6a33d0b0d20efc193",
							"protocol": "http",
							"host": [
								"34",
								"201",
								"45",
								"32"
							],
							"port": "3005",
							"path": [
								"app",
								"v1",
								"coleta-consumo",
								"buscar"
							],
							"query": [
								{
									"key": "dispositivo",
									"value": "5cb35ab6a33d0b0d20efc193"
								}
							]
						},
						"description": "Busca por querystring"
					},
					"response": []
				}
			],
			"event": [
				{
					"listen": "prerequest",
					"script": {
						"id": "13348aea-4d05-44ad-9cc7-63f40552da37",
						"type": "text/javascript",
						"exec": [
							""
						]
					}
				},
				{
					"listen": "test",
					"script": {
						"id": "5ba1cf74-fa74-4411-9671-487f776c95c9",
						"type": "text/javascript",
						"exec": [
							""
						]
					}
				}
			]
		}
	]
}