{
    "D": {
        "string": "Jour",
        "context": "Day",
        "character_limit": 50
    },
    "M": {
        "string": "Mois",
        "context": "Month",
        "character_limit": 50
    },
    "W": {
        "string": "Semaine",
        "context": "Week",
        "character_limit": 50
    },
    "X": {
        "string": "Sur demande",
        "context": "On Request",
        "character_limit": 50
    }
}