{
    "0": {
        "string": "Generic",
        "context": "Generic",
        "character_limit": 50
    },
    "1": {
        "string": "Inner",
        "context": "Inner",
        "character_limit": 50
    },
    "2": {
        "string": "Outer",
        "context": "Outer",
        "character_limit": 50
    },
    "3": {
        "string": "Both",
        "context": "Both",
        "character_limit": 50
    },
    "4": {
        "string": "All",
        "context": "All",
        "character_limit": 50
    },
    "-2": {
        "string": "Alternate",
        "context": "Alternate",
        "character_limit": 50
    },
    "-1": {
        "string": "Alternate",
        "context": "Alternate",
        "character_limit": 50
    }
}