{
    "1": {
        "string": "Financeiro e Administrativo",
        "context": "Finance and Administration",
        "character_limit": 50
    },
    "2": {
        "string": "Vendas e Marketing",
        "context": "Sales and Marketing",
        "character_limit": 50
    },
    "3": {
        "string": "Chef Executivo",
        "context": "Executive Chef",
        "character_limit": 50
    },
    "4": {
        "string": "Gerente da Cozinha",
        "context": "Kitchen Manager",
        "character_limit": 50
    },
    "5": {
        "string": "Funcionário da Cozinha",
        "context": "Kitchen Staff",
        "character_limit": 50
    },
    "6": {
        "string": "Gestão",
        "context": "Management",
        "character_limit": 50
    },
    "7": {
        "string": "Outro",
        "context": "Other",
        "character_limit": 50
    },
    "8": {
        "string": "Funcionário Bidfood",
        "context": "Bidvest Staff",
        "character_limit": 50
    },
    "9": {
        "string": "Comprando",
        "context": "Purchasing",
        "character_limit": 50
    },
    "10": {
        "string": "Proprietário",
        "context": "Business Owner",
        "character_limit": 50
    },
    "11": {
        "string": "Fornecedor/Fabricante",
        "context": "Supplier/Manufacturer",
        "character_limit": 50
    },
    "12": {
        "string": "Funcionário da Logística Bidfood ",
        "context": "Bidvest Logistics Staff",
        "character_limit": 50
    }
}