{
    "1": {
        "string": "Planificación y cálculo de costos",
        "context": "Planning & Costing",
        "character_limit":100
    },
    "2": {
        "string": "Formulario de pedido",
        "context": "OrderForm",
        "character_limit":100
    },
    "3": {
        "string": "Canasto",
        "context": "Basket",
        "character_limit":100
    },
    "4": {
        "string": "Envío de pedidos",
        "context": "Order Submission",
        "character_limit":100
    }
}