{
    "G": {
        "string": "G",
        "context": "G",
        "character_limit": 50
    },
    "ML": {
        "string": "ML",
        "context": "ML",
        "character_limit": 50
    },
    "PCE": {
        "string": "PCE",
        "context": "PCE",
        "character_limit": 50
    }
}