{
    "A": {
        "O": {
            "string": "购物车被批准人批准",
            "context": "Basket approved by approver",
			"character_limit":50
        },
        "P": {
            "string": "付款被批准人批准",
            "context": "Payment approved by approver",
			"character_limit":50
        }
    },
    "D": {
        "O": {
            "string": "购物车被批准人拒绝",
            "context": "Basket declined by approver",
			"character_limit":50
        },
        "P": {
            "string": "付款被批准人拒绝",
            "context": "Payment declined by approver",
			"character_limit":50
        }
    },
    "E": {
        "O": {
            "string": "已批准超时升级操作",
            "context": "Approval timeout escalation actioned",
			"character_limit":50
        },
        "P": {
            "string": "已批准超时升级操作",
            "context": "Approval timeout escalation actioned",
			"character_limit":50
        }
    },
    "L": {
        "O": {
            "string": "购物车被锁定，以只读状态打开",
            "context": "Basket locked for editing",
			"character_limit":50
        }
    },
    "M": {
        "O": {
            "string": "购物车被批准人修改",
            "context": "Basket modified by approver",
			"character_limit":50
        }
    },
    "O": {
        "O": {
            "string": "从已批准的购物车创建的订单",
            "context": "Order created from approved basket",
			"character_limit":50
        }
    },
    "R": {
        "O": {
            "string": "允许提醒功能",
            "context": "Approval reminder actioned",
			"character_limit":50
        },
        "P": {
            "string": "允许提醒功能",
            "context": "Approval reminder actioned",
			"character_limit":50
        }
    },
    "S": {
        "O": {
            "string": "提交订单待审批",
            "context": "Basket submitted for approval",
			"character_limit":50
        },
        "P": {
            "string": "提交付款待审批",
            "context": "Payment submitted for approval",
			"character_limit":50
        }
    },
    "U": {
        "O": {
            "string": "订单解锁",
            "context": "Basket unlocked",
			"character_limit":50
        }
    }
}
