{
    "1": {
        "string": "价值",
        "context": "Value",
        "character_limit":50
    },
    "2": {
        "string": "体积",
        "context": "Volume",
        "character_limit":50
    },
    "3": {
        "string": "频率",
        "context": "Frequency",
        "character_limit":50
    }
}