{
   "A":{
      "string":"İşleme Alınacak",
      "context":"Awaiting Processing",
      "character_limit": 50
   },
      "A_nz":{
      "string":"Beklemede",
      "context":"Awaiting Processing",
      "character_limit": 50
   },
      "A_za":{
      "string":"Gönderilmedi",
      "context":"Awaiting Processing",
      "character_limit": 50
   },
      "A_waltons":{
      "string":"Gönderilmedi",
      "context":"Awaiting Processing",
      "character_limit": 50
   },
      "A_pp":{
      "string":"Gönderilmedi",
      "context":"Awaiting Processing",
      "character_limit": 50
   },
      "A_fsuk":{
      "string":"Gönderilmedi",
      "context":"Awaiting Processing",
      "character_limit": 50
   },
    "B":{
      "string":"Ön Sipariş",
      "context":"Backorder",
      "character_limit": 50
   },
   "C":{
      "string":"İptal",
      "context":"Cancelled",
      "character_limit": 50
   },
   "D":{
      "string":"Sevk Edildi",
      "context":"Dispatched",
      "character_limit": 50
   },
    "D_au":{
      "string":"Sevk Edildi",
      "context":"Dispatched",
      "character_limit": 50
   },
    "D_aiv":{
      "string":"Sevk Edildi",
      "context":"Dispatched",
      "character_limit": 50
   },
    "D_cfg":{
      "string":"Açık Sipariş",
      "context":"Dispatched",
      "character_limit": 50
   },
     "E":{
      "string":"İrsaliye",
      "context":"Despatch",
      "character_limit": 50
   },
     "F":{
      "string":"İleri Sipariş",
      "context":"Forward Order",
      "character_limit": 50
   },
   "F_za":{
      "string":"Mal Kabul Belgesi",
      "context":"Forward Order",
      "character_limit": 50
   },
   "G":{
      "string":"İşlemde",
      "context":"In Progress",
      "character_limit": 50
   },
     "H":{
      "string":"Beklemede",
      "context":"On Hold",
      "character_limit": 50
   },
     "H_angliss":{
      "string":"Kredi Limiti",
      "context":"On Hold",
      "character_limit": 50
   },
     "I":{
      "string":"Faturalandı",
      "context":"Invoiced",
      "character_limit": 50
   },
     "I_cfg":{
      "string":"İşlemde",
      "context":"In Progress",
      "character_limit": 50
   },
   "J":{
      "string":"İşlemde",
      "context":"Processing",
      "character_limit": 50
   },
    "L":{
      "string":"Yük Listesinde",
      "context":"Picklist",
      "character_limit": 50
   },
    "L_pp":{
      "string":"İşlemde",
      "context":"Processing",
      "character_limit": 50
   },
    "M":{
      "string":"Yük Listesinde",
      "context":"Picklist (WMS)",
      "character_limit": 50
   },
    "M_cfg":{
      "string":"Tamamlandı",
      "context":"Complete",
      "character_limit": 50
   },
    "M_angliss":{
      "string":"Tamamlandı & Faturalandı",
      "context":"Completed & Invoiced",
      "character_limit": 50
   },
    "N":{
      "string":"Yolda",
      "context":"In transit",
      "character_limit": 50
   },
   
   "O":{
      "string":"E-Posta Siparişi",
      "context":"Email Order",
      "character_limit": 50
   },
   "P":{
      "string":"Gönderildi",
      "context":"Sent",
      "character_limit": 50
   },
   "P_au":{
      "string":"İşlendi",
      "context":"Processed",
      "character_limit": 50
   },
   "P_aiv":{
      "string":"İşlendi",
      "context":"Processed",
      "character_limit": 50
   },
   "P_cfg":{
      "string":"İşlendi",
      "context":"Processed",
      "character_limit": 50
   },
    "P_fsuk":{
      "string":"Sunuldu",
      "context":"Submitted",
      "character_limit": 50
   },
   "Q":{
      "string":"Teklif",
      "context":"Quote",
      "character_limit": 50
   },
    "R":{
      "string":"Faturalamaya hazır",
      "context":"Ready to Invoice",
      "character_limit": 50
   },
    "R_za":{
      "string":"Tekrar Sevk",
      "context":"ReDelivery",
      "character_limit": 50
   },
    "S":{
      "string":"Beklemede",
      "context":"Suspense",
      "character_limit": 50
   },
   "T":{
      "string":"İncelemede",
      "context":"Under Review",
      "character_limit": 50
   },
   "U":{
      "string":"Tanımsız Durum",
      "context":"Unrecognised Status",
      "character_limit": 50
   },
   "V":{
      "string":"Geçersiz Sipariş",
      "context":"Invalid",
      "character_limit": 50
   },
    "W":{
      "string":"Yükleme Bekliyor",
      "context":"Wait Pick",
      "character_limit": 50
   },
    "W_cfg":{
      "string":"Depoda",
      "context":"In Warehouse",
      "character_limit": 50
   },
    "W_angliss":{
      "string":"Sipariş Bırakıldı",
      "context":"Order Released",
      "character_limit": 50
   },
    "X":{
      "string":"Satır İptal",
      "context":"Line Cancelled",
      "character_limit": 50
   }
}