{
    "1": {
        "string": "Planning et costing",
        "context": "Planning & Costing",
        "character_limit":100
    },
    "2": {
        "string": "Modèle de commande",
        "context": "OrderForm",
        "character_limit":100
    },
    "3": {
        "string": "Panier",
        "context": "Basket",
        "character_limit":100
    },
    "4": {
        "string": "Soumission de la commande",
        "context": "Order Submission",
        "character_limit":100
    }
}