{
    "A": {
        "O": {
            "string": "Sepet onaylayıcı tarafından onaylandı",
            "context": "Basket approved by approver",
			"character_limit":50
        },
        "P": {
            "string": "Ödeme onaylayıcı tarafından onaylandı",
            "context": "Payment approved by approver",
			"character_limit":50
        }
    },
    "D": {
        "O": {
            "string": "Sepet onaylayıcı tarafından reddedildi",
            "context": "Basket declined by approver",
			"character_limit":50
        },
        "P": {
            "string": "Ödeme onaylayıcı tarafından reddedildi",
            "context": "Payment declined by approver",
			"character_limit":50
        }
    },
    "E": {
        "O": {
            "string": "Onay zaman aşımına uğradı, uzatma işlendi",
            "context": "Approval timeout escalation actioned",
			"character_limit":50
        },
        "P": {
            "string": "Onay zaman aşımına uğradı, uzatma işlendi",
            "context": "Approval timeout escalation actioned",
			"character_limit":50
        }
    },
    "L": {
        "O": {
            "string": "Sepet düzenleme için kilitlendi",
            "context": "Basket locked for editing",
			"character_limit":50
        }
    },
    "M": {
        "O": {
            "string": "Sepet onaylayıcı tarafından değiştirildi",
            "context": "Basket modified by approver",
			"character_limit":50
        }
    },
    "O": {
        "O": {
            "string": "Sipariş onaylanan sepetten oluşturuldu",
            "context": "Order created from approved basket",
			"character_limit":50
        }
    },
    "R": {
        "O": {
            "string": "Onay hatırlatıcısı çalıştı",
            "context": "Approval reminder actioned",
			"character_limit":50
        },
        "P": {
            "string": "Onay hatırlatıcısı çalıştı",
            "context": "Approval reminder actioned",
			"character_limit":50
        }
    },
    "S": {
        "O": {
            "string": "Sepet onaya gönderildi",
            "context": "Basket submitted for approval",
			"character_limit":50
        },
        "P": {
            "string": "Ödeme onaya gönderildi",
            "context": "Payment submitted for approval",
			"character_limit":50
        }
    },
    "U": {
        "O": {
            "string": "Sepet kilidi açıldı",
            "context": "Basket unlocked",
			"character_limit":50
        }
    }
}
