{
    "1": {
        "string": "成功",
        "context": "Successful",
        "character_limit": 100
    },
    "2": {
        "string": "失败",
        "context": "Failed",
        "character_limit": 100
    },
    "3": {
        "string": "未处理",
        "context": "Unprocessed",
        "character_limit": 100
    },
    "4": {
        "string": "未知",
        "context": "Unknown",
        "character_limit": 100
    },
    "5": {
        "string": "取消",
        "context": "Cancelled",
        "character_limit": 100
    }
}