{
    "1": {
        "string": "Sąskaitų",
        "context": "Individual Invoices",
        "character_limit": 100
    },
    "2": {
        "string": "Neapmokėta",
        "context": "Outstanding Balance",
        "character_limit": 100
    },
    "3": {
        "string": "Pradelsta",
        "context": "Overdue Balance",
        "character_limit": 100
    },
    "4": {
        "string": "Kitos sumos",
        "context": "Other Amount",
        "character_limit": 100
    }
}