{
    "1": {
        "string": "Verificado",
        "context": "Verified",
        "character_limit": 50
    },
    "2": {
        "string": "Conta Não Encontrada",
        "context": "Account Not Found",
        "character_limit": 50
    },
    "3": {
        "string": "Conta não disponível",
        "context": "Account Not Available",
        "character_limit": 50
    },
    "4": {
        "string": "Esperando Atualização",
        "context": "Awaiting Upload",
        "character_limit": 50
    }
}