{
    "1": {
        "string": "Superado",
        "context": "Superceded",
        "character_limit":25
    },
    "2": {
        "string": "No disponible",
        "context": "Not Available",
        "character_limit":25
    },
    "3": {
        "string": "Temperatura no Disponible",
        "context": "Temp Unavailable",
        "character_limit":25
    },
    "4": {
        "string": "Agotado",
        "context": "Out Of Stock",
        "character_limit":25
    },
    "5": {
        "string": "Suministro corto",
        "context": "Short Supply",
        "character_limit":25
    },
    "6": {
        "string": "En Pedidos pedientes",
        "context": "On Backorder",
        "character_limit":25
    },
    "7": {
        "string": "Cuenta sin acceso",
        "context": "No account access",
        "character_limit":25
    }
}