{
    "0": {
        "string": "Sin estado",
        "context": "Waiting Picking",
        "character_limit": 50
    },
    "1": {
        "string": "Pendiente de procesar ",
        "context": "In Picking",
        "character_limit": 50
    },
    "2": {
        "string": "Enviado a almacen",
        "context": "Part Shipped",
        "character_limit": 50
    },
    "3": {
        "string": "En preparación",
        "context": "Complete",
        "character_limit": 50
    },
    "4": {
        "string": "En ruta",
        "context": "OnHold",
        "character_limit": 50
    },
    "5": {
        "string": "Entregado",
        "context": "In preparation",
        "character_limit": 50
    },
    "6": {
        "string": "Facturado",
        "context": "Sent",
        "character_limit": 50
    },
    "7": {
        "string": "En revision",
        "context": "Backorder",
        "character_limit": 50
    },
    "8": {
        "string": "Anulado",
        "context": "PartPick",
        "character_limit": 50
    },
    "9": {
        "string": "*",
        "context": "Picklist (WMS, 0 , 1 )",
        "character_limit": 50
    },
    "10": {
        "string": "*",
        "context": "Order Unprinted",
        "character_limit": 50
    },
    "11": {
        "string": "*",
        "context": "Order Pending",
        "character_limit": 50
    },
    "12": {
        "string": "*",
        "context": "Awaiting Debtor Approval",
        "character_limit": 50
    },
    "13": {
        "string": "*",
        "context": "Voided",
        "character_limit": 50
    },
    "14": {
        "string": "*",
        "context": "Picking Ticket",
        "character_limit": 50
    },
    "15": {
        "string": "*",
        "context": "Picking Ticket via Debtors",
        "character_limit": 50
    },
    "16": {
        "string": "*",
        "context": "Invoiced",
        "character_limit": 50
    },
    "17": {
        "string": "*",
        "context": "Truck",
        "character_limit": 50
    },
    "18": {
        "string": "*",
        "context": "POD",
        "character_limit": 50
    },
    "19": {
        "string": "*",
        "context": "POD Outstanding",
        "character_limit": 50
    },
    "20": {
        "string": "*",
        "context": "ReDelivery",
        "character_limit": 50
    },
    "21": {
        "string": "*",
        "context": "POD Scanned",
        "character_limit": 50
    },
    "22": {
        "string": "*",
        "context": "Full Credit Passed",
        "character_limit": 50
    },
    "23": {
        "string": "*",
        "context": "Partially on Truck",
        "character_limit": 50
    },
    "24": {
        "string": "*",
        "context": "Partial POD",
        "character_limit": 50
    },
    "25": {
        "string": "*",
        "context": "Partial POD Outstanding",
        "character_limit": 50
    },
    "27": {
        "string": "*",
        "context": "Partially Invoiced",
        "character_limit": 50
    },
    "28": {
        "string": "*",
        "context": "Partial Credit",
        "character_limit": 50
    },
    "98": {
        "string": "*",
        "context": "Unrecognised Status",
        "character_limit": 50
    },
    "99": {
        "string": "*",
        "context": "Cancelled",
        "character_limit": 50
    },
    "100": {
        "string": "*",
        "context": "In Process",
        "character_limit": 50
    },
    "110": {
        "string": "*",
        "context": "Open Order",
        "character_limit": 50
    },
    "120": {
        "string": "*",
        "context": "Open Backorder",
        "character_limit": 50
    },
    "130": {
        "string": "*",
        "context": "Released Backorder",
        "character_limit": 50
    },
    "140": {
        "string": "*",
        "context": "In Warehouse",
        "character_limit": 50
    },
    "150": {
        "string": "*",
        "context": "Ready to Invoice",
        "character_limit": 50
    },
    "160": {
        "string": "*",
        "context": "Complete",
        "character_limit": 50
    },
    "170": {
        "string": "*",
        "context": "Cancelled During Entry",
        "character_limit": 50
    },
    "180": {
        "string": "*",
        "context": "Cancelled",
        "character_limit": 50
    },
    "190": {
        "string": "*",
        "context": "Quote",
        "character_limit": 50
    },
    "200": {
        "string": "*",
        "context": "Suspense"
    },
    "0_nz": {
        "string": "*",
        "context": "WaitPick",
        "character_limit": 50
    },
    "0_angliss": {
        "string": "*",
        "context": "Order Released",
        "character_limit": 50
    },
    "0_fsuk": {
        "string": "*",
        "context": "Waitpick",
        "character_limit": 50
    },
    "0_ffh": {
        "string": "*",
        "context": "Awaiting Pick",
        "character_limit": 50
    },
    "0_dxl": {
        "string": "*",
        "context": "Awaiting Pick",
        "character_limit": 50
    },
    "0_hrc": {
        "string": "*",
        "context": "Awaiting Pick",
        "character_limit": 50
    },
    "0_br": {
        "string": "*",
        "context": "Pending",
        "character_limit": 50
    },
    "0_cfg": {
        "string": "*",
        "context": "In Process",
        "character_limit": 50
    },
    "0_ib": {
        "string": "Sin estado",
        "context": "No status",
        "character_limit": 50
    },
    "0_lv": {
        "string": "*",
        "context": "Processed",
        "character_limit": 50
    },
    "1_nz": {
        "string": "*",
        "context": "Picklist",
        "character_limit": 50
    },
    "1_pp": {
        "string": "*",
        "context": "Open",
        "character_limit": 50
    },
    "1_ffh": {
        "string": "*",
        "context": "Picklist",
        "character_limit": 50
    },
    "1_angliss": {
        "string": "*",
        "context": "Picking",
        "character_limit": 50
    },
    "1_dxl": {
        "string": "*",
        "context": "Picklist",
        "character_limit": 50
    },
    "1_st": {
        "string": "*",
        "context": "Received",
        "character_limit": 50
    },
    "1_luk": {
        "string": "*",
        "context": "Order Accepted",
        "character_limit": 50
    },
    "1_hrc": {
        "string": "*",
        "context": "Picklist",
        "character_limit": 50
    },
    "1_cfg": {
        "string": "*",
        "context": "Open order",
        "character_limit": 50
    },
    "1_bs": {
        "string": "*",
        "context": "In  Picking",
        "character_limit": 50
    },
    "1_br": {
        "string": "*",
        "context": "Released",
        "character_limit": 50
    },
    "1_ib": {
        "string": "Pendiente de procesar",
        "context": "Pending to process",
        "character_limit": 50
    },
    "1_bme": {
        "string": "*",
        "context": "Awaiting Processing",
        "character_limit": 50
    },
    "1_cp": {
        "string": "*",
        "context": "In process",
        "character_limit": 50
    },
    "2_nz": {
        "string": "*",
        "context": "Despatched",
        "character_limit": 50
    },
    "2_pp": {
        "string": "*",
        "context": "Suspense",
        "character_limit": 50
    },
    "2_angliss": {
        "string": "*",
        "context": "Pick & Ship & Invoiced",
        "character_limit": 50
    },
    "2_dxl": {
        "string": "*",
        "context": "Despatched",
        "character_limit": 50
    },
    "2_fsuk": {
        "string": "*",
        "context": "Picklist/InPicking",
        "character_limit": 50
    },
    "2_st": {
        "string": "*",
        "context": "In progress",
        "character_limit": 50
    },
    "2_luk": {
        "string": "*",
        "context": "Order Accepted with modifications",
        "character_limit": 50
    },
    "2_hrc": {
        "string": "*",
        "context": "Despatched",
        "character_limit": 50
    },
    "2_cfg": {
        "string": "*",
        "context": "Open backorder",
        "character_limit": 50
    },
    "2_br": {
        "string": "*",
        "context": "Locked",
        "character_limit": 50
    },
    "2_ib": {
        "string": "Enviado a almacen",
        "context": "Sent to warehous",
        "character_limit": 50
    },
    "2_bme": {
        "string": "*",
        "context": "In progress",
        "character_limit": 50
    },
    "2_cp": {
        "string": "*",
        "context": "Open order",
        "character_limit": 50
    },
    "3_nz": {
        "string": "*",
        "context": "Invoiced",
        "character_limit": 50
    },
    "3_bme": {
        "string": "*",
        "context": "Processed",
        "character_limit": 50
    },
    "3_waltons": {
        "string": "*",
        "context": "Invoiced",
        "character_limit": 50
    },
    "3_pp": {
        "string": "*",
        "context": "Invoiced",
        "character_limit": 50
    },
    "3_ffh": {
        "string": "*",
        "context": "Invoiced",
        "character_limit": 50
    },
    "3_angliss": {
        "string": "*",
        "context": "Invoiced",
        "character_limit": 50
    },
    "3_dxl": {
        "string": "*",
        "context": "Invoiced",
        "character_limit": 50
    },
    "3_gfox": {
        "string": "*",
        "context": "Invoiced",
        "character_limit": 50
    },
    "3_cp": {
        "string": "*",
        "context": "Open backorder",
        "character_limit": 50
    },
    "3_st": {
        "string": "*",
        "context": "In transit",
        "character_limit": 50
    },
    "3_luk": {
        "string": "*",
        "context": "Order Not Accepted ie. Cancelled",
        "character_limit": 50
    },
    "3_hrc": {
        "string": "*",
        "context": "Invoiced",
        "character_limit": 50
    },
    "3_cfg": {
        "string": "*",
        "context": "Open backorder",
        "character_limit": 50
    },
    "3_br": {
        "string": "*",
        "context": "Locked",
        "character_limit": 50
    },
    "3_ib": {
        "string": "En preparación",
        "context": "In preparation",
        "character_limit": 50
    },
    "4_br": {
        "string": "*",
        "context": "Billed",
        "character_limit": 50
    },
    "4_pp": {
        "string": "*",
        "context": "Processing",
        "character_limit": 50
    },
    "4_angliss": {
        "string": "*",
        "context": "Credit Limit",
        "character_limit": 50
    },
    "4_bme": {
        "string": "*",
        "context": "Invoiced",
        "character_limit": 50
    },
    "4_cp": {
        "string": "*",
        "context": "Released backorder",
        "character_limit": 50
    },
    "4_fsuk": {
        "string": "*",
        "context": "Despatched",
        "character_limit": 50
    },
    "4_st": {
        "string": "*",
        "context": "Delivered",
        "character_limit": 50
    },
    "4_cfg": {
        "string": "*",
        "context": "Released backorder",
        "character_limit": 50
    },
    "4_ib": {
        "string": "En ruta",
        "context": "In transport",
        "character_limit": 50
    },
    "5_nz": {
        "string": "*",
        "context": "Despatch",
        "character_limit": 50
    },
    "5_pp": {
        "string": "*",
        "context": "Open",
        "character_limit": 50
    },
    "5_cp": {
        "string": "*",
        "context": "In warehouse",
        "character_limit": 50
    },
    "5_dxl": {
        "string": "*",
        "context": "Despatch",
        "character_limit": 50
    },
    "5_hrc": {
        "string": "*",
        "context": "Despatch",
        "character_limit": 50
    },
    "5_cfg": {
        "string": "*",
        "context": "In warehouse",
        "character_limit": 50
    },
    "5_ib": {
        "string": "Entregado",
        "context": "Delivered",
        "character_limit": 50
    },
    "6_fsuk": {
        "string": "*",
        "context": "On Hold",
        "character_limit": 50
    },
    "6_waltons": {
        "string": "*",
        "context": "Processing",
        "character_limit": 50
    },
    "6_gfox": {
        "string": "*",
        "context": "Processing",
        "character_limit": 50
    },
    "6_pp": {
        "string": "*",
        "context": "Open",
        "character_limit": 50
    },
    "6_angliss": {
        "string": "*",
        "context": "Open",
        "character_limit": 50
    },
    "6_cp": {
        "string": "*",
        "context": "Ready to invoice",
        "character_limit": 50
    },
    "6_ffh": {
        "string": "*",
        "context": "Processing",
        "character_limit": 50
    },
    "6_cfg": {
        "string": "*",
        "context": "Ready to invoice",
        "character_limit": 50
    },
    "6_ib": {
        "string": "Facturado",
        "context": "Invoiced",
        "character_limit": 50
    },
    "7_angliss": {
        "string": "*",
        "context": "Line Cancelled",
        "character_limit": 50
    },
    "7_dxl": {
        "string": "*",
        "context": "Backorder",
        "character_limit": 50
    },
    "7_hrc": {
        "string": "*",
        "context": "Backorder",
        "character_limit": 50
    },
    "7_cfg": {
        "string": "*",
        "context": "Complete",
        "character_limit": 50
    },
    "7_ib": {
        "string": "En revision",
        "context": "Under revision",
        "character_limit": 50
    },
    "7_cp": {
        "string": "*",
        "context": "Complete",
        "character_limit": 50
    },
    "8_angliss": {
        "string": "*",
        "context": "PartPick",
        "character_limit": 50
    },
    "8_fsuk": {
        "string": "*",
        "context": "Invoiced",
        "character_limit": 50
    },
    "8_cfg": {
        "string": "*",
        "context": "Cancelled during entry",
        "character_limit": 50
    },
    "8_ib": {
        "string": "Anulado",
        "context": "Cancelled",
        "character_limit": 50
    },
    "8_cp": {
        "string": "*",
        "context": "Cancelled during entry",
        "character_limit": 50
    },
    "9_cp": {
        "string": "*",
        "context": "Cancelled",
        "character_limit": 50
    },
    "9_angliss": {
        "string": "*",
        "context": "Warehouse Completed & Invoiced",
        "character_limit": 50
    },
    "9_cfg": {
        "string": "*",
        "context": "Cancelled",
        "character_limit": 50
    },
    "10_pp": {
        "string": "*",
        "context": "Void",
        "character_limit": 50
    },
    "10_angliss": {
        "string": "*",
        "context": "Rejected",
        "character_limit": 50
    },
    "10_cfg": {
        "string": "*",
        "context": "Forward order",
        "character_limit": 50
    },
    "10_cp": {
        "string": "*",
        "context": "Forward order",
        "character_limit": 50
    },
    "11_pp": {
        "string": "*",
        "context": "Cancelled",
        "character_limit": 50
    },
    "11_cp": {
        "string": "*",
        "context": "Suspense",
        "character_limit": 50
    },
    "11_cfg": {
        "string": "*",
        "context": "Suspense",
        "character_limit": 50
    },
    "98_nz": {
        "string": "*",
        "context": "Unrecognised Status",
        "character_limit": 50
    }
}