{
    "1": {
        "string": "Carte de crédit",
        "context": "Credit Card",
        "character_limit": 100
    },
    "2": {
        "string": "Carte de débit",
        "context": "Direct Debit",
        "character_limit": 100
    }
}