{
  "About": "Sobre",
  "Address": "Endereço",
  "Bidfood Code": "Código Bidfood",
  "Bidfood Stock balances as at ": "Saldos de estoque do Bidfood em",
  "Branch": "Filial",
  "Branch Warehouse": "Armazém da Filial",
  "Branch name": "Nome da Filial",
  "Brand": "Marca",
  "Cancel": "Cancelar",
  "Change Password": "Mudar Senha",
  "City": "Cidade",
  "Clear": "Limpar",
  "Collate Results": "Agrupar resultados",
  "Confirm Password": "Confirmar Senha",
  "Contact": "Contato",
  "Contacts": "Contatos",
  "Description": "Descrição",
  "Description / Code": "Descrição/ Código",
  "Email": "Email",
  "End Date": "Data Final",
  "Export to Excel": "Exportar para Excel",
  "Forgotten your password?": "Esqueceu sua Senha?",
  "Log Out": "Sair",
  "Name": "Nome",
  "No Data found": "Nenhum dado encontrado",
  "New Password": "Senha Nova",
  "Old Password": "Senha Antiga",
  "Pack Size": "Tamanho da Embalagem",
  "Password": "Senha",
  "Phone": "Telefone",
  "Forgotten instruction": "Insira seus dados e enviaremos instruções para redefinir sua senha.",
  "Position": "Posição",
  "Print": "Imprimir",
  "Product Category": "Categoria do Produto",
  "Product Line": "Linha do Produto",
  "Records per Page": "Registros por Página",
  "Report": "Relatório",
  "Report By": "Reportado por",
  "Save": "Salvar",
  "Schedule": "Cronograma",
  "Sell-Thru Data": "Data",
  "Sell-Thru Report": "Relatório de Venda",
  "Show All": "Mostrar Tudo",
  "Start Date": "Data Inicial",
  "Stock Report": "Relatório de Estoque",
  "Submit": "Enviar",
  "Supplier Item Code": "Código de item do fornecedor",
  "Supplier Name": "Nome do Fornecedor",
  "Supplier Portal": "Portal do Fornecedor",
  "Terms": "Termos",
  "Terms & Conditions": "Termos e Condições",
  "Total": "Total",
  "UOM": "Unidade de Medida",
  "Warehouse": "Armazém",
  "Warehouse List": "Lista de Armazém",
  "Warehouse Stock": "Estoque do Armazém",
  "Welcome to Supplier Portal": "Bem-vindo ao Portal do Fornecedor",
  "dashboard welcome message": "<p>O Portal do fornecedor está em andamento.</p><p>Você pode esperar para ver algumas mudanças interessantes à medida que continuamos a introduzir novos recursos e funcionalidades.</p><p>Use os itens do menu à esquerda para acessar os recursos à medida que se tornam disponíveis para o seu site.</p>\n",
  "footer copyright": "Direito Autoral ©  {{currentYear}} {{companyName}}. Todos os direitos reservados.",
  "sell-thru report information": "O Relatório de Vendas lista apenas produtos que têm os dados publicados no OPRI.<br>A disponibilidade dos dados é de até 2 dias úteis.<br> Os dados de Vendas da Bidfood em",
  "Sales": "Vendas",
  "Failed to update password": "Falha ao atualizar a senha",
  "Password fields are required": "Os campos da senha são obrigatórios",
  "Both the passwords must match": "Ambas as senhas devem corresponder, por favor, tente novamente",
  "user is required": "Usuário é obrigatório",
  "email is required": "E-mail é obrigatório",
  "email is incorrect": "E-mail está incorreto",
  "reset password successfully": "Se você tiver uma conta válida, receberá um e-mail com mais instruções em breve.",
  "Dashboard": "Painel",
  "Reports": "Relatórios",
  "Links": "Links",
  "OPRI": "OPRI",
  "Supplier Turn In Order": "Entrega de pedido do fornecedor\n ",
  "National Promotions": "Promoções",
  "Users": "Usuários",
  "Incorrect password.": "Senha incorreta.",
  "Your password has been successfully changed.": "Sua senha foi alterada com sucesso.",
  "All": "Todos",
  "Daily": "Diariamente",
  "Weekly": "Semanalmente",
  "Monthly": "Mensalmente",
  "AU_dashboard welcome message": "*",
  "ZA_dashboard welcome message": "*"

}
