{
	"A"  :
	{
		"Description": {
			"string": "Disponível",
			"character_limit": 255
		},
		"Warning": {
			"string": "*",
			"character_limit": 255
		}
	},
	"B"  :
	{
		"Description": {
			"string": "Comprado por encomenda. Permitir entrega em 2 dias",
			"character_limit": 255
		},
		"Warning": {
			"string": "*"
		}
	},
	"B_au":
	{
		"Description": {
			"string": "Produto disponível para pedidos em espera",
			"character_limit": 255
		},
		"Warning": {
			"string": "*"
		}
	},	
	"B_fsuk": 
	{
		"Description": {
			"string": "Comprado por encomenda",
			"character_limit": 255
		},
		"Warning": {
			"string": "*"
		}
	},	
	"B_hrc":
	{
		"Description": {
			"string": "Comprado por encomenda",
			"character_limit": 255
		},
		"Warning": {
			"string": "Pedido em espera"
		}
	},	
	"B3" :
	{
		"Description": {
			"string": "Produto em estoque limitado - a quantidade do seu pedido pode ser ajustada de acordo com o estoque",
			"character_limit": 255
		},
		"Warning": {
			"string": "*"
		}
	},
	
	"E"  :
	{
		"Description": {
			"string": "Experimental",
			"character_limit": 255
		},
		"Warning": {
			"string": "*"
		}
	},
	
	"F"  :
	{
		"Description": {
			"string": "Disponível",
			"character_limit": 255
		},
		"Warning": {
			"string": "*"
		}
	},
	
	"FB" :
	{
		"Description": {
			"string": "Disponível com o tempo de espera",
			"character_limit": 255
		},
		"Warning": {
			"string": "*"
		}
	},
	
	"FS" :
	{
		"Description": {
			"string": "Pescados",
			"character_limit": 255
		},
		"Warning": {
			"string": "*"
		}
	},
	
	"M"  :
	{
		"Description": {
			"string": "Fornecedor fora de estoque",
			"character_limit": 255
		},
		"Warning": {
			"string": "*"
		}
	},
	
	"N"  :
	{
		"Description": {
			"string": "Fim da Linha",
			"character_limit": 255
		},
		"Warning": {
			"string": "*"
		}
	},
	
	"O"  :
	{
		"Description": {
			"string": "Congelado para fresco",
			"character_limit": 255
		},
		"Warning": {
			"string": "*"
		}
	},
	
	"O_hrc"  :
	{
		"Description": {
			"string": "Indisponível",
			"character_limit": 255
		},
		"Warning": {
			"string": "*"
		}
	},
	
	"R1" :
	{
		"Description": {
			"string": "Produto em estoque limitado - a quantidade do seu pedido pode ser ajustada de acordo com o estoque",
			"character_limit": 255
		},
		"Warning": {
			"string": "*"
		}
	},
	
	"RW" :
	{
		"Description": {
			"string": "Peso Variável",
			"character_limit": 255
		},
		"Warning": {
			"string": "*"
		}
	},
	
	"RW_za":
	{
		"Description": {
			"string": "Peso Variável: Unidades entregues = KGS pedida / Tamanho da Embalagem: Peso médio .",
			"character_limit": 255
		},
		"Warning": {
			"string": "*"
		}
	},
	
	"RWB":
	{
		"Description": {
			"string": "Peso Variável, mas a data de entrega a ser informada",
			"character_limit": 255
		},
		"Warning": {
			"string": "*"
		}
	},
	
	"RWB_za":
	{
		"Description": {
			"string": "Peso Variável: Unidades entregues = KGS pedida / Tamanho da Embalagem: Peso médio . Permitir entrega em 3 dias",
			"character_limit": 255
		},
		"Warning": {
			"string": "*"
		}
	},
	
	"S"  :
	{
		"Description": {
			"string": "Limitado",
			"character_limit": 255
		},
		"Warning": {
			"string": "*"
		}
	},
	
	"TBA":
	{
		"Description": {
			"string": "Comprado por encomenda, mas a data de entrega a ser informada",
			"character_limit": 255
		},
		"Warning": {
			"string": "*"
		}
	},
	
	"U"  :
	{
		"Description": {
			"string": "Indisponível",
			"character_limit": 255
		},
		"Warning": {
			"string": "*"
		}
	},
	
	"X"  :
	{
		"Description": {
			"string": "Fim da Linha",
			"character_limit": 255
		},
		"Warning": {
			"string": "*"
		}
	},
	
	"C"  :
	{
		"Description": {
			"string": "Comprado por Encomenda",
			"character_limit": 255
		},
		"Warning": {
			"string": "*"
		}
	},
	
	"D"  :
	{
		"Description": {
			"string": "Será entregue pelo Correio/Fornecedor",
			"character_limit": 255
		},
		"Warning": {
			"string": "*"
		}
	},
	
	"D_fsuk"  :
	{
		"Description": {
			"string": "Será entregue pelo Correio/Fornecedor",
			"character_limit": 255
		},
		"Warning": {
			"string": "*"
		}
	},
	
	"H"  :
	{
		"Description": {
			"string": "Será entregue pelo Correio/Fornecedor",
			"character_limit": 255
		},
		"Warning": {
			"string": "*"
		}
	},
	
	"L"  :
	{
		"Description": {
			"string": "Produto em estoque limitado - a quantidade do seu pedido pode ser ajustada de acordo com o estoque",
			"character_limit": 255
		},
		"Warning": {
			"string": "*"
		}
	},
	
	"L_hrc"  :
	{
		"Description": {
			"string": "Disponibilidade limitada",
			"character_limit": 255
		},
		"Warning": {
			"string": "*"
		}
	},
	
	"L2" :
	{
		"Description": {
			"string": "Produto tem um tempo de espera para entrega de dois dias.",
			"character_limit": 255
		},
		"Warning": {
			"string": "*"
		}
	}
	
}