{
    "1": {
        "SectionName": {
            "string": "Alérgenos",
            "character_limit": 50
        },
        "SearchLabel": {
            "string": "- Procure produtos LIVRES DOS alérgenos selecionados<br /><u> AVISO IMPORTANTE - As informações sobre alérgenos podem estar incorretas, a embalagem do produto DEVE ser consultada antes do consumo</u>",
            "character_limit": 255
        }
    },
    "2": {
        "SectionName": {
            "string": "Necessidades dietéticas",
            "character_limit": 50
        },
        "SearchLabel": {
            "string": "- Procure produtos ADEQUADOS PARA os grupos selecionados",
            "character_limit": 255
        }
    },
    "3": {
        "SectionName": {
            "string": "Uso Alimentar",
            "character_limit": 50
        },
        "SearchLabel": {
            "string": "- Pesquise produtos que sejam ADEQUADOS PARA os usos selecionados",
            "character_limit": 255
        }
    },
    "4": {
        "SectionName": {
            "string": "Uso e Aplicação",
            "character_limit": 50
        },
        "SearchLabel": {
            "string": "- Pesquise produtos que sejam ADEQUADOS PARA os usos selecionados",
            "character_limit": 255
        }
    },
    "5": {
        "SectionName": {
            "string": "Embalagem",
            "character_limit": 50
        },
        "SearchLabel": {
            "string": "*",
            "character_limit": 255
        }
    },
    "6": {
        "SectionName": {
            "string": "Certificados",
            "character_limit": 50
        },
        "SearchLabel": {
            "string": "*",
            "character_limit": 255
        }
    }
}