{
    "1": {
        "string": "Bevorzugte Produkte",
        "context": "Preferred Products",
        "character_limit": 100
    },
    "2": {
        "string": "Vorherige Bestellungen",
        "context": "Previous Orders",
        "character_limit": 100
    },
    "3": {
        "string": "Rechnungen",
        "context": "Invoices",
        "character_limit": 100
    },
    "4": {
        "string": "Kredite",
        "context": "Credits",
        "character_limit": 100
    },
    "5": {
        "string": "Aussagen",
        "context": "Statements",
        "character_limit": 100
    },
    "6": {
        "string": "Product Price List",
        "context": "Product Price List",
        "character_limit": 100
    },
    "7": {
        "string": "InvoiceCredits",
        "context": "InvoiceCredits",
        "character_limit": 100
    },
    "8": {
        "string": "Vorherige Einkäufe",
        "context": "Previous Purchases",
        "character_limit": 100
    },
    "9": {
        "string": "Neue Produkte",
        "context": "New Products",
        "character_limit": 100
    },
    "10": {
        "string": "Stocktake",
        "context": "Stocktake",
        "character_limit": 100
    },
    "11": {
        "string": "Supersessionen",
        "context": "Supersessions",
        "character_limit": 100
    },
    "12": {
        "string": "Sonderangebote",
        "context": "Specials",
        "character_limit": 100
    }
}