{
    "1_1_101": {
        "ReportColumnName": {
            "string": "MPINCode",
            "character_limit": 50
        },
        "Aggregate": {
            "string": ""
        }
    },
    "1_1_103": {
        "ReportColumnName": {
            "string": "product Beschrijving"
        },
        "Aggregate": {
            "string": ""
        }
    },
    "1_1_104": {
        "ReportColumnName": {
            "string": "CustomerItemCode"
        },
        "Aggregate": {
            "string": ""
        }
    },
    "1_1_105": {
        "ReportColumnName": {
            "string": "productlijn"
        },
        "Aggregate": {
            "string": ""
        }
    },
    "1_1_107": {
        "ReportColumnName": {
            "string": "merk"
        },
        "Aggregate": {
            "string": ""
        }
    },
    "1_1_109": {
        "ReportColumnName": {
            "string": "Pakketgrootte"
        },
        "Aggregate": {
            "string": ""
        }
    },
    "1_1_110": {
        "ReportColumnName": {
            "string": "unit"
        },
        "Aggregate": {
            "string": ""
        }
    },
    "1_1_111": {
        "ReportColumnName": {
            "string": "prijs"
        },
        "Aggregate": {
            "string": ""
        }
    },
    "1_1_112": {
        "ReportColumnName": {
            "string": "CtnUOM"
        },
        "Aggregate": {
            "string": ""
        }
    },
    "1_1_113": {
        "ReportColumnName": {
            "string": "CtnPreis"
        },
        "Aggregate": {
            "string": ""
        }
    },
    "1_1_114": {
        "ReportColumnName": {
            "string": "Gekocht kwaliteit"
        },
        "Aggregate": {
            "string": ""
        }
    },
    "1_1_115": {
        "ReportColumnName": {
            "string": "productcode"
        },
        "Aggregate": {
            "string": ""
        }
    },
    "1_1_116": {
        "ReportColumnName": {
            "string": "Accountcode"
        },
        "Aggregate": {
            "string": ""
        }
    },
    "1_1_117": {
        "ReportColumnName": {
            "string": "accountnaam"
        },
        "Aggregate": {
            "string": ""
        }
    },
    "1_1_118": {
        "ReportColumnName": {
            "string": "identificatie van gebruikers"
        },
        "Aggregate": {
            "string": ""
        }
    },
    "2_2_200": {
        "ReportColumnName": {
            "string": "volgnummer"
        },
        "Aggregate": {
            "string": ""
        }
    },
    "2_2_201": {
        "ReportColumnName": {
            "string": "besteldatum"
        },
        "Aggregate": {
            "string": ""
        }
    },
    "2_2_202": {
        "ReportColumnName": {
            "string": "bevestigen"
        },
        "Aggregate": {
            "string": ""
        }
    },
    "2_2_204": {
        "ReportColumnName": {
            "string": "accountnaam"
        },
        "Aggregate": {
            "string": ""
        }
    },
    "2_2_205": {
        "ReportColumnName": {
            "string": "staat"
        },
        "Aggregate": {
            "string": ""
        }
    },
    "2_2_206": {
        "ReportColumnName": {
            "string": "bestelling"
        },
        "Aggregate": {
            "string": ""
        }
    },
    "2_2_207": {
        "ReportColumnName": {
            "string": "InvToL1"
        },
        "Aggregate": {
            "string": ""
        }
    },
    "2_2_208": {
        "ReportColumnName": {
            "string": "InvToL2"
        },
        "Aggregate": {
            "string": ""
        }
    },
    "2_2_209": {
        "ReportColumnName": {
            "string": "InvToL3"
        },
        "Aggregate": {
            "string": ""
        }
    },
    "2_2_210": {
        "ReportColumnName": {
            "string": "InvToL4"
        },
        "Aggregate": {
            "string": ""
        }
    },
    "2_2_211": {
        "ReportColumnName": {
            "string": "DelToL1"
        },
        "Aggregate": {
            "string": ""
        }
    },
    "2_2_212": {
        "ReportColumnName": {
            "string": "DelToL2"
        },
        "Aggregate": {
            "string": ""
        }
    },
    "2_2_213": {
        "ReportColumnName": {
            "string": "DelToL3"
        },
        "Aggregate": {
            "string": ""
        }
    },
    "2_2_214": {
        "ReportColumnName": {
            "string": "DelToL4"
        },
        "Aggregate": {
            "string": ""
        }
    },
    "2_2_215": {
        "ReportColumnName": {
            "string": "CusRef"
        },
        "Aggregate": {
            "string": ""
        }
    },
    "2_2_216": {
        "ReportColumnName": {
            "string": "Onze Ref"
        },
        "Aggregate": {
            "string": ""
        }
    },
    "2_2_218": {
        "ReportColumnName": {
            "string": "Warehouse Naam"
        },
        "Aggregate": {
            "string": ""
        }
    },
    "2_2_219": {
        "ReportColumnName": {
            "string": "Faxnr"
        },
        "Aggregate": {
            "string": ""
        }
    },
    "2_2_220": {
        "ReportColumnName": {
            "string": "NoOfItems"
        },
        "Aggregate": {
            "string": ""
        }
    },
    "2_2_221": {
        "ReportColumnName": {
            "string": "korting"
        },
        "Aggregate": {
            "string": ""
        }
    },
    "2_2_222": {
        "ReportColumnName": {
            "string": "cargo"
        },
        "Aggregate": {
            "string": ""
        }
    },
    "2_2_223": {
        "ReportColumnName": {
            "string": "extra kosten"
        },
        "Aggregate": {
            "string": ""
        }
    },
    "2_2_224": {
        "ReportColumnName": {
            "string": "belasting"
        },
        "Aggregate": {
            "string": ""
        }
    },
    "2_2_225": {
        "ReportColumnName": {
            "string": "totale bestelling"
        },
        "Aggregate": {
            "string": ""
        }
    },
    "2_2_226": {
        "ReportColumnName": {
            "string": "ShipComplete"
        },
        "Aggregate": {
            "string": ""
        }
    },
    "2_2_227": {
        "ReportColumnName": {
            "string": "OrdlineNo"
        },
        "Aggregate": {
            "string": ""
        }
    },
    "2_2_229": {
        "ReportColumnName": {
            "string": "beschrijving"
        },
        "Aggregate": {
            "string": ""
        }
    },
    "2_2_230": {
        "ReportColumnName": {
            "string": "InventurUOM"
        },
        "Aggregate": {
            "string": ""
        }
    },
    "2_2_231": {
        "ReportColumnName": {
            "string": "UOMBeschreibung"
        },
        "Aggregate": {
            "string": ""
        }
    },
    "2_2_232": {
        "ReportColumnName": {
            "string": "kwantiteit"
        },
        "Aggregate": {
            "string": ""
        }
    },
    "2_2_233": {
        "ReportColumnName": {
            "string": "Quanto backorder"
        },
        "Aggregate": {
            "string": ""
        }
    },
    "2_2_234": {
        "ReportColumnName": {
            "string": "nummer"
        },
        "Aggregate": {
            "string": ""
        }
    },
    "2_2_235": {
        "ReportColumnName": {
            "string": "prijs"
        },
        "Aggregate": {
            "string": ""
        }
    },
    "2_2_236": {
        "ReportColumnName": {
            "string": "Uitgebreide prijs"
        },
        "Aggregate": {
            "string": ""
        }
    },
    "2_2_237": {
        "ReportColumnName": {
            "string": "LineTax"
        },
        "Aggregate": {
            "string": ""
        }
    },
    "2_2_238": {
        "ReportColumnName": {
            "string": "regelstatus"
        },
        "Aggregate": {
            "string": ""
        }
    },
    "2_2_239": {
        "ReportColumnName": {
            "string": "merk"
        },
        "Aggregate": {
            "string": ""
        }
    },
    "2_2_240": {
        "ReportColumnName": {
            "string": "Pakketgrootte"
        },
        "Aggregate": {
            "string": ""
        }
    },
    "2_2_241": {
        "ReportColumnName": {
            "string": "OrdDate"
        },
        "Aggregate": {
            "string": ""
        }
    },
    "2_2_242": {
        "ReportColumnName": {
            "string": "voorkeur"
        },
        "Aggregate": {
            "string": ""
        }
    },
    "2_2_243": {
        "ReportColumnName": {
            "string": "Custcode1"
        },
        "Aggregate": {
            "string": ""
        }
    },
    "2_2_244": {
        "ReportColumnName": {
            "string": "Custcode2"
        },
        "Aggregate": {
            "string": ""
        }
    },
    "2_2_245": {
        "ReportColumnName": {
            "string": "Custcode3"
        },
        "Aggregate": {
            "string": ""
        }
    },
    "2_2_246": {
        "ReportColumnName": {
            "string": "Custcode4"
        },
        "Aggregate": {
            "string": ""
        }
    },
    "2_2_247": {
        "ReportColumnName": {
            "string": "KaufOrderNein"
        },
        "Aggregate": {
            "string": ""
        }
    },
    "2_2_248": {
        "ReportColumnName": {
            "string": "cost Center"
        },
        "Aggregate": {
            "string": ""
        }
    },
    "2_2_249": {
        "ReportColumnName": {
            "string": "Special Purpose Code"
        },
        "Aggregate": {
            "string": ""
        }
    },
    "2_2_250": {
        "ReportColumnName": {
            "string": "Accountcode"
        },
        "Aggregate": {
            "string": ""
        }
    },
    "2_2_251": {
        "ReportColumnName": {
            "string": "productcode"
        },
        "Aggregate": {
            "string": ""
        }
    },
    "2_2_252": {
        "ReportColumnName": {
            "string": "Warehouse Code"
        },
        "Aggregate": {
            "string": ""
        }
    },
    "2_2_253": {
        "ReportColumnName": {
            "string": "RequestedDeliverDate"
        },
        "Aggregate": {
            "string": ""
        }
    },
    "2_2_254": {
        "ReportColumnName": {
            "string": "CustomerItemCode"
        },
        "Aggregate": {
            "string": ""
        }
    },
    "3_3_300": {
        "ReportColumnName": {
            "string": "RechnungNein"
        },
        "Aggregate": {
            "string": ""
        }
    },
    "3_3_301": {
        "ReportColumnName": {
            "string": "factuurdatum"
        },
        "Aggregate": {
            "string": ""
        }
    },
    "3_3_302": {
        "ReportColumnName": {
            "string": "InvDate"
        },
        "Aggregate": {
            "string": ""
        }
    },
    "3_3_304": {
        "ReportColumnName": {
            "string": "accountnaam"
        },
        "Aggregate": {
            "string": ""
        }
    },
    "3_3_305": {
        "ReportColumnName": {
            "string": "InvToL1"
        },
        "Aggregate": {
            "string": ""
        }
    },
    "3_3_306": {
        "ReportColumnName": {
            "string": "InvToL2"
        },
        "Aggregate": {
            "string": ""
        }
    },
    "3_3_307": {
        "ReportColumnName": {
            "string": "InvToL3"
        },
        "Aggregate": {
            "string": ""
        }
    },
    "3_3_308": {
        "ReportColumnName": {
            "string": "InvToL4"
        },
        "Aggregate": {
            "string": ""
        }
    },
    "3_3_309": {
        "ReportColumnName": {
            "string": "DelToL1"
        },
        "Aggregate": {
            "string": ""
        }
    },
    "3_3_310": {
        "ReportColumnName": {
            "string": "DelToL2"
        },
        "Aggregate": {
            "string": ""
        }
    },
    "3_3_311": {
        "ReportColumnName": {
            "string": "DelToL3"
        },
        "Aggregate": {
            "string": ""
        }
    },
    "3_3_312": {
        "ReportColumnName": {
            "string": "DelToL4"
        },
        "Aggregate": {
            "string": ""
        }
    },
    "3_3_313": {
        "ReportColumnName": {
            "string": "voorwaarden"
        },
        "Aggregate": {
            "string": ""
        }
    },
    "3_3_314": {
        "ReportColumnName": {
            "string": "CusRef"
        },
        "Aggregate": {
            "string": ""
        }
    },
    "3_3_315": {
        "ReportColumnName": {
            "string": "Onze Ref"
        },
        "Aggregate": {
            "string": ""
        }
    },
    "3_3_317": {
        "ReportColumnName": {
            "string": "Warehouse Naam"
        },
        "Aggregate": {
            "string": ""
        }
    },
    "3_3_318": {
        "ReportColumnName": {
            "string": "NoOfItems"
        },
        "Aggregate": {
            "string": ""
        }
    },
    "3_3_319": {
        "ReportColumnName": {
            "string": "cargo"
        },
        "Aggregate": {
            "string": ""
        }
    },
    "3_3_320": {
        "ReportColumnName": {
            "string": "extra kosten"
        },
        "Aggregate": {
            "string": ""
        }
    },
    "3_3_321": {
        "ReportColumnName": {
            "string": "belasting"
        },
        "Aggregate": {
            "string": ""
        }
    },
    "3_3_322": {
        "ReportColumnName": {
            "string": "factuurbedrag"
        },
        "Aggregate": {
            "string": ""
        }
    },
    "3_3_323": {
        "ReportColumnName": {
            "string": "korting"
        },
        "Aggregate": {
            "string": ""
        }
    },
    "3_3_324": {
        "ReportColumnName": {
            "string": "InvLineNo"
        },
        "Aggregate": {
            "string": ""
        }
    },
    "3_3_326": {
        "ReportColumnName": {
            "string": "beschrijving"
        },
        "Aggregate": {
            "string": ""
        }
    },
    "3_3_327": {
        "ReportColumnName": {
            "string": "InvoiceUOM"
        },
        "Aggregate": {
            "string": ""
        }
    },
    "3_3_328": {
        "ReportColumnName": {
            "string": "BestelltUOM"
        },
        "Aggregate": {
            "string": ""
        }
    },
    "3_3_329": {
        "ReportColumnName": {
            "string": "UOMBeschreibung"
        },
        "Aggregate": {
            "string": ""
        }
    },
    "3_3_330": {
        "ReportColumnName": {
            "string": "kwantiteit"
        },
        "Aggregate": {
            "string": ""
        }
    },
    "3_3_331": {
        "ReportColumnName": {
            "string": "Quanto backorder"
        },
        "Aggregate": {
            "string": ""
        }
    },
    "3_3_332": {
        "ReportColumnName": {
            "string": "MengeInvoiced"
        },
        "Aggregate": {
            "string": ""
        }
    },
    "3_3_333": {
        "ReportColumnName": {
            "string": "MengeInvoicedinOrderedUOM"
        },
        "Aggregate": {
            "string": ""
        }
    },
    "3_3_334": {
        "ReportColumnName": {
            "string": "UnitPriceOrderedUOM"
        },
        "Aggregate": {
            "string": ""
        }
    },
    "3_3_335": {
        "ReportColumnName": {
            "string": "prijs"
        },
        "Aggregate": {
            "string": ""
        }
    },
    "3_3_336": {
        "ReportColumnName": {
            "string": "Uitgebreide prijs"
        },
        "Aggregate": {
            "string": ""
        }
    },
    "3_3_337": {
        "ReportColumnName": {
            "string": "LineTax"
        },
        "Aggregate": {
            "string": ""
        }
    },
    "3_3_338": {
        "ReportColumnName": {
            "string": "merk"
        },
        "Aggregate": {
            "string": ""
        }
    },
    "3_3_339": {
        "ReportColumnName": {
            "string": "Pakketgrootte"
        },
        "Aggregate": {
            "string": ""
        }
    },
    "3_3_340": {
        "ReportColumnName": {
            "string": "voorkeur"
        },
        "Aggregate": {
            "string": ""
        }
    },
    "3_3_341": {
        "ReportColumnName": {
            "string": "CustCode1"
        },
        "Aggregate": {
            "string": ""
        }
    },
    "3_3_342": {
        "ReportColumnName": {
            "string": "Custcode2"
        },
        "Aggregate": {
            "string": ""
        }
    },
    "3_3_343": {
        "ReportColumnName": {
            "string": "CustCode3"
        },
        "Aggregate": {
            "string": ""
        }
    },
    "3_3_344": {
        "ReportColumnName": {
            "string": "CustCode4"
        },
        "Aggregate": {
            "string": ""
        }
    },
    "3_3_345": {
        "ReportColumnName": {
            "string": "KaufOrderNein"
        },
        "Aggregate": {
            "string": ""
        }
    },
    "3_3_346": {
        "ReportColumnName": {
            "string": "cost Center"
        },
        "Aggregate": {
            "string": ""
        }
    },
    "3_3_347": {
        "ReportColumnName": {
            "string": "Special Purpose Code"
        },
        "Aggregate": {
            "string": ""
        }
    },
    "3_3_348": {
        "ReportColumnName": {
            "string": "Accountcode"
        },
        "Aggregate": {
            "string": ""
        }
    },
    "3_3_349": {
        "ReportColumnName": {
            "string": "productcode"
        },
        "Aggregate": {
            "string": ""
        }
    },
    "3_3_350": {
        "ReportColumnName": {
            "string": "Warehouse Code"
        },
        "Aggregate": {
            "string": ""
        }
    },
    "3_3_351": {
        "ReportColumnName": {
            "string": "productlijn"
        },
        "Aggregate": {
            "string": ""
        }
    },
    "3_3_352": {
        "ReportColumnName": {
            "string": "CustomerItemCode"
        },
        "Aggregate": {
            "string": ""
        }
    },
    "4_4_400": {
        "ReportColumnName": {
            "string": "CreditNo"
        },
        "Aggregate": {
            "string": ""
        }
    },
    "4_4_402": {
        "ReportColumnName": {
            "string": "credit Date"
        },
        "Aggregate": {
            "string": ""
        }
    },
    "4_4_404": {
        "ReportColumnName": {
            "string": "accountnaam"
        },
        "Aggregate": {
            "string": ""
        }
    },
    "4_4_405": {
        "ReportColumnName": {
            "string": "AccountRef"
        },
        "Aggregate": {
            "string": ""
        }
    },
    "4_4_406": {
        "ReportColumnName": {
            "string": "CreToL1"
        },
        "Aggregate": {
            "string": ""
        }
    },
    "4_4_407": {
        "ReportColumnName": {
            "string": "CreToL2"
        },
        "Aggregate": {
            "string": ""
        }
    },
    "4_4_408": {
        "ReportColumnName": {
            "string": "CreToL3"
        },
        "Aggregate": {
            "string": ""
        }
    },
    "4_4_409": {
        "ReportColumnName": {
            "string": "CreToL4"
        },
        "Aggregate": {
            "string": ""
        }
    },
    "4_4_410": {
        "ReportColumnName": {
            "string": "DelToL1"
        },
        "Aggregate": {
            "string": ""
        }
    },
    "4_4_411": {
        "ReportColumnName": {
            "string": "DelToL2"
        },
        "Aggregate": {
            "string": ""
        }
    },
    "4_4_412": {
        "ReportColumnName": {
            "string": "DelToL3"
        },
        "Aggregate": {
            "string": ""
        }
    },
    "4_4_413": {
        "ReportColumnName": {
            "string": "DelToL4"
        },
        "Aggregate": {
            "string": ""
        }
    },
    "4_4_414": {
        "ReportColumnName": {
            "string": "voorwaarden"
        },
        "Aggregate": {
            "string": ""
        }
    },
    "4_4_415": {
        "ReportColumnName": {
            "string": "Opmerkingen"
        },
        "Aggregate": {
            "string": ""
        }
    },
    "4_4_416": {
        "ReportColumnName": {
            "string": "CusRef"
        },
        "Aggregate": {
            "string": ""
        }
    },
    "4_4_417": {
        "ReportColumnName": {
            "string": "Onze Ref"
        },
        "Aggregate": {
            "string": ""
        }
    },
    "4_4_418": {
        "ReportColumnName": {
            "string": "RechnungNein"
        },
        "Aggregate": {
            "string": ""
        }
    },
    "4_4_420": {
        "ReportColumnName": {
            "string": "Warehouse Naam"
        },
        "Aggregate": {
            "string": ""
        }
    },
    "4_4_421": {
        "ReportColumnName": {
            "string": "NoOfItems"
        },
        "Aggregate": {
            "string": ""
        }
    },
    "4_4_422": {
        "ReportColumnName": {
            "string": "cargo"
        },
        "Aggregate": {
            "string": ""
        }
    },
    "4_4_423": {
        "ReportColumnName": {
            "string": "extra kosten"
        },
        "Aggregate": {
            "string": ""
        }
    },
    "4_4_424": {
        "ReportColumnName": {
            "string": "belasting"
        },
        "Aggregate": {
            "string": ""
        }
    },
    "4_4_425": {
        "ReportColumnName": {
            "string": "globaal"
        },
        "Aggregate": {
            "string": ""
        }
    },
    "4_4_426": {
        "ReportColumnName": {
            "string": "korting"
        },
        "Aggregate": {
            "string": ""
        }
    },
    "4_4_427": {
        "ReportColumnName": {
            "string": "CreLineNo"
        },
        "Aggregate": {
            "string": ""
        }
    },
    "4_4_429": {
        "ReportColumnName": {
            "string": "beschrijving"
        },
        "Aggregate": {
            "string": ""
        }
    },
    "4_4_430": {
        "ReportColumnName": {
            "string": "InventurUOM"
        },
        "Aggregate": {
            "string": ""
        }
    },
    "4_4_431": {
        "ReportColumnName": {
            "string": "UOMBeschreibung"
        },
        "Aggregate": {
            "string": ""
        }
    },
    "4_4_432": {
        "ReportColumnName": {
            "string": "kwantiteit"
        },
        "Aggregate": {
            "string": ""
        }
    },
    "4_4_433": {
        "ReportColumnName": {
            "string": "Quanto backorder"
        },
        "Aggregate": {
            "string": ""
        }
    },
    "4_4_434": {
        "ReportColumnName": {
            "string": "MengeInvoiced"
        },
        "Aggregate": {
            "string": ""
        }
    },
    "4_4_435": {
        "ReportColumnName": {
            "string": "prijs"
        },
        "Aggregate": {
            "string": ""
        }
    },
    "4_4_436": {
        "ReportColumnName": {
            "string": "Uitgebreide prijs"
        },
        "Aggregate": {
            "string": ""
        }
    },
    "4_4_437": {
        "ReportColumnName": {
            "string": "LineTax"
        },
        "Aggregate": {
            "string": ""
        }
    },
    "4_4_438": {
        "ReportColumnName": {
            "string": "merk"
        },
        "Aggregate": {
            "string": ""
        }
    },
    "4_4_439": {
        "ReportColumnName": {
            "string": "Pakketgrootte"
        },
        "Aggregate": {
            "string": ""
        }
    },
    "4_4_440": {
        "ReportColumnName": {
            "string": "voorkeur"
        },
        "Aggregate": {
            "string": ""
        }
    },
    "4_4_441": {
        "ReportColumnName": {
            "string": "CustCode1"
        },
        "Aggregate": {
            "string": ""
        }
    },
    "4_4_442": {
        "ReportColumnName": {
            "string": "Custcode2"
        },
        "Aggregate": {
            "string": ""
        }
    },
    "4_4_443": {
        "ReportColumnName": {
            "string": "CustCode3"
        },
        "Aggregate": {
            "string": ""
        }
    },
    "4_4_444": {
        "ReportColumnName": {
            "string": "CustCode4"
        },
        "Aggregate": {
            "string": ""
        }
    },
    "4_4_445": {
        "ReportColumnName": {
            "string": "Accountcode"
        },
        "Aggregate": {
            "string": ""
        }
    },
    "4_4_446": {
        "ReportColumnName": {
            "string": "productcode"
        },
        "Aggregate": {
            "string": ""
        }
    },
    "4_4_447": {
        "ReportColumnName": {
            "string": "Warehouse Code"
        },
        "Aggregate": {
            "string": ""
        }
    },
    "4_4_448": {
        "ReportColumnName": {
            "string": "productlijn"
        },
        "Aggregate": {
            "string": ""
        }
    },
    "4_4_449": {
        "ReportColumnName": {
            "string": "CustomerItemCode"
        },
        "Aggregate": {
            "string": ""
        }
    },
    "5_5_500": {
        "ReportColumnName": {
            "string": "verklaring Date"
        },
        "Aggregate": {
            "string": ""
        }
    },
    "5_5_502": {
        "ReportColumnName": {
            "string": "Accountcode"
        },
        "Aggregate": {
            "string": ""
        }
    },
    "5_5_503": {
        "ReportColumnName": {
            "string": "naam van de klant"
        },
        "Aggregate": {
            "string": ""
        }
    },
    "5_5_504": {
        "ReportColumnName": {
            "string": "Adres 1"
        },
        "Aggregate": {
            "string": ""
        }
    },
    "5_5_505": {
        "ReportColumnName": {
            "string": "Adres 2"
        },
        "Aggregate": {
            "string": ""
        }
    },
    "5_5_506": {
        "ReportColumnName": {
            "string": "mailadres3"
        },
        "Aggregate": {
            "string": ""
        }
    },
    "5_5_507": {
        "ReportColumnName": {
            "string": "voorwaarden"
        },
        "Aggregate": {
            "string": ""
        }
    },
    "5_5_508": {
        "ReportColumnName": {
            "string": "bericht"
        },
        "Aggregate": {
            "string": ""
        }
    },
    "5_5_509": {
        "ReportColumnName": {
            "string": "credit examinator"
        },
        "Aggregate": {
            "string": ""
        }
    },
    "5_5_510": {
        "ReportColumnName": {
            "string": "AgeCurrent"
        },
        "Aggregate": {
            "string": ""
        }
    },
    "5_5_511": {
        "ReportColumnName": {
            "string": "Alter30"
        },
        "Aggregate": {
            "string": ""
        }
    },
    "5_5_512": {
        "ReportColumnName": {
            "string": "Leeftijd 60 jaar"
        },
        "Aggregate": {
            "string": ""
        }
    },
    "5_5_513": {
        "ReportColumnName": {
            "string": "Alter90"
        },
        "Aggregate": {
            "string": ""
        }
    },
    "5_5_514": {
        "ReportColumnName": {
            "string": "transactienummer"
        },
        "Aggregate": {
            "string": ""
        }
    },
    "5_5_515": {
        "ReportColumnName": {
            "string": "transactiedatum"
        },
        "Aggregate": {
            "string": ""
        }
    },
    "5_5_516": {
        "ReportColumnName": {
            "string": "Soort transactie"
        },
        "Aggregate": {
            "string": ""
        }
    },
    "5_5_517": {
        "ReportColumnName": {
            "string": "referentie"
        },
        "Aggregate": {
            "string": ""
        }
    },
    "5_5_518": {
        "ReportColumnName": {
            "string": "CustomerRef"
        },
        "Aggregate": {
            "string": ""
        }
    },
    "5_5_519": {
        "ReportColumnName": {
            "string": "DrAmount"
        },
        "Aggregate": {
            "string": ""
        }
    },
    "5_5_520": {
        "ReportColumnName": {
            "string": "CrAmount"
        },
        "Aggregate": {
            "string": ""
        }
    },
    "5_5_521": {
        "ReportColumnName": {
            "string": "balans"
        },
        "Aggregate": {
            "string": ""
        }
    },
    "5_5_522": {
        "ReportColumnName": {
            "string": "CumBalance"
        },
        "Aggregate": {
            "string": ""
        }
    },
    "5_5_523": {
        "ReportColumnName": {
            "string": "StaDate"
        },
        "Aggregate": {
            "string": ""
        }
    },
    "5_5_524": {
        "ReportColumnName": {
            "string": "accountnaam"
        },
        "Aggregate": {
            "string": ""
        }
    },
    "6_6_601": {
        "ReportColumnName": {
            "string": "Warehouse Naam"
        },
        "Aggregate": {
            "string": ""
        }
    },
    "6_6_603": {
        "ReportColumnName": {
            "string": "merk"
        },
        "Aggregate": {
            "string": ""
        }
    },
    "6_6_605": {
        "ReportColumnName": {
            "string": "product Beschrijving"
        },
        "Aggregate": {
            "string": ""
        }
    },
    "6_6_606": {
        "ReportColumnName": {
            "string": "productlijn"
        },
        "Aggregate": {
            "string": ""
        }
    },
    "6_6_607": {
        "ReportColumnName": {
            "string": "Pakketgrootte"
        },
        "Aggregate": {
            "string": ""
        }
    },
    "6_6_608": {
        "ReportColumnName": {
            "string": "belastingtarief"
        },
        "Aggregate": {
            "string": ""
        }
    },
    "6_6_609": {
        "ReportColumnName": {
            "string": "unit"
        },
        "Aggregate": {
            "string": ""
        }
    },
    "6_6_610": {
        "ReportColumnName": {
            "string": "CtnUOM"
        },
        "Aggregate": {
            "string": ""
        }
    },
    "6_6_611": {
        "ReportColumnName": {
            "string": "CtnQty"
        },
        "Aggregate": {
            "string": ""
        }
    },
    "6_6_612": {
        "ReportColumnName": {
            "string": "prijs"
        },
        "Aggregate": {
            "string": ""
        }
    },
    "6_6_613": {
        "ReportColumnName": {
            "string": "lot"
        },
        "Aggregate": {
            "string": ""
        }
    },
    "6_6_614": {
        "ReportColumnName": {
            "string": "Product Sales Categorie"
        },
        "Aggregate": {
            "string": ""
        }
    },
    "6_6_616": {
        "ReportColumnName": {
            "string": "filiaal"
        },
        "Aggregate": {
            "string": ""
        }
    },
    "6_6_617": {
        "ReportColumnName": {
            "string": "klantengroep"
        },
        "Aggregate": {
            "string": ""
        }
    },
    "6_6_618": {
        "ReportColumnName": {
            "string": "zero Group"
        },
        "Aggregate": {
            "string": ""
        }
    },
    "6_6_619": {
        "ReportColumnName": {
            "string": "voorkeur"
        },
        "Aggregate": {
            "string": ""
        }
    },
    "6_6_620": {
        "ReportColumnName": {
            "string": "Accountcode"
        },
        "Aggregate": {
            "string": ""
        }
    },
    "6_6_621": {
        "ReportColumnName": {
            "string": "productcode"
        },
        "Aggregate": {
            "string": ""
        }
    },
    "6_6_622": {
        "ReportColumnName": {
            "string": "verkoper"
        },
        "Aggregate": {
            "string": ""
        }
    },
    "6_6_623": {
        "ReportColumnName": {
            "string": "Warehouse Code"
        },
        "Aggregate": {
            "string": ""
        }
    },
    "6_6_624": {
        "ReportColumnName": {
            "string": "CtnPreis"
        },
        "Aggregate": {
            "string": ""
        }
    },
    "6_6_625": {
        "ReportColumnName": {
            "string": "accountnaam"
        },
        "Aggregate": {
            "string": ""
        }
    },
    "8_8_800": {
        "ReportColumnName": {
            "string": "Accountcode"
        },
        "Aggregate": {
            "string": ""
        }
    },
    "8_8_801": {
        "ReportColumnName": {
            "string": "accountnaam"
        },
        "Aggregate": {
            "string": ""
        }
    },
    "8_8_803": {
        "ReportColumnName": {
            "string": "datum"
        },
        "Aggregate": {
            "string": ""
        }
    },
    "8_8_804": {
        "ReportColumnName": {
            "string": "InvCreDate"
        },
        "Aggregate": {
            "string": ""
        }
    },
    "8_8_805": {
        "ReportColumnName": {
            "string": "verkoop categorie"
        },
        "Aggregate": {
            "string": ""
        }
    },
    "8_8_807": {
        "ReportColumnName": {
            "string": "productlijn"
        },
        "Aggregate": {
            "string": ""
        }
    },
    "8_8_810": {
        "ReportColumnName": {
            "string": "merk"
        },
        "Aggregate": {
            "string": ""
        }
    },
    "8_8_811": {
        "ReportColumnName": {
            "string": "beschrijving"
        },
        "Aggregate": {
            "string": ""
        }
    },
    "8_8_812": {
        "ReportColumnName": {
            "string": "Pakketgrootte"
        },
        "Aggregate": {
            "string": ""
        }
    },
    "8_8_813": {
        "ReportColumnName": {
            "string": "CtnQty"
        },
        "Aggregate": {
            "string": ""
        }
    },
    "8_8_814": {
        "ReportColumnName": {
            "string": "UOM"
        },
        "Aggregate": {
            "string": ""
        }
    },
    "8_8_815": {
        "ReportColumnName": {
            "string": "prijs"
        },
        "Aggregate": {
            "string": ""
        }
    },
    "8_8_816": {
        "ReportColumnName": {
            "string": "voorkeur"
        },
        "Aggregate": {
            "string": ""
        }
    },
    "8_8_817": {
        "ReportColumnName": {
            "string": "CustCode1"
        },
        "Aggregate": {
            "string": ""
        }
    },
    "8_8_818": {
        "ReportColumnName": {
            "string": "Custcode2"
        },
        "Aggregate": {
            "string": ""
        }
    },
    "8_8_819": {
        "ReportColumnName": {
            "string": "CustCode3"
        },
        "Aggregate": {
            "string": ""
        }
    },
    "8_8_820": {
        "ReportColumnName": {
            "string": "CustCode4"
        },
        "Aggregate": {
            "string": ""
        }
    },
    "8_8_821": {
        "ReportColumnName": {
            "string": "productcode"
        },
        "Aggregate": {
            "string": ""
        }
    },
    "8_8_822": {
        "ReportColumnName": {
            "string": "lot"
        },
        "Aggregate": {
            "string": "sum"
        }
    },
    "8_8_823": {
        "ReportColumnName": {
            "string": "belasting"
        },
        "Aggregate": {
            "string": "sum"
        }
    },
    "8_8_824": {
        "ReportColumnName": {
            "string": "ExtPrice"
        },
        "Aggregate": {
            "string": "sum"
        }
    },
    "8_8_825": {
        "ReportColumnName": {
            "string": "CustomerItemCode"
        },
        "Aggregate": {
            "string": ""
        }
    },
    "9_9_901": {
        "ReportColumnName": {
            "string": "Accountcode"
        },
        "Aggregate": {
            "string": ""
        }
    },
    "9_9_902": {
        "ReportColumnName": {
            "string": "accountnaam"
        },
        "Aggregate": {
            "string": ""
        }
    },
    "9_9_904": {
        "ReportColumnName": {
            "string": "Warehouse Code"
        },
        "Aggregate": {
            "string": ""
        }
    },
    "9_9_905": {
        "ReportColumnName": {
            "string": "Warehouse Naam"
        },
        "Aggregate": {
            "string": ""
        }
    },
    "9_9_907": {
        "ReportColumnName": {
            "string": "productcode"
        },
        "Aggregate": {
            "string": ""
        }
    },
    "9_9_908": {
        "ReportColumnName": {
            "string": "product Beschrijving"
        },
        "Aggregate": {
            "string": ""
        }
    },
    "9_9_909": {
        "ReportColumnName": {
            "string": "Pakketgrootte"
        },
        "Aggregate": {
            "string": ""
        }
    },
    "9_9_910": {
        "ReportColumnName": {
            "string": "productlijn"
        },
        "Aggregate": {
            "string": ""
        }
    },
    "9_9_912": {
        "ReportColumnName": {
            "string": "merk"
        },
        "Aggregate": {
            "string": ""
        }
    },
    "9_9_914": {
        "ReportColumnName": {
            "string": "unit"
        },
        "Aggregate": {
            "string": ""
        }
    },
    "9_9_915": {
        "ReportColumnName": {
            "string": "CtnUOM"
        },
        "Aggregate": {
            "string": ""
        }
    },
    "9_9_916": {
        "ReportColumnName": {
            "string": "prijs"
        },
        "Aggregate": {
            "string": ""
        }
    },
    "9_9_917": {
        "ReportColumnName": {
            "string": "CtnPreis"
        },
        "Aggregate": {
            "string": ""
        }
    },
    "9_9_918": {
        "ReportColumnName": {
            "string": "CtnQty"
        },
        "Aggregate": {
            "string": ""
        }
    },
    "9_9_919": {
        "ReportColumnName": {
            "string": "lot"
        },
        "Aggregate": {
            "string": ""
        }
    },
    "9_9_920": {
        "ReportColumnName": {
            "string": "verkoper"
        },
        "Aggregate": {
            "string": ""
        }
    },
    "9_9_921": {
        "ReportColumnName": {
            "string": "belastingtarief"
        },
        "Aggregate": {
            "string": ""
        }
    },
    "9_9_922": {
        "ReportColumnName": {
            "string": "voorkeur"
        },
        "Aggregate": {
            "string": ""
        }
    },
    "9_9_923": {
        "ReportColumnName": {
            "string": "CustomerItemCode"
        },
        "Aggregate": {
            "string": ""
        }
    },
    "10_10_1000": {
        "ReportColumnName": {
            "string": "verkoop categorie"
        },
        "Aggregate": {
            "string": ""
        }
    },
    "10_10_1002": {
        "ReportColumnName": {
            "string": "Sub-categorie"
        },
        "Aggregate": {
            "string": ""
        }
    },
    "10_10_1005": {
        "ReportColumnName": {
            "string": "merk"
        },
        "Aggregate": {
            "string": ""
        }
    },
    "10_10_1007": {
        "ReportColumnName": {
            "string": "beschrijving"
        },
        "Aggregate": {
            "string": ""
        }
    },
    "10_10_1008": {
        "ReportColumnName": {
            "string": "Pakketgrootte"
        },
        "Aggregate": {
            "string": ""
        }
    },
    "10_10_1009": {
        "ReportColumnName": {
            "string": "CtnQty"
        },
        "Aggregate": {
            "string": ""
        }
    },
    "10_10_1010": {
        "ReportColumnName": {
            "string": "UOM"
        },
        "Aggregate": {
            "string": ""
        }
    },
    "10_10_1011": {
        "ReportColumnName": {
            "string": "HighestPricePaid"
        },
        "Aggregate": {
            "string": ""
        }
    },
    "10_10_1013": {
        "ReportColumnName": {
            "string": "opgenomen"
        },
        "Aggregate": {
            "string": ""
        }
    },
    "10_10_1014": {
        "ReportColumnName": {
            "string": "CustCode1"
        },
        "Aggregate": {
            "string": ""
        }
    },
    "10_10_1015": {
        "ReportColumnName": {
            "string": "Custcode2"
        },
        "Aggregate": {
            "string": ""
        }
    },
    "10_10_1016": {
        "ReportColumnName": {
            "string": "CustCode3"
        },
        "Aggregate": {
            "string": ""
        }
    },
    "10_10_1017": {
        "ReportColumnName": {
            "string": "CustCode4"
        },
        "Aggregate": {
            "string": ""
        }
    },
    "10_10_1018": {
        "ReportColumnName": {
            "string": "Accountcode"
        },
        "Aggregate": {
            "string": ""
        }
    },
    "10_10_1019": {
        "ReportColumnName": {
            "string": "accountnaam"
        },
        "Aggregate": {
            "string": ""
        }
    },
    "10_10_1020": {
        "ReportColumnName": {
            "string": "productcode"
        },
        "Aggregate": {
            "string": ""
        }
    },
    "10_10_1021": {
        "ReportColumnName": {
            "string": "voorkeur"
        },
        "Aggregate": {
            "string": ""
        }
    },
    "10_10_1022": {
        "ReportColumnName": {
            "string": "CustomerItemCode"
        },
        "Aggregate": {
            "string": ""
        }
    },
    "11_11_1101": {
        "ReportColumnName": {
            "string": "Accountcode"
        },
        "Aggregate": {
            "string": ""
        }
    },
    "11_11_1102": {
        "ReportColumnName": {
            "string": "accountnaam"
        },
        "Aggregate": {
            "string": ""
        }
    },
    "11_11_1103": {
        "ReportColumnName": {
            "string": "Warehouse Code"
        },
        "Aggregate": {
            "string": ""
        }
    },
    "11_11_1106": {
        "ReportColumnName": {
            "string": "productcode"
        },
        "Aggregate": {
            "string": ""
        }
    },
    "11_11_1107": {
        "ReportColumnName": {
            "string": "product Beschrijving"
        },
        "Aggregate": {
            "string": ""
        }
    },
    "11_11_1108": {
        "ReportColumnName": {
            "string": "Pakketgrootte"
        },
        "Aggregate": {
            "string": ""
        }
    },
    "11_11_1109": {
        "ReportColumnName": {
            "string": "productlijn"
        },
        "Aggregate": {
            "string": ""
        }
    },
    "11_11_1111": {
        "ReportColumnName": {
            "string": "merk"
        },
        "Aggregate": {
            "string": ""
        }
    },
    "11_11_1113": {
        "ReportColumnName": {
            "string": "unit"
        },
        "Aggregate": {
            "string": ""
        }
    },
    "11_11_1114": {
        "ReportColumnName": {
            "string": "CtnUOM"
        },
        "Aggregate": {
            "string": ""
        }
    },
    "11_11_1115": {
        "ReportColumnName": {
            "string": "AltItemCode"
        },
        "Aggregate": {
            "string": ""
        }
    },
    "11_11_1116": {
        "ReportColumnName": {
            "string": "AltBrand"
        },
        "Aggregate": {
            "string": ""
        }
    },
    "11_11_1118": {
        "ReportColumnName": {
            "string": "AltProductCode"
        },
        "Aggregate": {
            "string": ""
        }
    },
    "11_11_1119": {
        "ReportColumnName": {
            "string": "AltProductDescription"
        },
        "Aggregate": {
            "string": ""
        }
    },
    "11_11_1120": {
        "ReportColumnName": {
            "string": "AltPackSize"
        },
        "Aggregate": {
            "string": ""
        }
    },
    "11_11_1121": {
        "ReportColumnName": {
            "string": "AltTaxRate"
        },
        "Aggregate": {
            "string": ""
        }
    },
    "11_11_1122": {
        "ReportColumnName": {
            "string": "AltProductLine"
        },
        "Aggregate": {
            "string": ""
        }
    },
    "11_11_1124": {
        "ReportColumnName": {
            "string": "AltUnitUOM"
        },
        "Aggregate": {
            "string": ""
        }
    },
    "11_11_1125": {
        "ReportColumnName": {
            "string": "AltCtnUOM"
        },
        "Aggregate": {
            "string": ""
        }
    },
    "11_11_1126": {
        "ReportColumnName": {
            "string": "belastingtarief"
        },
        "Aggregate": {
            "string": ""
        }
    },
    "11_11_1127": {
        "ReportColumnName": {
            "string": "identificatie van gebruikers"
        },
        "Aggregate": {
            "string": ""
        }
    },
    "12_12_1201": {
        "ReportColumnName": {
            "string": "Accountcode"
        },
        "Aggregate": {
            "string": ""
        }
    },
    "12_12_1202": {
        "ReportColumnName": {
            "string": "accountnaam"
        },
        "Aggregate": {
            "string": ""
        }
    },
    "12_12_1204": {
        "ReportColumnName": {
            "string": "Warehouse Code"
        },
        "Aggregate": {
            "string": ""
        }
    },
    "12_12_1207": {
        "ReportColumnName": {
            "string": "productcode"
        },
        "Aggregate": {
            "string": ""
        }
    },
    "12_12_1208": {
        "ReportColumnName": {
            "string": "product Beschrijving"
        },
        "Aggregate": {
            "string": ""
        }
    },
    "12_12_1209": {
        "ReportColumnName": {
            "string": "Pakketgrootte"
        },
        "Aggregate": {
            "string": ""
        }
    },
    "12_12_1210": {
        "ReportColumnName": {
            "string": "productlijn"
        },
        "Aggregate": {
            "string": ""
        }
    },
    "12_12_1212": {
        "ReportColumnName": {
            "string": "merk"
        },
        "Aggregate": {
            "string": ""
        }
    },
    "12_12_1214": {
        "ReportColumnName": {
            "string": "unit"
        },
        "Aggregate": {
            "string": ""
        }
    },
    "12_12_1215": {
        "ReportColumnName": {
            "string": "CtnUOM"
        },
        "Aggregate": {
            "string": ""
        }
    },
    "12_12_1216": {
        "ReportColumnName": {
            "string": "CtnQty"
        },
        "Aggregate": {
            "string": ""
        }
    },
    "12_12_1217": {
        "ReportColumnName": {
            "string": "prijs"
        },
        "Aggregate": {
            "string": ""
        }
    },
    "12_12_1218": {
        "ReportColumnName": {
            "string": "CtnPreis"
        },
        "Aggregate": {
            "string": ""
        }
    },
    "12_12_1219": {
        "ReportColumnName": {
            "string": "ExpiresDate"
        },
        "Aggregate": {
            "string": ""
        }
    },
    "12_12_1220": {
        "ReportColumnName": {
            "string": "belastingtarief"
        },
        "Aggregate": {
            "string": ""
        }
    },
    "12_12_1221": {
        "ReportColumnName": {
            "string": "identificatie van gebruikers"
        },
        "Aggregate": {
            "string": ""
        }
    }
}