{
    "1": {
        "string": "Değer",
        "context": "Value",
        "character_limit":50
    },
    "2": {
        "string": "Hacim",
        "context": "Volume",
        "character_limit":50
    },
    "3": {
        "string": "Sıklık",
        "context": "Frequency",
        "character_limit":50
    }
}