{
    "CLP": {
        "string": "Categoría / Línea / Descripción del producto ",
        "context": "Category/Line/Product Desc",
        "character_limit": 60
    },
    "CP": {
        "string": "Categoría / Descripción del producto ",
        "context": "Category/ Product Desc",
        "character_limit": 60
    },
    "I": {
        "string": "Codigo de Producto",
        "context": "Product Code",
        "character_limit": 60
    },
    "ICCP": {
        "string": "Categoría de inventario/Categoría/Descripción del producto",
        "context": "Inventory Category/Category/Product Description",
        "character_limit": 60
    },
    "ICLP": {
        "string": "Categoría de inventario / línea / descripción del producto",
        "context": "Inventory Category/Line/Product Description",
        "character_limit": 60
    },
    "ICP": {
        "string": "Categoría de inventario / descripción del producto",
        "context": "Inventory Category/Product Description",
        "character_limit": 60
    },
    "LP": {
        "string": "Descripción de línea / producto",
        "context": "Line/Product Desc",
        "character_limit": 60
    },
    "MP": {
        "string": "Descripción del manual / producto",
        "context": "Manual/Product Desc",
        "character_limit": 60
    },
    "P": {
        "string": "Descripción del producto",
        "context": "Product Desc",
        "character_limit": 60
    }
}