{
    "A": {
        "string": "Bewilligt",
        "context": "Approved",
        "character_limit":50
    },
    "D": {
        "string": "Abgelehnt",
        "context": "Declined",
        "character_limit":50
    },
    "P": {
        "string": "Austehend",
        "context": "Pending",
        "character_limit":50
    },
    "R": {
        "string": "Teilweise Bewilligt",
        "context": "Partially Approved",
        "character_limit":50
    }
}