{
    "1": {
        "string": "Produtos Favoritos",
        "context": "Preferred Products",
        "character_limit": 100
    },
    "2": {
        "string": "Pedidos Anteriores",
        "context": "Previous Orders",
        "character_limit": 100
    },
    "3": {
        "string": "Notas",
        "context": "Invoices",
        "character_limit": 100
    },
    "4": {
        "string": "Créditos",
        "context": "Credits",
        "character_limit": 100
    },
    "5": {
        "string": "Afirmações",
        "context": "Statements",
        "character_limit": 100
    },
    "6": {
        "string": "Product Price List",
        "context": "Product Price List",
        "character_limit": 100
    },
    "7": {
        "string": "InvoiceCredits",
        "context": "InvoiceCredits",
        "character_limit": 100
    },
    "8": {
        "string": "Compras Anteriores",
        "context": "Previous Purchases",
        "character_limit": 100
    },
    "9": {
        "string": "Novos Produtos",
        "context": "New Products",
        "character_limit": 100
    },
    "10": {
        "string": "Estoque",
        "context": "Stocktake",
        "character_limit": 100
    },
    "11": {
        "string": "Supersessions",
        "context": "Supersessions",
        "character_limit": 100
    },
    "12": {
        "string": "Especiais",
        "context": "Specials",
        "character_limit": 100
    }
}