{
	"E":{
	"string":"Usuários de EDI",
	"context":"EDI Users",
	"character_limit":50
	},
	"F":{
	"string":"Usuários do {{Shop}}",
	"context":"Shop Users",
	"character_limit":50
	},
	"P":{
	"string":"Usuários Administrativos",
	"context":"Admin Users",
	"character_limit":50
	},
	"S":{
	"string":"Usuários de sombra",
	"context":"Shadow Users",
	"character_limit":50
	}
}