{
	"A"  :
	{
		"Description": {
			"string": "Beschikbaar ",
			"character_limit": 255
		},
		"Warning": {
			"string": "*",
			"character_limit": 255
		}
	},
	"B"  :
	{
		"Description": {
			"string": "Bestelbaar",
			"character_limit": 255
		},
		"Warning": {
			"string": "Bestelbaar"
		}
	},
	"B_au":
	{
		"Description": {
			"string": "*",
			"character_limit": 255
		},
		"Warning": {
			"string": "*"
		}
	},	
	"B_fsuk": 
	{
		"Description": {
			"string": "*",
			"character_limit": 255
		},
		"Warning": {
			"string": "*"
		}
	},	
	"B_hrc":
	{
		"Description": {
			"string": "*",
			"character_limit": 255
		},
		"Warning": {
			"string": "*"
		}
	},	
	"B3" :
	{
		"Description": {
			"string": "*",
			"character_limit": 255
		},
		"Warning": {
			"string": "*"
		}
	},
	
	"E"  :
	{
		"Description": {
			"string": "*",
			"character_limit": 255
		},
		"Warning": {
			"string": "*"
		}
	},
	
	"F"  :
	{
		"Description": {
			"string": "*",
			"character_limit": 255
		},
		"Warning": {
			"string": "*"
		}
	},
	
	"FB" :
	{
		"Description": {
			"string": "*",
			"character_limit": 255
		},
		"Warning": {
			"string": "*"
		}
	},
	
	"FS" :
	{
		"Description": {
			"string": "*",
			"character_limit": 255
		},
		"Warning": {
			"string": "*"
		}
	},
	
	"M"  :
	{
		"Description": {
			"string": "*",
			"character_limit": 255
		},
		"Warning": {
			"string": "*"
		}
	},
	
	"N"  :
	{
		"Description": {
			"string": "*",
			"character_limit": 255
		},
		"Warning": {
			"string": "*"
		}
	},
	
	"O"  :
	{
		"Description": {
			"string": "Niet Beschikbaar",
			"character_limit": 255
		},
		"Warning": {
			"string": "Niet Beschikbaar"
		}
	},
	
	"O_hrc"  :
	{
		"Description": {
			"string": "*",
			"character_limit": 255
		},
		"Warning": {
			"string": "*"
		}
	},
	
	"R1" :
	{
		"Description": {
			"string": "*",
			"character_limit": 255
		},
		"Warning": {
			"string": "*"
		}
	},
	
	"RW" :
	{
		"Description": {
			"string": "*",
			"character_limit": 255
		},
		"Warning": {
			"string": "*"
		}
	},
	
	"RW_za":
	{
		"Description": {
			"string": "*",
			"character_limit": 255
		},
		"Warning": {
			"string": "*"
		}
	},
	
	"RWB":
	{
		"Description": {
			"string": "*",
			"character_limit": 255
		},
		"Warning": {
			"string": "*"
		}
	},
	
	"RWB_za":
	{
		"Description": {
			"string": "*",
			"character_limit": 255
		},
		"Warning": {
			"string": "*"
		}
	},
	
	"S"  :
	{
		"Description": {
			"string": "Beperkt",
			"character_limit": 255
		},
		"Warning": {
			"string": "*"
		}
	},
	
	"TBA":
	{
		"Description": {
			"string": "*",
			"character_limit": 255
		},
		"Warning": {
			"string": "*"
		}
	},
	
	"U"  :
	{
		"Description": {
			"string": "*",
			"character_limit": 255
		},
		"Warning": {
			"string": "*"
		}
	},
	
	"X"  :
	{
		"Description": {
			"string": "Verwijderd",
			"character_limit": 255
		},
		"Warning": {
			"string": "Verwijderd"
		}
	},
	
	"C"  :
	{
		"Description": {
			"string": "Bestelbaar",
			"character_limit": 255
		},
		"Warning": {
			"string": "*"
		}
	},
	
	"D"  :
	{
		"Description": {
			"string": "*",
			"character_limit": 255
		},
		"Warning": {
			"string": "*"
		}
	},
	
	"D_fsuk"  :
	{
		"Description": {
			"string": "*",
			"character_limit": 255
		},
		"Warning": {
			"string": "*"
		}
	},
	
	"H"  :
	{
		"Description": {
			"string": "*",
			"character_limit": 255
		},
		"Warning": {
			"string": "*"
		}
	},
	
	"L"  :
	{
		"Description": {
			"string": "Gelimiteerde Beschikbaarheid",
			"character_limit": 255
		},
		"Warning": {
			"string": "*"
		}
	},
	
	"L_hrc"  :
	{
		"Description": {
			"string": "*",
			"character_limit": 255
		},
		"Warning": {
			"string": "*"
		}
	},
	
	"L2" :
	{
		"Description": {
			"string": "*",
			"character_limit": 255
		},
		"Warning": {
			"string": "*"
		}
	}
	
}