{
    "1": {
        "string": "Alles",
        "context": "All",
        "character_limit":50
    },
    "2": {
        "string": "Passend, Entsprechend, Gleich",
        "context": "Matched",
        "character_limit":50
    },
    "3": {
        "string": "Ausnahmen",
        "context": "Exceptions",
        "character_limit":50
    }
}