{
    "CLP": {
        "string": "Categorie / Lijn / Product Desc",
        "context": "Category/Line/Product Desc",
        "character_limit": 60
    },
    "CP": {
        "string": "Categorie / productomschrijving",
        "context": "Category/ Product Desc",
        "character_limit": 60
    },
    "I": {
        "string": "Productcode",
        "context": "Product Code",
        "character_limit": 60
    },
    "ICCP": {
        "string": "Voorraadcategorie/Categorie/Productbeschrijving",
        "context": "Inventory Category/Category/Product Description",
        "character_limit": 60
    },
    "ICLP": {
        "string": "Voorraadcategorie/Lijn/Productbeschrijving",
        "context": "Inventory Category/Line/Product Description",
        "character_limit": 60
    },
    "ICP": {
        "string": "Voorraadcategorie/Productbeschrijving",
        "context": "Inventory Category/Product Description",
        "character_limit": 60
    },
    "LP": {
        "string": "Lijn / Product Desc",
        "context": "Line/Product Desc",
        "character_limit": 60
    },
    "MP": {
        "string": "Handleiding / productbeschrijving",
        "context": "Manual/Product Desc",
        "character_limit": 60
    },
    "P": {
        "string": "Omschrijving product",
        "context": "Product Desc",
        "character_limit": 60
    }
}