{
    "1": {
        "string": "信用卡",
        "context": "Credit Card",
        "character_limit": 100
    },
    "2": {
        "string": "直接付款",
        "context": "Direct Debit",
        "character_limit": 100
    }
}