{
    "0": {
        "string": "Payment",
        "context": "Payment",
        "character_limit": 100
    },
    "1": {
        "string": "Pre-Authorisation",
        "context": "Pre-Authorisation",
        "character_limit": 100
    },
    "2": {
        "string": "Fulfil",
        "context": "Fulfil",
        "character_limit": 100
    },
    "3": {
        "string": "Instant",
        "context": "Instant",
        "character_limit": 100
    }
}