{
    "1": {
        "string": "In afwachting",
        "context": "Pending"
    },
    "2": {
        "string": "Verwerkte",
        "context": "Processed"
    },
    "3": {
        "string": "Geannuleerd",
        "context": "Cancelled"
    }
}