{
    "B": {
        "string": "produtos",
        "context": "Product",
        "character_limit":50
    },
    "P": {
        "string": "Preço",
        "context": "Price",
        "character_limit":50
    },
    "E": {
        "string": "pt-All Excluding Product & Price",
        "context": "All Excluding Product & Price",
        "character_limit":50
    }
}