{
    "A": {
        "O": {
            "string": "Korb zugelassen durch Genehmiger",
            "context": "Basket approved by approver",
			"character_limit":50
        },
        "P": {
            "string": "Bezahlung durch Genehmigung genehmigt",
            "context": "Payment approved by approver",
			"character_limit":50
        }
    },
    "D": {
        "O": {
            "string": "Korb wurde durch Genehmiger abgelehnt",
            "context": "Basket declined by approver",
			"character_limit":50
        },
        "P": {
            "string": "Die Zahlung wurde durch Genehmigung abgelehnt",
            "context": "Payment declined by approver",
			"character_limit":50
        }
    },
    "E": {
        "O": {
            "string": "Genehmigungszeitüberschreitung Eskalation",
            "context": "Approval timeout escalation actioned",
			"character_limit":50
        },
        "P": {
            "string": "Genehmigungszeitüberschreitung Eskalation",
            "context": "Approval timeout escalation actioned",
			"character_limit":50
        }
    },
    "L": {
        "O": {
            "string": "Korb für die Bearbeitung gesperrt",
            "context": "Basket locked for editing",
			"character_limit":50
        }
    },
    "M": {
        "O": {
            "string": "Korb modifiziert durch Genehmiger",
            "context": "Basket modified by approver",
			"character_limit":50
        }
    },
    "O": {
        "O": {
            "string": "Bestellung aus dem zugelassenen Korb",
            "context": "Order created from approved basket",
			"character_limit":50
        }
    },
    "R": {
        "O": {
            "string": "Genehmigungserinnerung",
            "context": "Approval reminder actioned",
			"character_limit":50
        },
        "P": {
            "string": "Genehmigungserinnerung",
            "context": "Approval reminder actioned",
			"character_limit":50
        }
    },
    "S": {
        "O": {
            "string": "Korb zur Genehmigung vorgelegt",
            "context": "Basket submitted for approval",
			"character_limit":50
        },
        "P": {
            "string": "Zahlung zur Genehmigung eingereicht",
            "context": "Payment submitted for approval",
			"character_limit":50
        }
    },
    "U": {
        "O": {
            "string": "Korb entriegelt",
            "context": "Basket unlocked",
			"character_limit":50
        }
    }
}
