{
	"A"  :
	{
		"Description": {
			"string": "Disponible",
			"character_limit": 255
		},
		"Warning": {
			"string": "*",
			"character_limit": 255
		}
	},
	"B"  :
	{
		"Description": {
			"string": "Producto por encargo. Consultar fecha de entrega",
			"character_limit": 255
		},
		"Warning": {
			"string": "*"
		}
	},
	"B_au":
	{
		"Description": {
			"string": "Disponible para pedidos pendientes",
			"character_limit": 255
		},
		"Warning": {
			"string": "*"
		}
	},	
	"B_fsuk": 
	{
		"Description": {
			"string": "Comprado por encargo",
			"character_limit": 255
		},
		"Warning": {
			"string": "*"
		}
	},	
	"B_hrc":
	{
		"Description": {
			"string": "Comprado por encargo",
			"character_limit": 255
		},
		"Warning": {
			"string": "Pedido Pendiente"
		}
	},	
	"B3" :
	{
		"Description": {
			"string": "Producto con bajo stock : la cantidad de su pedido puede ajustarse a la disponibilidad",
			"character_limit": 255
		},
		"Warning": {
			"string": "*"
		}
	},
	
	"E"  :
	{
		"Description": {
			"string": "Experimental",
			"character_limit": 255
		},
		"Warning": {
			"string": "*"
		}
	},
	
	"F"  :
	{
		"Description": {
			"string": "Disponible",
			"character_limit": 255
		},
		"Warning": {
			"string": "*"
		}
	},
	
	"FB" :
	{
		"Description": {
			"string": "Disponible con plazo de entrega",
			"character_limit": 255
		},
		"Warning": {
			"string": "*"
		}
	},
	
	"FS" :
	{
		"Description": {
			"string": "Mariscos frescos",
			"character_limit": 255
		},
		"Warning": {
			"string": "*"
		}
	},
	
	"M"  :
	{
		"Description": {
			"string": "Fabricante sin stock",
			"character_limit": 255
		},
		"Warning": {
			"string": "*"
		}
	},
	
	"N"  :
	{
		"Description": {
			"string": "Fin de la línea",
			"character_limit": 255
		},
		"Warning": {
			"string": "*"
		}
	},
	
	"O"  :
	{
		"Description": {
			"string": "Congelado fresco",
			"character_limit": 255
		},
		"Warning": {
			"string": "*"
		}
	},
	
	"O_hrc"  :
	{
		"Description": {
			"string": "No Disponible",
			"character_limit": 255
		},
		"Warning": {
			"string": "*"
		}
	},
	
	"R1" :
	{
		"Description": {
			"string": "Producto con bajo stock : la cantidad de su pedido puede ajustarse a la disponibilidad",
			"character_limit": 255
		},
		"Warning": {
			"string": "*"
		}
	},
	
	"RW" :
	{
		"Description": {
			"string": "Peso aleatorio",
			"character_limit": 255
		},
		"Warning": {
			"string": "*"
		}
	},
	
	"RW_za":
	{
		"Description": {
			"string": "Peso aleatorio: Unidades entregadas = KGS pedidos / Peso promedio del tamaño del paquete",
			"character_limit": 255
		},
		"Warning": {
			"string": "*"
		}
	},
	
	"RWB":
	{
		"Description": {
			"string": "Peso aleatorio pero se debe indicar la fecha de entrega",
			"character_limit": 255
		},
		"Warning": {
			"string": "*"
		}
	},
	
	"RWB_za":
	{
		"Description": {
			"string": "Peso aleatorio: Unidades entregadas = KGS pedidos / Peso promedio de tamaño. Permite la entrega en 3 días",
			"character_limit": 255
		},
		"Warning": {
			"string": "*"
		}
	},
	
	"S"  :
	{
		"Description": {
			"string": "Limitado",
			"character_limit": 255
		},
		"Warning": {
			"string": "*"
		}
	},
	
	"TBA":
	{
		"Description": {
			"string": "Comprado por encargo, pero se debe informar la fecha de entrega",
			"character_limit": 255
		},
		"Warning": {
			"string": "*"
		}
	},
	
	"U"  :
	{
		"Description": {
			"string": "No Disponible",
			"character_limit": 255
		},
		"Warning": {
			"string": "*"
		}
	},
	
	"X"  :
	{
		"Description": {
			"string": "Fin de la línea",
			"character_limit": 255
		},
		"Warning": {
			"string": "*"
		}
	},
	
	"C"  :
	{
		"Description": {
			"string": "Comprado por encargo",
			"character_limit": 255
		},
		"Warning": {
			"string": "*"
		}
	},
	
	"D"  :
	{
		"Description": {
			"string": "Será entregado por el Distribuidor",
			"character_limit": 255
		},
		"Warning": {
			"string": "*"
		}
	},
	
	"D_fsuk"  :
	{
		"Description": {
			"string": "Será entregado por el Distribuidor",
			"character_limit": 255
		},
		"Warning": {
			"string": "*"
		}
	},
	
	"H"  :
	{
		"Description": {
			"string": "Será entregado por Correo / Distribuidor",
			"character_limit": 255
		},
		"Warning": {
			"string": "*"
		}
	},
	
	"L"  :
	{
		"Description": {
			"string": "Producto con bajo stock : la cantidad de su pedido puede ajustarse a la disponibilidad",
			"character_limit": 255
		},
		"Warning": {
			"string": "*"
		}
	},
	
	"L_hrc"  :
	{
		"Description": {
			"string": "Disponibilidad limitada",
			"character_limit": 255
		},
		"Warning": {
			"string": "*"
		}
	},
	
	"L2" :
	{
		"Description": {
			"string": "El producto tiene un plazo de entrega de dos días.",
			"character_limit": 255
		},
		"Warning": {
			"string": "*"
		}
	}
	
}