{
    "1": {
        "string": "Geslaagd",
        "context": "Successful",
        "character_limit": 100
    },
    "2": {
        "string": "Mislukt",
        "context": "Failed",
        "character_limit": 100
    },
    "3": {
        "string": "Onverwerkte",
        "context": "Unprocessed",
        "character_limit": 100
    },
    "4": {
        "string": "Onbekend ",
        "context": "Unknown",
        "character_limit": 100
    },
    "5": {
        "string": "Cancelled ",
        "context": "Cancelled",
        "character_limit": 100
    }
}