{
    "CLP": {
        "string": "Catégorie/Sous Cat./Desc. Produit",
        "context": "Category/Line/Product Desc",
        "character_limit": 60
    },
    "CP": {
        "string": "Catégorie/Desc. Produit",
        "context": "Category/ Product Desc",
        "character_limit": 60
    },
    "I": {
        "string": "Code Produit",
        "context": "Product Code",
        "character_limit": 60
    },
    "ICCP": {
        "string": "Catégorie d'inventaire/Catégorie/Description du pr",
        "context": "Inventory Category/Category/Product Description",
        "character_limit": 60
    },
    "ICLP": {
        "string": "Catégorie d'inventaire/Ligne/Description du produi",
        "context": "Inventory Category/Line/Product Description",
        "character_limit": 60
    },
    "ICP": {
        "string": "Catégorie d'inventaire/Description du produit",
        "context": "Inventory Category/Product Description",
        "character_limit": 60
    },
    "LP": {
        "string": "Sous Cat./Desc. Produit",
        "context": "Line/Product Desc",
        "character_limit": 60
    },
    "MP": {
        "string": "Index/Desc. Produit",
        "context": "Manual/Product Desc",
        "character_limit": 60
    },
    "P": {
        "string": "Desc. Produit",
        "context": "Product Desc",
        "character_limit": 60
    }
}