{
    "D": {
        "string": "Tag",
        "context": "Day",
        "character_limit": 50
    },
    "M": {
        "string": "Monat",
        "context": "Month",
        "character_limit": 50
    },
    "W": {
        "string": "Woche",
        "context": "Week",
        "character_limit": 50
    },
    "X": {
        "string": "Auf Anfrage",
        "context": "On Request",
        "character_limit": 50
    }
}