{
    "1": {
        "string": "ce jour",
        "context": "Day",
        "character_limit": 50
    },
    "2": {
        "string": "cette semaine",
        "context": "Week",
        "character_limit": 50
    },
    "4": {
        "string": "ce mois",
        "context": "Month",
        "character_limit": 50
    },
    "5": {
        "string": "ce trimestre",
        "context": "Quarter",
        "character_limit": 50
    },
    "6": {
        "string": "cette année",
        "context": "Year",
        "character_limit": 50
    }
}