{
    "1": {
        "string": "Dažikliai",
        "context": "Artificial colours",
        "character_limit": 100
    },
    "2": {
        "string": "Dirbtiniai skoniai",
        "context": "Artificial flavours",
        "character_limit": 100
    },
    "3": {
        "string": "Aspartamas",
        "context": "Aspartame",
        "character_limit": 100
    },
    "4": {
        "string": "Bičių žiedadulkės",
        "context": "Bee Pollen",
        "character_limit": 100
    },
    "5": {
        "string": "Kofeinas",
        "context": "Caffeine",
        "character_limit": 100
    },
    "6": {
        "string": "Crustacea and their products (incl. Shellfish (Mol",
        "context": "Crustacea and their products",
        "character_limit": 100
    },
    "7": {
        "string": "Kiaušiniai ir kiaušinių produktai",
        "context": "Egg and Egg Products",
        "character_limit": 100
    },
    "8": {
        "string": "Išgarintas pienas, sausas pienas, pagamintas iš sojų ar grūdų",
        "context": "Evaporated Milk, Dried Milk",
        "character_limit": 100
    },
    "9": {
        "string": "Žuvis ir žuvies produktai",
        "context": "Fish and Fish Products",
        "character_limit": 100
    },
    "10": {
        "string": "Glitimas ( Grūdai, kuriuose yra kviečių, rugių, miežių, avižų ir speltos )",
        "context": "Gluten",
        "character_limit": 100
    },
    "11": {
        "string": "Guarana arba guaranos ekstraktai",
        "context": "Guarana or extracts of",
        "character_limit": 100
    },
    "12": {
        "string": "Lubinai",
        "context": "Lupine",
        "character_limit": 100
    },
    "13": {
        "string": "Pienas arba pieno produktai",
        "context": "Milk or Milk Products",
        "character_limit": 100
    },
    "14": {
        "string": "Mononatrio glutamatas ( E621)",
        "context": "MSG",
        "character_limit": 100
    },
    "15": {
        "string": "Peanuts and Peanut Products",
        "context": "Peanuts and Peanut Oil",
        "character_limit": 100
    },
    "16": {
        "string": "Phytosterol, Phytostanols and Esters",
        "context": "Phytosterol Esters",
        "character_limit": 100
    },
    "17": {
        "string": "Propolis",
        "context": "Propolis",
        "character_limit": 100
    },
    "18": {
        "string": "Chininas",
        "context": "Quinine",
        "character_limit": 100
    },
    "19": {
        "string": "Bičių pienelis",
        "context": "Royal Jelly",
        "character_limit": 100
    },
    "20": {
        "string": "Sesame Seeds and Sesame Seed Products",
        "context": "Sesame",
        "character_limit": 100
    },
    "21": {
        "string": "Soybean and Soybean Products",
        "context": "Soybeans or Soybean Oil",
        "character_limit": 100
    },
    "22": {
        "string": "Sieros dioksidas ir sulfitai, kurių koncentracija> 10mg / kg (10mg / L)",
        "context": "Sulphites",
        "character_limit": 100
    },
    "23": {
        "string": "Nepasterizuoti kiaušinių produktai",
        "context": "Unpasteurised Egg Products",
        "character_limit": 100
    },
    "24": {
        "string": "Nepasterizuotas pienas ir pieno produktai",
        "context": "Unpasteurised Milk and Milk Products",
        "character_limit": 100
    },
    "25": {
        "string": "Riešutai ir riešutų produktai",
        "context": "Tree Nuts and Tree Nut Products",
        "character_limit": 100
    },
    "27": {
        "string": "Dietinis",
        "context": "Dietetic",
        "character_limit": 100
    },
    "28": {
        "string": "Be GMO",
        "context": "GMO Free",
        "character_limit": 100
    },
    "29": {
        "string": "Halal sertifikuotas",
        "context": "Halal Certified",
        "character_limit": 100
    },
    "30": {
        "string": "Tinka Halal",
        "context": "Halal Suitable",
        "character_limit": 100
    },
    "31": {
        "string": "Heart Foundation Tick",
        "context": "Heart Foundation",
        "character_limit": 100
    },
    "32": {
        "string": "Košerio sertifikatas",
        "context": "Kosher Certified",
        "character_limit": 100
    },
    "33": {
        "string": "Tinkamas košeriniui maistui",
        "context": "Kosher Suitable",
        "character_limit": 100
    },
    "34": {
        "string": "Mažai riebalų",
        "context": "Low Fat",
        "character_limit": 100
    },
    "35": {
        "string": "Mažai druskos",
        "context": "Low Salt",
        "character_limit": 100
    },
    "36": {
        "string": "Organinis sertifikatas",
        "context": "Organic",
        "character_limit": 100
    },
    "37": {
        "string": "Be palmių riebalų",
        "context": "Palm Oil Free",
        "character_limit": 100
    },
    "38": {
        "string": "Sumažintas cukraus kiekis",
        "context": "Reduced Sugar",
        "character_limit": 100
    },
    "39": {
        "string": "Veganiškas",
        "context": "Vegan",
        "character_limit": 100
    },
    "40": {
        "string": "Vegetariškas",
        "context": "Vegetarian",
        "character_limit": 100
    },
    "41": {
        "string": "Be jautienos",
        "context": "Without Beef",
        "character_limit": 100
    },
    "42": {
        "string": "Be kiaulienos",
        "context": "Without Pork",
        "character_limit": 100
    },
    "43": {
        "string": "Kepiniams",
        "context": "Bakery",
        "character_limit": 100
    },
    "44": {
        "string": "Geriamas",
        "context": "Beverage",
        "character_limit": 100
    },
    "45": {
        "string": "Pusryčiams",
        "context": "Breakfast",
        "character_limit": 100
    },
    "46": {
        "string": "Pagardui",
        "context": "Condiment",
        "character_limit": 100
    },
    "47": {
        "string": "Desertui",
        "context": "Dessert",
        "character_limit": 100
    },
    "48": {
        "string": "Užkandžiams",
        "context": "Finger food",
        "character_limit": 100
    },
    "49": {
        "string": "Skonis",
        "context": "Food Flavour",
        "character_limit": 100
    },
    "50": {
        "string": "Užkandžiui",
        "context": "Light meal",
        "character_limit": 100
    },
    "51": {
        "string": "Pagrindiniam patiekalui",
        "context": "Main meal",
        "character_limit": 100
    },
    "52": {
        "string": "Būtinas paruošimas",
        "context": "Preparation required",
        "character_limit": 100
    },
    "53": {
        "string": "Biologiškai skaidomas",
        "context": "Biodegradable",
        "character_limit": 100
    },
    "54": {
        "string": "Organinis sertifikatas",
        "context": "Organic Certified",
        "character_limit": 100
    },
    "55": {
        "string": "Tinka septiniam bakui ",
        "context": "Septic Tank Safe",
        "character_limit": 100
    },
    "56": {
        "string": "Migdolai",
        "context": "Almonds",
        "character_limit": 100
    },
    "57": {
        "string": "Miežiai",
        "context": "Barley",
        "character_limit": 100
    },
    "58": {
        "string": "Braziliški riešutai",
        "context": "Brazil nuts",
        "character_limit": 100
    },
    "59": {
        "string": "Anakardžiai",
        "context": "Cashews",
        "character_limit": 100
    },
    "60": {
        "string": "Salierai",
        "context": "Celery or Celeriac",
        "character_limit": 100
    },
    "61": {
        "string": "Vėžiagyviai",
        "context": "Crustaceans",
        "character_limit": 100
    },
    "62": {
        "string": "Lazdyno riešutai",
        "context": "Hazelnuts",
        "character_limit": 100
    },
    "63": {
        "string": "Makadamija",
        "context": "Macadamia",
        "character_limit": 100
    },
    "64": {
        "string": "Moliuskai",
        "context": "Molluscs",
        "character_limit": 100
    },
    "65": {
        "string": "Garstyčios",
        "context": "Mustard",
        "character_limit": 100
    },
    "66": {
        "string": "Avižos",
        "context": "Oat",
        "character_limit": 100
    },
    "67": {
        "string": "Pekano riešutai",
        "context": "Pecan nuts",
        "character_limit": 100
    },
    "68": {
        "string": "Pistacijos",
        "context": "Pistachios",
        "character_limit": 100
    },
    "69": {
        "string": "Rugiai",
        "context": "Rye",
        "character_limit": 100
    },
    "70": {
        "string": "Graikiniai riešutai",
        "context": "Walnuts",
        "character_limit": 100
    },
    "71": {
        "string": "Kviečiai",
        "context": "Wheat",
        "character_limit": 100
    },
    "72": {
        "string": "Tinka laktozės netoleruojantiems",
        "context": "Suitable for Lactose Intolerance",
        "character_limit": 100
    },
    "73": {
        "string": "Savoury",
        "context": "Food Flavour:2",
        "character_limit": 100
    },
    "74": {
        "string": "Sweet",
        "context": "Food Flavour:3",
        "character_limit": 100
    },
    "75": {
        "string": "Dietinis",
        "context": "MSC",
        "character_limit": 100
    },
    "76": {
        "string": "Bio",
        "context": "Bio",
        "character_limit": 100
    },
    "77": {
        "string": "Be glitimo",
        "context": "Gluten Free",
        "character_limit": 100
    },
    "78": {
        "string": "Ekologinis žemės ūkis",
        "context": "Organic Agriculture",
        "character_limit": 100
    },
    "79": {
        "string": "ASC",
        "context": "ASC",
        "character_limit": 100
    },
    "80": {
        "string": "Porcija",
        "context": "Portion",
        "character_limit": 100
    },
    "81": {
        "string": "Maža pakuotė",
        "context": "Small packaging",
        "character_limit": 100
    },
    "82": {
        "string": "Didelė pakuotė",
        "context": "Big packaging",
        "character_limit": 100
    },
    "83": {
        "string": "Gaminimui",
        "context": "To cook",
        "character_limit": 100
    },
    "84": {
        "string": "Tepimui",
        "context": "To spread",
        "character_limit": 100
    },
    "85": {
        "string": "Blanširuota",
        "context": "Blanched",
        "character_limit": 100
    },
    "86": {
        "string": "IGP",
        "context": "IGP",
        "character_limit": 100
    },
    "87": {
        "string": "Eco",
        "context": "Ecolabel",
        "character_limit": 100
    },
    "88": {
        "string": "AOC",
        "context": "AOC",
        "character_limit": 100
    },
    "89": {
        "string": "Kvinslando riešutai",
        "context": "Queensland Nuts",
        "character_limit": 100
    }
}