{
    "D": {
        "string": "Día",
        "context": "Day",
        "character_limit": 50
    },
    "M": {
        "string": "Mes",
        "context": "Month",
        "character_limit": 50
    },
    "W": {
        "string": "Semana",
        "context": "Week",
        "character_limit": 50
    },
    "X": {
        "string": "Bajo pedido",
        "context": "On Request",
        "character_limit": 50
    }
}