{
    "tab": {
        "string": "Aba",
        "context": "Tab",
        "character_limit": 20
    },
    "|": {
        "string": "Pipe",
        "context": "Pipe",
        "character_limit": 20
    },
    "CSV": {
        "string": "CSV",
        "context": "CSV",
        "character_limit": 20
    },
    "X": {
        "string": "XLSX (Excel)",
        "context": "XLSX (Excel)",
        "character_limit": 20
    }
}