{
	"E":{
	"string":"Utilisateurs EDI",
	"context":"EDI Users",
	"character_limit":50
	},
	"F":{
	"string":"Utilisateurs {{Shop}}",
	"context":"Shop Users",
	"character_limit":50
	},
	"P":{
	"string":"Utilisateurs Admin",
	"context":"Admin Users",
	"character_limit":50
	},
	"S":{
	"string":"Utilisateurs fantômes",
	"context":"Shadow Users",
	"character_limit":50
	}
}