{
   "1":{
      "string":"Erreur système lors de la mise à jours des résultats du PRI/ERP.",
      "context":"System error when updating result from ERP",
      "character_limit":500
   },
   "2":{
      "string":"Erreur système lors de la déserialisation du message envoyé par le PRI/ERP.",
      "context":"System error when deserializing the message returned from ERP.",
      "character_limit":500
   },
   "3":{
      "string":"Le service de synchronisation en temps réel est désactivé.",
      "context":"Live Sync Service is off.",
      "character_limit":500
   },
   "4":{
      "string":"Le protocole de communication (= inconnu) n'est pas configuré correctement.",
      "context":"CommunicationProtocol(=Unknown) is not set correctly.",
      "character_limit":500
   },
   "5":{
      "string":"Les détails de votre compte ont été retrouvés, mise à jour imminente.",
      "context":"Account details successfully retrieved, the account will be updated shortly",
      "character_limit":500
   },
   "6":{
      "string":"Code de compte invalide.",
      "context":"Invalid Account Code.",
      "character_limit":500
   },
   "7":{
      "string":"Une erreur générale s'est produite.",
      "context":"General Error occurred.",
      "character_limit":500
   },
   "1000":{
      "string":"Enregistrement d'approbation inconnu",
      "context":"Unknown approval record",
      "character_limit":500
   },
   "1001":{
      "string":"Panier déja approuvé",
      "context":"Basket already approved",
      "character_limit":500
   },
   "1002":{
      "string":"Panier déja refusé",
      "context":"Basket already declined",
      "character_limit":500
   },
   "1003":{
      "string":"Panier bloqué pour édition",
      "context":"Basket locked for editing",
      "character_limit":500
   },
   "1004":{
      "string":"Panier déja approuvé par l'utilisateur",
      "context":"Basket already approved by user",
      "character_limit":500
   },
   "1005":{
      "string":"Panier déja approuvé mais nécessitant d'autres approbations",
      "context":"Basket approved but requires additional approval(s)",
      "character_limit":500
   },
   "1006":{
      "string":"Panier completement aprouvé, commande créée",
      "context":"Basket fully approved and order created",
      "character_limit":500
   },
   "1007":{
      "string":"Le panier n'est plus bloqué",
      "context":"Basket no longer locked",
      "character_limit":500
   },
   "1008":{
      "string":"Panier correctement débloqué",
      "context":"Basket successfully unlocked",
      "character_limit":500
   },
   "1009":{
      "string":"Panier refusé",
      "context":"Basket declined",
      "character_limit":500
   },
   "1010":{
      "string":"Le panier a deja été modifié et un seul changement est authorisé",
      "context":"Basket has already been edited and only one change allowed",
      "character_limit":500
   },
   "1011":{
      "string":"Panier correctement bloqué pour édition",
      "context":"Basket successfully locked for editing",
      "character_limit":500
   },
   "1012":{
      "string":"Impossible de créer l'utilisateur fantôme",
      "context":"Failed to create shadow user",
      "character_limit":500
   },
   "1013":{
      "string":"Impossible de créer une copie du panier pour l'utilisateur fantôme",
      "context":"Failed to create copy of basket for shadow user",
      "character_limit":500
   },
   "1014":{
      "string":"Le groupe d'approbation ne peut être effacé car il est référencé par un ou plusieurs comptes et/ou utilisateurs",
      "context":"Approval group cannot be deleted because it is being referenced by one or more accounts and/or users",
      "character_limit":500
   },
   "1015":{
      "string":"Le schéma d'approbation ne peut être effacé car il contient un ou plusieurs groupes d'approbation",
      "context":"Approval scheme cannot be deleted because it contains one or more approval groups",
      "character_limit":500
   },
   "1016":{
      "string":"Panier sauvegardé avec succés",
      "context":"Basket successfully saved",
      "character_limit":500
   },
   "1017":{
      "string":"Impossible d'enlever une groupe d'approbation qui a un ou plusieurs sous-groupes",
      "context":"Cannot remove approval group that has one or more children",
      "character_limit":500
   },
   "1018":{
      "string":"Votre limite d'approbation est insuffisante pour approuver la valeur de la commande",
      "context":"Your approval limit is insufficient to approve order value",
      "character_limit":500
   },
   "1019":{
      "string":"Votre limite de dépenses pour une commande est de <currency symbol><spend limit>. Les commandes d'une valeur supérieure ou égale à cette limite devront être soumises à un processus d'approbation. ",
      "context":"Your spend limit is <currency symbol><spend limit> for an order. Orders equal or above that will be submitted for approval.",
      "character_limit":500
   },
   "1020":{
      "string":"Votre limite de dépenses pour <period> est de <currency symbol><spend limit>. Avec les achats de <period> vous avez moins de <currency symbol><balance> à dépenser avant d'être soumis à un processus d'approbation. ",
      "context":"Your spend limit for this <period> is <currency symbol><spend limit>. With your purchase this <period> you have less than <currency symbol><balance> to spend before it is submitted for approval.",
      "character_limit":500
   },
   "1021":{
      "string":"Vous avez atteint votre limite de dépense pour <period>. Votre commande sera soumise à un processus d'approbation. ",
      "context":"You have reached your spend limit for this <period>. Your order will be submitted for approval.",
      "character_limit":500
   },
   "1022":{
      "string":"Le schéma d'approbation ne peut pas être supprimé car l'utilisateur n'est pas autorisé à le faire ou le schéma n'existe plus. ",
      "context":"Approval scheme can not be deleted because the user does not have access to do so or the scheme no longer exists",
      "character_limit":500
   },
   "1023":{
      "string":"Le groupe d'approbation ne peut pas être supprimé car l'utilisateur n'est pas autorisé à le faire ou le groupe n'existe plus. ",
      "context":"Approval group can not be deleted because the user does not have access to do so or the group no longer exists",
      "character_limit":500
   },
   "1024":{
      "string":"Les limites de dépenses incluent la taxe.",
      "context":"Spend limits are inclusive of tax.",
      "character_limit":500
   },
   "1025":{
      "string":"Les limites de dépenses sont hors taxes.",
      "context":"Spend limits are exclusive of tax.",
      "character_limit":500
   },
   "1026":{
      "string":"Le groupe d'approbation ne peut pas être supprimé car des commandes sont en attente.",
      "context":"Approval group can not be deleted because there are pending orders.",
      "character_limit":500
   },
   "1027":{
      "string":"Le groupe d'approbation ne peut pas être supprimé car il est référencé par les groupes de clients suivants:",
      "context":"Approval group cannot be deleted because it is being referenced by these customer groups:",
      "character_limit":500
   },
   "1028":{
      "string":"Le groupe d'approbation ne peut pas être supprimé car il est référencé par ces comptes:",
      "context":"Approval group cannot be deleted because it is being referenced by these accounts:",
      "character_limit":500
   },
   "1029":{
      "string":"Le groupe d'approbation ne peut pas être supprimé car il est référencé par ces utilisateurs:",
      "context":"Approval group cannot be deleted because it is being referenced by these users:",
      "character_limit":500
   },
   "2000":{
      "string":"Votre limite est de <currency symbol><spend limit> par paiement. Les paiements de valeur supérieure ou égale à cette valeur devront être approuvés",
      "context":"Your limit is <currency symbol><spend limit> per payment. Payments equal or above that will be submitted for approval.",
      "character_limit":500
   },
   "2001":{
      "string":"Paiement déja approuvé",
      "context":"Payment already approved",
      "character_limit":500
   },
   "2002":{
      "string":"Paiement déja refusé",
      "context":"Payment already declined",
      "character_limit":500
   },
   "2003":{
      "string":"Paiement déja approuvé par l'utilisateur",
      "context":"Payment already approved by user",
      "character_limit":500
   },
   "2004":{
      "string":"Votre limite d'approbation est insuffisante pour approuver la valeur de la commande",
      "context":"Your approval limit is insufficient to approve payment value",
      "character_limit":500
   },
   "2005":{
      "string":"Paiement déja approuvé mais nécessitant d'autres approbations",
      "context":"Payment approved but requires additional approval(s)",
      "character_limit":500
   },
   "2006":{
      "string":"Paiement completement aprouvé, paiement créée",
      "context":"Payment fully approved and payment can be made",
      "character_limit":500
   },
   "2007":{
      "string":"Paiement refusé",
      "context":"Payment declined",
      "character_limit":500
   }
}