{
    "1": {
        "string": "Dagelijk",
        "context": "Daily",
        "character_limit": 36
    },
    "2": {
        "string": "Weekelijk",
        "context": "Weekly",
        "character_limit": 36
    },
    "3": {
        "string": "Tweewekelijks",
        "context": "Fortnightly",
        "character_limit": 36
    },
    "4": {
        "string": "Maandelijks",
        "context": "Monthly",
        "character_limit": 36
    }
}