{
    "D": {
        "string": "Diena",
        "context": "Day",
        "character_limit": 50
    },
    "M": {
        "string": "Mēnesis",
        "context": "Month",
        "character_limit": 50
    },
    "W": {
        "string": "Nedēļa",
        "context": "Week",
        "character_limit": 50
    },
    "X": {
        "string": "Pēc pieprasījuma",
        "context": "On Request",
        "character_limit": 50
    }
}