{
    "D": {
        "string": "Diena",
        "context": "Day",
        "character_limit": 50
    },
    "M": {
        "string": "Mėnuo",
        "context": "Month",
        "character_limit": 50
    },
    "W": {
        "string": "Savaitė",
        "context": "Week",
        "character_limit": 50
    },
    "X": {
        "string": "Pagal pareikalavimą",
        "context": "On Request",
        "character_limit": 50
    }
}