{
	"W":{
		"string": "Netz",
		"context": "Web",
		"character_limit": 50
	},
	"E":{
		"string": "EDI",
		"context": "EDI",
		"character_limit": 50
	},
	"I":{
		"string": "Lieferant einschalten",
		"context": "Supplier Turn In",
		"character_limit": 50
	},
	"M":{
		"string": "Handy, Mobiltelefon",
		"context": "Mobile",
		"character_limit": 50
	},
	"T":{
		"string": "Télévente",
		"context": "Telesale",
		"character_limit": 50
	},
	"S":{
		"string": "Stehen",
		"context": "Standing",
		"character_limit": 50
	}
}