{
	"W":{
		"string": "Web",
		"context": "Web",
		"character_limit": 50
	},
	"E":{
		"string": "EDI",
		"context": "EDI",
		"character_limit": 50
	},
	"I":{
		"string": "Entrega del proveedor",
		"context": "Supplier Turn In",
		"character_limit": 50
	},
	"M":{
		"string": "Móvil",
		"context": "Mobile",
		"character_limit": 50
	},
	"T":{
		"string": "Televenta",
		"context": "Telesale",
		"character_limit": 50
	},
	"S":{
		"string": "En pie",
		"context": "Standing",
		"character_limit": 50
	}
}