{
    "A": {
        "string": "Aprobado",
        "context": "Approved",
        "character_limit":50
    },
    "D": {
        "string": "Rechazado",
        "context": "Declined",
        "character_limit":50
    },
    "P": {
        "string": "Pendiente",
        "context": "Pending",
        "character_limit":50
    },
    "R": {
        "string": "Aprobado parcialmente",
        "context": "Partially Approved",
        "character_limit":50
    }
}