{
    "B": {
        "string": "Artikel",
        "context": "Product",
        "character_limit":50
    },
    "P": {
        "string": "Prijs",
        "context": "Price",
        "character_limit":50
    },
    "E": {
        "string": "nl-All Excluding Product & Price",
        "context": "All Excluding Product & Price",
        "character_limit":50
    }
}