{
	"E":{
	"string":"Usuarios de EDI",
	"context":"EDI Users",
	"character_limit":50
	},
	"F":{
	"string":"{{Shop}} Usuarios",
	"context":"Shop Users",
	"character_limit":50
	},
	"P":{
	"string":"Usuarios administradores",
	"context":"Admin Users",
	"character_limit":50
	},
	"S":{
	"string":"Usuarios de la sombra",
	"context":"Shadow Users",
	"character_limit":50
	}
}