{
    "1": {
        "string": "Diario",
        "context": "Daily",
        "character_limit": 36
    },
    "2": {
        "string": "Semanal",
        "context": "Weekly",
        "character_limit": 36
    },
    "3": {
        "string": "Quincenal",
        "context": "Fortnightly",
        "character_limit": 36
    },
    "4": {
        "string": "Mensual",
        "context": "Monthly",
        "character_limit": 36
    }
}