{
    "1": {
        "string": "Artificial colours",
        "context": "Artificial colours",
        "character_limit": 100
    },
    "2": {
        "string": "Saveurs artificielles",
        "context": "Artificial flavours",
        "character_limit": 100
    },
    "3": {
        "string": "Aspartame",
        "context": "Aspartame",
        "character_limit": 100
    },
    "4": {
        "string": "Pollen d'abeilles",
        "context": "Bee Pollen",
        "character_limit": 100
    },
    "5": {
        "string": "Caféine",
        "context": "Caffeine",
        "character_limit": 100
    },
    "6": {
        "string": "Crustacea and their products (incl. Shellfish (Mol",
        "context": "Crustacea and their products",
        "character_limit": 100
    },
    "7": {
        "string": "Oeufs et produits dérivés",
        "context": "Egg and Egg Products",
        "character_limit": 100
    },
    "8": {
        "string": "Evaporated Milk, Dried Milk made from Soy or Cerea",
        "context": "Evaporated Milk, Dried Milk",
        "character_limit": 100
    },
    "9": {
        "string": "Poissons et produits dérivés",
        "context": "Fish and Fish Products",
        "character_limit": 100
    },
    "10": {
        "string": "Gluten (Cereals containing Wheat, Rye, Barley, Oat",
        "context": "Gluten",
        "character_limit": 100
    },
    "11": {
        "string": "Guarana or extracts of Guarana",
        "context": "Guarana or extracts of",
        "character_limit": 100
    },
    "12": {
        "string": "Lupine",
        "context": "Lupine",
        "character_limit": 100
    },
    "13": {
        "string": "Milk and Milk Products",
        "context": "Milk or Milk Products",
        "character_limit": 100
    },
    "14": {
        "string": "GMS",
        "context": "MSG",
        "character_limit": 100
    },
    "15": {
        "string": "Peanuts and Peanut Products",
        "context": "Peanuts and Peanut Oil",
        "character_limit": 100
    },
    "16": {
        "string": "Phytosterol, Phytostanols and Esters",
        "context": "Phytosterol Esters",
        "character_limit": 100
    },
    "17": {
        "string": "Propolis",
        "context": "Propolis",
        "character_limit": 100
    },
    "18": {
        "string": "Quinine",
        "context": "Quinine",
        "character_limit": 100
    },
    "19": {
        "string": "Gelée royale",
        "context": "Royal Jelly",
        "character_limit": 100
    },
    "20": {
        "string": "Sesame Seeds and Sesame Seed Products",
        "context": "Sesame",
        "character_limit": 100
    },
    "21": {
        "string": "Soybean and Soybean Products",
        "context": "Soybeans or Soybean Oil",
        "character_limit": 100
    },
    "22": {
        "string": "Sulphur Dioxide and Suphites in concentrations > 1",
        "context": "Sulphites",
        "character_limit": 100
    },
    "23": {
        "string": "Produits à base d'oeufs non pasteurisés",
        "context": "Unpasteurised Egg Products",
        "character_limit": 100
    },
    "24": {
        "string": "Lait non pasteurisé et produits laitiers",
        "context": "Unpasteurised Milk and Milk Products",
        "character_limit": 100
    },
    "25": {
        "string": "Noix et fruits à coques",
        "context": "Tree Nuts and Tree Nut Products",
        "character_limit": 100
    },
    "27": {
        "string": "Diététique",
        "context": "Dietetic",
        "character_limit": 100
    },
    "28": {
        "string": "Sans OGMs",
        "context": "GMO Free",
        "character_limit": 100
    },
    "29": {
        "string": "Certifié Halal",
        "context": "Halal Certified",
        "character_limit": 100
    },
    "30": {
        "string": "Halal",
        "context": "Halal Suitable",
        "character_limit": 100
    },
    "31": {
        "string": "Heart Foundation Tick",
        "context": "Heart Foundation",
        "character_limit": 100
    },
    "32": {
        "string": "Kosher/Casher/Kasher",
        "context": "Kosher Certified",
        "character_limit": 100
    },
    "33": {
        "string": "Valable Kasher",
        "context": "Kosher Suitable",
        "character_limit": 100
    },
    "34": {
        "string": "Gras allégé",
        "context": "Low Fat",
        "character_limit": 100
    },
    "35": {
        "string": "Sans sel",
        "context": "Low Salt",
        "character_limit": 100
    },
    "36": {
        "string": "Bio",
        "context": "Organic",
        "character_limit": 100
    },
    "37": {
        "string": "Sans huile de palme",
        "context": "Palm Oil Free",
        "character_limit": 100
    },
    "38": {
        "string": "Moins de sucre",
        "context": "Reduced Sugar",
        "character_limit": 100
    },
    "39": {
        "string": "Vegan",
        "context": "Vegan",
        "character_limit": 100
    },
    "40": {
        "string": "Végétarien",
        "context": "Vegetarian",
        "character_limit": 100
    },
    "41": {
        "string": "Sans boeuf",
        "context": "Without Beef",
        "character_limit": 100
    },
    "42": {
        "string": "Sans porc",
        "context": "Without Pork",
        "character_limit": 100
    },
    "43": {
        "string": "Boulangerie",
        "context": "Bakery",
        "character_limit": 100
    },
    "44": {
        "string": "Boisson",
        "context": "Beverage",
        "character_limit": 100
    },
    "45": {
        "string": "Petit déjeuner",
        "context": "Breakfast",
        "character_limit": 100
    },
    "46": {
        "string": "Condiment",
        "context": "Condiment",
        "character_limit": 100
    },
    "47": {
        "string": "Dessert",
        "context": "Dessert",
        "character_limit": 100
    },
    "48": {
        "string": "Amuse-gueules",
        "context": "Finger food",
        "character_limit": 100
    },
    "49": {
        "string": "Flavour",
        "context": "Food Flavour",
        "character_limit": 100
    },
    "50": {
        "string": "Repas léger",
        "context": "Light meal",
        "character_limit": 100
    },
    "51": {
        "string": "Plat de résistance",
        "context": "Main meal",
        "character_limit": 100
    },
    "52": {
        "string": "Préparation requise",
        "context": "Preparation required",
        "character_limit": 100
    },
    "53": {
        "string": "Biodégradable",
        "context": "Biodegradable",
        "character_limit": 100
    },
    "54": {
        "string": "Certifié Bio",
        "context": "Organic Certified",
        "character_limit": 100
    },
    "55": {
        "string": "Valide pour fosses sceptiques",
        "context": "Septic Tank Safe",
        "character_limit": 100
    },
    "56": {
        "string": "Amandes",
        "context": "Almonds",
        "character_limit": 100
    },
    "57": {
        "string": "Orge",
        "context": "Barley",
        "character_limit": 100
    },
    "58": {
        "string": "Noix du Brésil",
        "context": "Brazil nuts",
        "character_limit": 100
    },
    "59": {
        "string": "Noix de cajou",
        "context": "Cashews",
        "character_limit": 100
    },
    "60": {
        "string": "Céleri",
        "context": "Celery or Celeriac",
        "character_limit": 100
    },
    "61": {
        "string": "Crustacés",
        "context": "Crustaceans",
        "character_limit": 100
    },
    "62": {
        "string": "Noisettes",
        "context": "Hazelnuts",
        "character_limit": 100
    },
    "63": {
        "string": "Noix de macadamia",
        "context": "Macadamia",
        "character_limit": 100
    },
    "64": {
        "string": "Mollusques",
        "context": "Molluscs",
        "character_limit": 100
    },
    "65": {
        "string": "Moutarde",
        "context": "Mustard",
        "character_limit": 100
    },
    "66": {
        "string": "Avoine",
        "context": "Oat",
        "character_limit": 100
    },
    "67": {
        "string": "Noix de pécan",
        "context": "Pecan nuts",
        "character_limit": 100
    },
    "68": {
        "string": "Pistaches",
        "context": "Pistachios",
        "character_limit": 100
    },
    "69": {
        "string": "Seigle",
        "context": "Rye",
        "character_limit": 100
    },
    "70": {
        "string": "Noix",
        "context": "Walnuts",
        "character_limit": 100
    },
    "71": {
        "string": "Blé",
        "context": "Wheat",
        "character_limit": 100
    },
    "72": {
        "string": "Approprié pour intolérance au lactose",
        "context": "Suitable for Lactose Intolerance",
        "character_limit": 100
    },
    "73": {
        "string": "Savoury",
        "context": "Food Flavour:2",
        "character_limit": 100
    },
    "74": {
        "string": "Sweet",
        "context": "Food Flavour:3",
        "character_limit": 100
    },
    "75": {
        "string": "MSC",
        "context": "MSC",
        "character_limit": 100
    },
    "76": {
        "string": "Bio",
        "context": "Bio",
        "character_limit": 100
    },
    "77": {
        "string": "Sans gluten",
        "context": "Gluten Free",
        "character_limit": 100
    },
    "78": {
        "string": "Agriculture biologique",
        "context": "Organic Agriculture",
        "character_limit": 100
    },
    "79": {
        "string": "ASC",
        "context": "ASC",
        "character_limit": 100
    },
    "80": {
        "string": "Portion individuelle",
        "context": "Portion",
        "character_limit": 100
    },
    "81": {
        "string": "Petit conditionnement",
        "context": "Small packaging",
        "character_limit": 100
    },
    "82": {
        "string": "Grand conditionnement",
        "context": "Big packaging",
        "character_limit": 100
    },
    "83": {
        "string": "A cuire",
        "context": "To cook",
        "character_limit": 100
    },
    "84": {
        "string": "A tartiner",
        "context": "To spread",
        "character_limit": 100
    },
    "85": {
        "string": "Blanchi",
        "context": "Blanched",
        "character_limit": 100
    },
    "86": {
        "string": "IGP",
        "context": "IGP",
        "character_limit": 100
    },
    "87": {
        "string": "Ecolabel",
        "context": "Ecolabel",
        "character_limit": 100
    },
    "88": {
        "string": "AOC",
        "context": "AOC",
        "character_limit": 100
    },
    "89": {
        "string": "Noix de Queensland",
        "context": "Queensland Nuts",
        "character_limit": 100
    }
}