{
    "1": {
        "string": "Facturas individuales",
        "context": "Individual Invoices",
        "character_limit": 100
    },
    "2": {
        "string": "Saldo pendiente",
        "context": "Outstanding Balance",
        "character_limit": 100
    },
    "3": {
        "string": "Saldo vencido",
        "context": "Overdue Balance",
        "character_limit": 100
    },
    "4": {
        "string": "Otra cantidad",
        "context": "Other Amount",
        "character_limit": 100
    }
}