{
   "1":{
      "string":"ERP'den sonucu güncellenirken hata oluştu",
      "context":"System error when updating result from ERP",
      "character_limit":500
   },
   "2":{
      "string":"ERP'den dönen mesaj sistem hatası sebebiyle çözümlenemedi.",
      "context":"System error when deserializing the message returned from ERP.",
      "character_limit":500
   },
   "3":{
      "string":"Eşzamanlı senkronizasyon servisi kapalı",
      "context":"Live Sync Service is off.",
      "character_limit":500
   },
   "4":{
      "string":"İletişimProtokolü(=Bilinmeyen) doğru şekilde ayarlanmamış",
      "context":"CommunicationProtocol(=Unknown) is not set correctly.",
      "character_limit":500
   },
   "5":{
      "string":"Hesap detayları başarıyla alındı, hesap en kısa zamanda güncellenecek",
      "context":"Account details successfully retrieved, the account will be updated shortly",
      "character_limit":500
   },
   "6":{
      "string":"Gçersiz Hesap Kodu",
      "context":"Invalid Account Code.",
      "character_limit":500
   },
   "7":{
      "string":"Genel Hata Oluştu",
      "context":"General Error occurred.",
      "character_limit":500
   },
   "1000":{
      "string":"Tanımsız onay kaydı",
      "context":"Unknown approval record",
      "character_limit":500
   },
   "1001":{
      "string":"Sepet zaten onaylandı",
      "context":"Basket already approved",
      "character_limit":500
   },
   "1002":{
      "string":"Sepet zaten reddedildi",
      "context":"Basket already declined",
      "character_limit":500
   },
   "1003":{
      "string":"Sepet düzenleme için kilitlendi",
      "context":"Basket locked for editing",
      "character_limit":500
   },
   "1004":{
      "string":"Sepet kullanıcı tarafından zaten onaylandı",
      "context":"Basket already approved by user",
      "character_limit":500
   },
   "1005":{
      "string":"Sepet onaylandı, fakat ek onay(lar) gerektiriyor",
      "context":"Basket approved but requires additional approval(s)",
      "character_limit":500
   },
   "1006":{
      "string":"Sepet tamamen onaylandı ve sipariş oluşturuldu",
      "context":"Basket fully approved and order created",
      "character_limit":500
   },
   "1007":{
      "string":"Sepet artık kilitli değil",
      "context":"Basket no longer locked",
      "character_limit":500
   },
   "1008":{
      "string":"Sepet kilidi başarıyla açıldı",
      "context":"Basket successfully unlocked",
      "character_limit":500
   },
   "1009":{
      "string":"Sepet reddedildi",
      "context":"Basket declined",
      "character_limit":500
   },
   "1010":{
      "string":"Sepet zaten düzenlendi ve sadece bir değişikliğe izin verildi",
      "context":"Basket has already been edited and only one change allowed",
      "character_limit":500
   },
   "1011":{
      "string":"Sepet düzenleme için başarıyla kilitlendi",
      "context":"Basket successfully locked for editing",
      "character_limit":500
   },
   "1012":{
      "string":"Gölge kullanıcı oluşturma başarısız",
      "context":"Failed to create shadow user",
      "character_limit":500
   },
   "1013":{
      "string":"Gölge kullanıcı için sepetin kopyasını oluşturma başarısız",
      "context":"Failed to create copy of basket for shadow user",
      "character_limit":500
   },
   "1014":{
      "string":"Onay grubu bir veya daha fazla kullanıcı ve/veya hesap tarafından referans gösterildiği için silinemez",
      "context":"Approval group cannot be deleted because it is being referenced by one or more accounts and/or users",
      "character_limit":500
   },
   "1015":{
      "string":"Onay şeması bir veya birden fazla onay grubu içerdiği için silinemez",
      "context":"Approval scheme cannot be deleted because it contains one or more approval groups",
      "character_limit":500
   },
   "1016":{
      "string":"Sepet başarıyla onaylandı",
      "context":"Basket successfully saved",
      "character_limit":500
   },
   "1017":{
      "string":"Bir veya birden fazla alt grubu olan onay grupları kaldırılamaz",
      "context":"Cannot remove approval group that has one or more children",
      "character_limit":500
   },
   "1018":{
      "string":"Onay limitiniz, sipariş bedelini onaylamak için yetersiz",
      "context":"Your approval limit is insufficient to approve order value",
      "character_limit":500
   },
   "1019":{
      "string":"Sipariş için harcama limitiniz<currency symbol><spend limit>. Bu bedele eşit veya yüksek olan siparişler onaya gönderilecektir",
      "context":"Your spend limit is <currency symbol><spend limit> for an order. Orders equal or above that will be submitted for approval.",
      "character_limit":500
   },
   "1020":{
      "string":"Bu <period> için harcama limitiniz <currency symbol><spend limit>. <period>satın aldığınızda, onay için gönderilmeden önce harcayabileceğiniz <currency symbol><balance>  daha az paranız var.",
      "context":"Your spend limit for this <period> is <currency symbol><spend limit>. With your purchase this <period> you have less than <currency symbol><balance> to spend before it is submitted for approval.",
      "character_limit":500
   },
   "1021":{
      "string":"Bu <period> için harcama limitine ulaştınız. Siparişiniz onaya gönderilecektir.",
      "context":"You have reached your spend limit for this <period>. Your order will be submitted for approval.",
      "character_limit":500
   },
   "1022":{
      "string":"Onay şeması, kullanıcının erişimi olmadığı veya şema bulunamadığı için silinemez",
      "context":"Approval scheme can not be deleted because the user does not have access to do so or the scheme no longer exists",
      "character_limit":500
   },
   "1023":{
      "string":"Onay grubu, kullanıcının erişimi olmadığı veya grup bulunamadığı için silinemez",
      "context":"Approval group can not be deleted because the user does not have access to do so or the group no longer exists",
      "character_limit":500
   },
   "1024":{
      "string":"Harcama limitlerine vergi dahildir.",
      "context":"Spend limits are inclusive of tax.",
      "character_limit":500
   },
   "1025":{
      "string":"Harcama limitlerinde vergi hariçtir.",
      "context":"Spend limits are exclusive of tax.",
      "character_limit":500
   },
   "1026":{
      "string":"Onay grupları beklemede sipariş bulunduğu için silinemez",
      "context":"Approval group can not be deleted because there are pending orders.",
      "character_limit":500
   },
   "1027":{
      "string":"Onay grubu, şu müşteri grupları tarafından referans verildiği için silinemez:",
      "context":"Approval group cannot be deleted because it is being referenced by these customer groups:",
      "character_limit":500
   },
   "1028":{
      "string":"Onay grubu, şu hesaplar tarafından referans verildiği için silinemez:",
      "context":"Approval group cannot be deleted because it is being referenced by these accounts:",
      "character_limit":500
   },
   "1029":{
      "string":"Onay grubu, şu kullanıcılar tarafından referans verildiği için silinemez:",
      "context":"Approval group cannot be deleted because it is being referenced by these users:",
      "character_limit":500
   },
   "2000":{
      "string":"Limitiniz ödeme başına <currency symbol><spend limit> . Eşit veya daha yüksek ödemeler onaya gönderilecektir",
      "context":"Your limit is <currency symbol><spend limit> per payment. Payments equal or above that will be submitted for approval.",
      "character_limit":500
   },
   "2001":{
      "string":"Ödeme zaten onaylandı",
      "context":"Payment already approved",
      "character_limit":500
   },
   "2002":{
      "string":"Ödeme zaten reddedildi",
      "context":"Payment already declined",
      "character_limit":500
   },
   "2003":{
      "string":"Ödeme kullanıcı tarafından zaten onaylandı",
      "context":"Payment already approved by user",
      "character_limit":500
   },
   "2004":{
      "string":"Onay limitiniz ödeme bedelini onaylamak için yetersiz",
      "context":"Your approval limit is insufficient to approve payment value",
      "character_limit":500
   },
   "2005":{
      "string":"Ödeme onaylandı, fakat ek onay(lar) gerektiriyor",
      "context":"Payment approved but requires additional approval(s)",
      "character_limit":500
   },
   "2006":{
      "string":"Ödeme tamamen onaylandı ve ödeme yapılabilir",
      "context":"Payment fully approved and payment can be made",
      "character_limit":500
   },
   "2007":{
      "string":"Ödeme reddedildi",
      "context":"Payment declined",
      "character_limit":500
   }
}