{
    "1": {
        "string": "Revisión de solicitud de modificación de promoción para proveedor <Supplier Name & Code>",
        "context": "PAR Review (Accept/Decline)",
        "character_limit":255
    },
    "2": {
        "string": "PAR Enviado <Promotion Name> por el proveedor <Supplier Name & Code>",
        "context": "PAR Submission",
        "character_limit":255
    },
    "3": {
        "string": "Promoción en proceso de revisión y confirmación final por el proveedor: <Supplier Name & Code>",
        "context": "Catalogue PAR Confirmation",
        "character_limit":255
    },
    "4": {
        "string": "Promoción bajo confirmación final por el proveedor: <Supplier Name & Code>",
        "context": "Loyalty PAR Confirmation",
        "character_limit":255
    },
    "5": {
        "string": "Promoción en proceso de revisión y confirmación final por el proveedor: <Supplier Name & Code>",
        "context": "Specials PAR Confirmation",
        "character_limit":255
    },
    "6": {
        "string": "<Promotion Name> - <Supplier Name & Code>, los valores cooperativos cambiaron",
        "context": "Loyalty Co-op Values",
        "character_limit":255
    },
    "7": {
        "string": "Pedido de MyBIdfood esperando aprobación",
        "context": "Order Approval Reminder",
        "character_limit":255
    },
    "8": {
        "string": "Notificación de Pedido de MyBidfood a ser elevado para aprobación  ",
        "context": "Order Approval Escalation",
        "character_limit":255
    },
    "9": {
        "string": "Pedido de MyBidfood aguardando notificación de aprobación",
        "context": "Order Approval Approver Notification",
        "character_limit":255
    },
    "10": {
        "string": "Alerta de envío de aprobación de pedido de MyBidfood",
        "context": "Order Approval Submission Alert",
        "character_limit":255
    },
    "11": {
        "string": "Solicitud de aprobación de pedido de MyBidfood rechazada",
        "context": "Order Approval Decline Notification",
        "character_limit":255
    },
    "12": {
        "string": "Tiempo de espera finalizado para la aprobación de su pedido de MyBidfood",
        "context": "Order Approval Timeout",
        "character_limit":255
    },
    "13": {
        "string": "<shop name> Notificación de pedido de pago contado contra entrega",
        "context": "Cash On Delivery Order Notification",
        "character_limit":255
    },
    "16": {
        "string": "<shop name> Notificación de comentarios de pedido web",
        "context": "Web Order Comments Notification",
        "character_limit":255
    },
    "17": {
        "string": "Bienvenido a <shop_name>",
        "context": "New User Welcome HTML Email",
        "character_limit":255
    },
    "18": {
        "string": "Bienvenido a <shop_name>",
        "context": "New User Welcome Email",
        "character_limit":255
    },
    "19": {
        "string": "Alerta: Se ha aprobado un nuevo registro <shop_name> v5 para su cliente",
        "context": "Sales Rep HTML Email",
        "character_limit":255
    },
    "20": {
        "string": "Alerta: Se ha aprobado un nuevo registro <shop_name> v5 para su cliente",
        "context": "Sales Rep Email",
        "character_limit":255
    },
    "21": {
        "string": "Solicitud de cambio de contraseña",
        "context": "Update Password HTML Email",
        "character_limit":255
    },
    "22": {
        "string": "Solicitud de cambio de contraseña",
        "context": "Update Password Email",
        "character_limit":255
    },
    "23": {
        "string": "Solicitud de cambio de contraseña",
        "context": "Reset Password HTML Email",
        "character_limit":255
    },
    "24": {
        "string": "Solicitud de cambio de contraseña",
        "context": "Reset Password Email",
        "character_limit":255
    },
    "25": {
        "string": "Su exportación de datos - <reportname>",
        "context": "Export Report HTML Email",
        "character_limit":255
    },
    "26": {
        "string": "Su exportación de datos - <reportname>",
        "context": "Export Report Email",
        "character_limit":255
    },
    "27": {
        "string": "Error de pre-autorización de pago para finalizar",
        "context": "Failed Payment Fulfilment Email",
        "character_limit":255
    },
    "28": {
        "string": "<shop_name> orden todavía pendiente de aprobación",
        "context": "Order Approval Reminder HTML",
        "character_limit":255
    },
    "29": {
        "string": "<shop_name> notificación elevada para la aprobación del pedido",
        "context": "Order Approval Escalation HTML",
        "character_limit":255
    },
    "30": {
        "string": "<shop_name> orden pendiente de notificación de aprobación",
        "context": "Order Approval Approver Notification HTML",
        "character_limit":255
    },
    "31": {
        "string": "Alertar a los administradores que el pedido se creó sin aprobación",
        "context": "Order Approval Submission Alert HTML",
        "character_limit":255
    },
    "32": {
        "string": "<shop_name> solicitud de aprobación de pedido rechazada",
        "context": "Order Approval Decline Notification HTML",
        "character_limit":255
    },
    "33": {
        "string": "<shop_name> notificamos que finalizó el tiempo de espera para la aprobación del pedido",
        "context": "Order Approval Timeout HTML",
        "character_limit":255
    },
    "34": {
        "string": "<shop_name> pago todavía pendiente de aprobación",
        "context": "Payment Approval Reminder HTML",
        "character_limit":255
    },
    "35": {
        "string": "<shop_name> notificación elevada para la aprobación del pago",
        "context": "Payment Approval Escalation HTML",
        "character_limit":255
    },
    "36": {
        "string": "<shop_name> pago pendiente de notificación de aprobación",
        "context": "Payment Approval Approver Notification HTML",
        "character_limit":255
    },
    "37": {
        "string": "Avisar a los administradores que el pago se creó sin aprobación",
        "context": "Payment Approval Submission Alert HTML",
        "character_limit":255
    },
    "38": {
        "string": "<shop_name> solicitud de aprobación de pago rechazada",
        "context": "Payment Approval Decline Notification HTML",
        "character_limit":255
    },
    "39": {
        "string": "<shop_name> notificamos que finalizó el tiempo de espera para la aprobación del pago",
        "context": "Payment Approval Timeout HTML",
        "character_limit":255
    },
    "40": {
        "string": "<shop_name> solicitud de aprobación de pago aprobada",
        "context": "Payment Approval Approve Notification HTML",
        "character_limit":255
    },
    "41": {
        "string": "Su registro para <shop_name> fue rechazado",
        "context": "Decline User Registration HTML",
        "character_limit":255
    },
    "42": {
        "string": "Se ha aceptado su derecho a ser olvidado",
        "context": "Accept Right To Be Forgotten HTML",
        "character_limit":255
    },
    "43": {
        "string": "Su derecho a ser olvidado ha sido cancelado",
        "context": "Cancel Right To Be Forgotten HTML",
        "character_limit":255
    },
    "44": {
        "string": "La solicitud a ser olvidado necesita su aprobación",
        "context": "Right To Be Forgotten Request HTML",
        "character_limit":255
    },
    "45": {
        "string": "Nuevo usuario proveedor <shop_name>",
        "context": "New Supplier User HTML",
        "character_limit":255
    },
    "46": {
        "string": "Nuevo usuario proveedor <shop_name>",
        "context": "New Supplier User",
        "character_limit":255
    },
    "47": {
        "string": "Factura para pago <shop_name>",
        "context": "Payment Invoice HTML",
        "character_limit":255
    },
    "48": {
        "string": "Factura para pago <shop_name>",
        "context": "Payment Invoice",
        "character_limit":255
    },
    "49": {
        "string": "Informe de registros de usuario",
        "context": "User Records",
        "character_limit":255
    },
    "50": {
        "string": "Informe de registros de usuario",
        "context": "User Records HTML",
        "character_limit":255
    },
    "51": {
        "string": "Programador de informes - <schedule_name>",
        "context": "Admin Scheduled Report",
        "character_limit":255
    },
    "52": {
        "string": "Programador de informes - <schedule_name>",
        "context": "Admin Scheduled Report HTML",
        "character_limit":255
    }
}