{
    "CLP": {
        "string": "Categoría / Línea / Producto Desc",
        "context": "Category/Line/Product Desc",
        "character_limit": 60
    },
    "CP": {
        "string": "Categoría / Producto Desc",
        "context": "Category/ Product Desc",
        "character_limit": 60
    },
    "I": {
        "string": "Código de producto",
        "context": "Product Code",
        "character_limit": 60
    },
    "ICCP": {
        "string": "Categoría de inventario/Categoría/Descripción de p",
        "context": "Inventory Category/Category/Product Description",
        "character_limit": 60
    },
    "ICLP": {
        "string": "Categoría de inventario/Línea/Descripción del prod",
        "context": "Inventory Category/Line/Product Description",
        "character_limit": 60
    },
    "ICP": {
        "string": "Categoría de inventario/Descripción del producto",
        "context": "Inventory Category/Product Description",
        "character_limit": 60
    },
    "LP": {
        "string": "Línea / Producto Desc",
        "context": "Line/Product Desc",
        "character_limit": 60
    },
    "MP": {
        "string": "Manual / Producto Desc",
        "context": "Manual/Product Desc",
        "character_limit": 60
    },
    "P": {
        "string": "Desc Producto",
        "context": "Product Desc",
        "character_limit": 60
    }
}