{
   "A":{
      "string":"Laukia apdorojimo",
      "context":"Awaiting Processing",
      "character_limit": 50
   },
      "A_nz":{
      "string":"Laukia patvirtinimo",
      "context":"Awaiting Processing",
      "character_limit": 50
   },
      "A_za":{
      "string":"Neišsiųstas",
      "context":"Awaiting Processing",
      "character_limit": 50
   },
      "A_waltons":{
      "string":"Neišsiųstas",
      "context":"Awaiting Processing",
      "character_limit": 50
   },
      "A_pp":{
      "string":"Neišsiųstas",
      "context":"Awaiting Processing",
      "character_limit": 50
   },
      "A_fsuk":{
      "string":"Neišsiųstas",
      "context":"Awaiting Processing",
      "character_limit": 50
   },
    "B":{
      "string":"Išankstinis užsakymas",
      "context":"Backorder",
      "character_limit": 50
   },
   "C":{
      "string":"Atšauktas",
      "context":"Cancelled",
      "character_limit": 50
   },
   "D":{
      "string":"Išsiųstas",
      "context":"Dispatched",
      "character_limit": 50
   },
    "D_au":{
      "string":"Išsiųstas",
      "context":"Dispatched",
      "character_limit": 50
   },
    "D_aiv":{
      "string":"Išsiųstas",
      "context":"Dispatched",
      "character_limit": 50
   },
    "D_cfg":{
      "string":"Atviras užsakymas",
      "context":"Dispatched",
      "character_limit": 50
   },
     "E":{
      "string":"Siunčiamas",
      "context":"Despatch",
      "character_limit": 50
   },
     "F":{
      "string":"Persiųstas užsakymas",
      "context":"Forward Order",
      "character_limit": 50
   },
   "F_za":{
      "string":"Pristatymo patvirtinimas",
      "context":"Forward Order",
      "character_limit": 50
   },
   "G":{
      "string":"Vykdomas",
      "context":"In Progress",
      "character_limit": 50
   },
     "H":{
      "string":"Sustabdytas",
      "context":"On Hold",
      "character_limit": 50
   },
     "H_angliss":{
      "string":"Kredito limitas",
      "context":"On Hold",
      "character_limit": 50
   },
     "I":{
      "string":"Išrašyta sąskaita",
      "context":"Invoiced",
      "character_limit": 50
   },
     "I_cfg":{
      "string":"Vykdomas",
      "context":"In Progress",
      "character_limit": 50
   },
   "J":{
      "string":"Tvarkomas",
      "context":"Processing",
      "character_limit": 50
   },
    "L":{
      "string":"Renkamas",
      "context":"Picklist",
      "character_limit": 50
   },
    "L_pp":{
      "string":"Tvarkomas",
      "context":"Processing",
      "character_limit": 50
   },
    "M":{
      "string":"Renkamas",
      "context":"Picklist (WMS)",
      "character_limit": 50
   },
    "M_cfg":{
      "string":"Atliktas",
      "context":"Complete",
      "character_limit": 50
   },
    "M_angliss":{
      "string":"Atliktas ir Išrašyta SF",
      "context":"Completed & Invoiced",
      "character_limit": 50
   },
    "N":{
      "string":"Pakeliui",
      "context":"In transit",
      "character_limit": 50
   },
   
   "O":{
      "string":"Užsakymas el. paštu",
      "context":"Email Order",
      "character_limit": 50
   },
   "P":{
      "string":"Išsiųstas",
      "context":"Sent",
      "character_limit": 50
   },
   "P_au":{
      "string":"Apdorotas",
      "context":"Processed",
      "character_limit": 50
   },
   "P_aiv":{
      "string":"Apdorotas",
      "context":"Processed",
      "character_limit": 50
   },
   "P_cfg":{
      "string":"Apdorotas",
      "context":"Processed",
      "character_limit": 50
   },
    "P_fsuk":{
      "string":"Pateiktas",
      "context":"Submitted",
      "character_limit": 50
   },
   "Q":{
      "string":"Pasiūlymas",
      "context":"Quote",
      "character_limit": 50
   },
    "R":{
      "string":"Paruošta SF išrašymui",
      "context":"Ready to Invoice",
      "character_limit": 50
   },
    "R_za":{
      "string":"Pakartotinas pristatymas",
      "context":"ReDelivery",
      "character_limit": 50
   },
    "S":{
      "string":"Atšauktas",
      "context":"Suspense",
      "character_limit": 50
   },
   "T":{
      "string":"Peržiūrimas",
      "context":"Under Review",
      "character_limit": 50
   },
   "U":{
      "string":"Nežinoma būsena",
      "context":"Unrecognised Status",
      "character_limit": 50
   },
   "V":{
      "string":"Netinkamas",
      "context":"Invalid",
      "character_limit": 50
   },
    "W":{
      "string":"Surinkimo eileje",
      "context":"Wait Pick",
      "character_limit": 50
   },
    "W_cfg":{
      "string":"Sandėlyje",
      "context":"In Warehouse",
      "character_limit": 50
   },
    "W_angliss":{
      "string":"Užsakymas išleistas",
      "context":"Order Released",
      "character_limit": 50
   },
    "X":{
      "string":"Eilutė atmesta",
      "context":"Line Cancelled",
      "character_limit": 50
   }
}