{
    "A": {
        "O": {
            "string": "Canasto confirmado por el aprobador",
            "context": "Basket approved by approver",
			"character_limit":50
        },
        "P": {
            "string": "Pago confirmado por el aprobador",
            "context": "Payment approved by approver",
			"character_limit":50
        }
    },
    "D": {
        "O": {
            "string": "Canasto rechazado por el aprobador",
            "context": "Basket declined by approver",
			"character_limit":50
        },
        "P": {
            "string": "Pago rechazado por el aprobado",
            "context": "Payment declined by approver",
			"character_limit":50
        }
    },
    "E": {
        "O": {
            "string": "Tiempo de espera de aprobación escalonado",
            "context": "Approval timeout escalation actioned",
			"character_limit":50
        },
        "P": {
            "string": "Tiempo de espera de aprobación escalonado",
            "context": "Approval timeout escalation actioned",
			"character_limit":50
        }
    },
    "L": {
        "O": {
            "string": "Canasto bloqueado para editar",
            "context": "Basket locked for editing",
			"character_limit":50
        }
    },
    "M": {
        "O": {
            "string": "Canasto modificado por el aprobador",
            "context": "Basket modified by approver",
			"character_limit":50
        }
    },
    "O": {
        "O": {
            "string": "Pedido creado a partir del canasto aprobado",
            "context": "Order created from approved basket",
			"character_limit":50
        }
    },
    "R": {
        "O": {
            "string": "Recordatorio de aprobación accionado",
            "context": "Approval reminder actioned",
			"character_limit":50
        },
        "P": {
            "string": "Recordatorio de aprobación accionado",
            "context": "Approval reminder actioned",
			"character_limit":50
        }
    },
    "S": {
        "O": {
            "string": "Canasto enviado para su aprobación",
            "context": "Basket submitted for approval",
			"character_limit":50
        },
        "P": {
            "string": "Pago enviado para aprobación",
            "context": "Payment submitted for approval",
			"character_limit":50
        }
    },
    "U": {
        "O": {
            "string": "Canasto desbloqueado",
            "context": "Basket unlocked",
			"character_limit":50
        }
    }
}
