{
    "1": {
        "string": "Verifiziert",
        "context": "Verified",
        "character_limit": 50
    },
    "2": {
        "string": "Konto nicht gefunden",
        "context": "Account Not Found",
        "character_limit": 50
    },
    "3": {
        "string": "Konto nicht verfügbar",
        "context": "Account Not Available",
        "character_limit": 50
    },
    "4": {
        "string": "Warten auf den Upload",
        "context": "Awaiting Upload",
        "character_limit": 50
    }
}