{
    "C": {
        "string": "Condensado",
        "context": "Condensed",
        "character_limit": 50
    },
    "G": {
        "string": "Cuadrícula",
        "context": "Grid",
        "character_limit": 50
    },
    "L": {
        "string": "Lista",
        "context": "List",
        "character_limit": 50
    }
}