{
    "1": {
        "string": "Diariamente",
        "context": "Daily",
        "character_limit": 36
    },
    "2": {
        "string": "Semanalmente",
        "context": "Weekly",
        "character_limit": 36
    },
    "3": {
        "string": "Fortnightly",
        "context": "Fortnightly",
        "character_limit": 36
    },
    "4": {
        "string": "Mensalmente",
        "context": "Monthly",
        "character_limit": 36
    }
}