{
    "1": {
        "string": "Même fenêtre",
        "context": "Same Window",
        "character_limit": 36
    },
    "2": {
        "string": "Nouvelle fenêtre",
        "context": "New Window",
        "character_limit": 36
    }
}