{
    "NumberOfPieces": {
        "string": "Number of pieces",
        "context": "NumberOfPieces",
        "character_limit":255
    },
	"HRC_NumberOfPieces": {
        "string": "Grams per piece",
        "context": "NumberOfPieces",
        "character_limit":255
    },
    "PortionPerPack": {
        "string": "Portion per pack",
        "context": "PortionPerPack",
        "character_limit":255
    },
    "PortionPerWeightPerPiece": {
        "string": "Portion per weight per piece",
        "context": "PortionPerWeightPerPiece",
        "character_limit":255
    },
    "VacuumPacked": {
        "string": "Sous-vide",
        "context": "VacuumPacked",
        "character_limit":255
    }
}
