{
    "1": {
        "string": "Todos",
        "context": "All",
        "character_limit":50
    },
    "2": {
        "string": "Matched",
        "context": "Matched",
        "character_limit":50
    },
    "3": {
        "string": "Exceptions",
        "context": "Exceptions",
        "character_limit":50
    }
}