{
    "1": {
        "string": "Individuele facturen",
        "context": "Individual Invoices",
        "character_limit": 100
    },
    "2": {
        "string": "Bijzonder saldo",
        "context": "Outstanding Balance",
        "character_limit": 100
    },
    "3": {
        "string": "Achterstallig saldo",
        "context": "Overdue Balance",
        "character_limit": 100
    },
    "4": {
        "string": "Andere bedrag",
        "context": "Other Amount",
        "character_limit": 100
    }
}