{
	"E":{
	"string":"EDI-Benutzer",
	"context":"EDI Users",
	"character_limit":50
	},
	"F":{
	"string":"{{Shop}}-Benutzer",
	"context":"Shop Users",
	"character_limit":50
	},
	"P":{
	"string":"Admin-Benutzer",
	"context":"Admin Users",
	"character_limit":50
	},
	"S":{
	"string":"Schattenbenutzer",
	"context":"Shadow Users",
	"character_limit":50
	}
}