{
    "1": {
        "string": "Valeur",
        "context": "Value",
        "character_limit":50
    },
    "2": {
        "string": "Le volume",
        "context": "Volume",
        "character_limit":50
    },
    "3": {
        "string": "La fréquence",
        "context": "Frequency",
        "character_limit":50
    }
}