{
    "CLP": {
        "string": "Categoria/ Sub-Categoria/ Descrição do Produto",
        "context": "Category/Line/Product Desc",
        "character_limit": 60
    },
    "CP": {
        "string": "Categoria/ Descrição do Produto",
        "context": "Category/ Product Desc",
        "character_limit": 60
    },
    "I": {
        "string": "Código do Produto",
        "context": "Product Code",
        "character_limit": 60
    },
    "ICCP": {
        "string": "Quantidade em estoque / Categoria / Descrição do P",
        "context": "Inventory Category/Category/Product Description",
        "character_limit": 60
    },
    "ICLP": {
        "string": "Quantidade em estoque / Sub-Categoria / Descrição ",
        "context": "Inventory Category/Line/Product Description",
        "character_limit": 60
    },
    "ICP": {
        "string": "Quantidade em estoque/ Descrição do Produto",
        "context": "Inventory Category/Product Description",
        "character_limit": 60
    },
    "LP": {
        "string": "Sub-Categoria/ Descrição do Produto",
        "context": "Line/Product Desc",
        "character_limit": 60
    },
    "MP": {
        "string": "Manual / Descrição do Produto",
        "context": "Manual/Product Desc",
        "character_limit": 60
    },
    "P": {
        "string": "Descrição do Produto",
        "context": "Product Desc",
        "character_limit": 60
    }
}