{
	"W":{
		"string": "Web",
		"context": "Web",
		"character_limit": 50
	},
	"E":{
		"string": "EDI",
		"context": "EDI",
		"character_limit": 50
	},
	"I":{
		"string": "Tedarikçiden Gönderilen",
		"context": "Supplier Turn In",
		"character_limit": 50
	},
	"M":{
		"string": "Mobil",
		"context": "Mobile",
		"character_limit": 50
	},
	"T":{
		"string": "Tele Satış",
		"context": "Telesale",
		"character_limit": 50
	},
	"S":{
		"string": "Tekrar Eden",
		"context": "Standing",
		"character_limit": 50
	}
}