{
    "1": {
        "string": "Preferred Products",
        "context": "Preferred Products",
        "character_limit": 100
    },
    "2": {
        "string": "Previous Orders",
        "context": "Previous Orders",
        "character_limit": 100
    },
    "3": {
        "string": "Invoices",
        "context": "Invoices",
        "character_limit": 100
    },
    "4": {
        "string": "Credits",
        "context": "Credits",
        "character_limit": 100
    },
    "5": {
        "string": "Statements",
        "context": "Statements",
        "character_limit": 100
    },
    "6": {
        "string": "Product Price List",
        "context": "Product Price List",
        "character_limit": 100
    },
    "7": {
        "string": "InvoiceCredits",
        "context": "InvoiceCredits",
        "character_limit": 100
    },
    "8": {
        "string": "Previous Purchases",
        "context": "Previous Purchases",
        "character_limit": 100
    },
    "9": {
        "string": "New Products",
        "context": "New Products",
        "character_limit": 100
    },
    "10": {
        "string": "Stocktake",
        "context": "Stocktake",
        "character_limit": 100
    },
    "11": {
        "string": "Supersessions",
        "context": "Supersessions",
        "character_limit": 100
    },
    "12": {
        "string": "Specials",
        "context": "Specials",
        "character_limit": 100
    }
}