{
    "1": {
        "string": "Successful",
        "context": "Successful",
        "character_limit": 100
    },
    "2": {
        "string": "Failed",
        "context": "Failed",
        "character_limit": 100
    },
    "3": {
        "string": "Unprocessed",
        "context": "Unprocessed",
        "character_limit": 100
    },
    "4": {
        "string": "Unknown",
        "context": "Unknown",
        "character_limit": 100
    },
    "5": {
        "string": "Cancelled",
        "context": "Cancelled",
        "character_limit": 100
    }
}