{
    "1": {
        "string": "Sekmingas",
        "context": "Successful",
        "character_limit": 100
    },
    "2": {
        "string": "Nepavyko",
        "context": "Failed",
        "character_limit": 100
    },
    "3": {
        "string": "Neapdorota",
        "context": "Unprocessed",
        "character_limit": 100
    },
    "4": {
        "string": "Nežinoma",
        "context": "Unknown",
        "character_limit": 100
    },
    "5": {
        "string": "Atšauktas",
        "context": "Cancelled",
        "character_limit": 100
    }
}