{
    "1": {
        "string": "Promotion Amendment Request Review for Supplier <Supplier Name & Code>",
        "context": "PAR Review (Accept/Decline)",
        "character_limit":255
    },
    "2": {
        "string": "PAR Submitted on <Promotion Name> by supplier <Supplier Name & Code>",
        "context": "PAR Submission",
        "character_limit":255
    },
    "3": {
        "string": "Promotion Under Review Final Confirmation for Supplier: <Supplier Name & Code>",
        "context": "Catalogue PAR Confirmation",
        "character_limit":255
    },
    "4": {
        "string": "Promotion Under Final Confirmation for Supplier: <Supplier Name & Code>",
        "context": "Loyalty PAR Confirmation",
        "character_limit":255
    },
    "5": {
        "string": "Promotion Under Review Final Confirmation for Supplier: <Supplier Name & Code>",
        "context": "Specials PAR Confirmation",
        "character_limit":255
    },
    "6": {
        "string": "<Promotion Name> - <Supplier Name & Code>, co-op values changed",
        "context": "Loyalty Co-op Values",
        "character_limit":255
    },
    "7": {
        "string": "Bidvest Direct order still awaiting approval",
        "context": "Order Approval Reminder",
        "character_limit":255
    },
    "8": {
        "string": "Bidvest Direct order approval escalation notification",
        "context": "Order Approval Escalation",
        "character_limit":255
    },
    "9": {
        "string": "Bidvest Direct order awaiting approval notification",
        "context": "Order Approval Approver Notification",
        "character_limit":255
    },
    "10": {
        "string": "Bidvest Direct order approval submission alert",
        "context": "Order Approval Submission Alert",
        "character_limit":255
    },
    "11": {
        "string": "Bidvest Direct order approval request declined",
        "context": "Order Approval Decline Notification",
        "character_limit":255
    },
    "12": {
        "string": "Bidvest Direct order approval timeout notification",
        "context": "Order Approval Timeout",
        "character_limit":255
    },
    "13": {
        "string": "<shop name> Cash On Delivery Order Notification",
        "context": "Cash On Delivery Order Notification",
        "character_limit":255
    },
    "16": {
        "string": "<shop name> Web Order Comments Notification",
        "context": "Web Order Comments Notification",
        "character_limit":255
    },
    "17": {
        "string": "Bienvenido a <shop_name>",
        "context": "New User Welcome HTML Email",
        "character_limit":255
    },
    "18": {
        "string": "Welcome to <shop_name>",
        "context": "New User Welcome Email",
        "character_limit":255
    },
    "19": {
        "string": "Alert - A new <shop_name> v5 registration has been approved for your customer",
        "context": "Sales Rep HTML Email",
        "character_limit":255
    },
    "20": {
        "string": "Alert - A new <shop_name> v5 registration has been approved for your customer",
        "context": "Sales Rep Email",
        "character_limit":255
    },
    "21": {
        "string": " Cambio de contraseña",
        "context": "Update Password HTML Email",
        "character_limit":255
    },
    "22": {
        "string": " Cambio de contraseña",
        "context": "Update Password Email",
        "character_limit":255
    },
    "23": {
        "string": "Solicitud de cambio de contraseña",
        "context": "Reset Password HTML Email",
        "character_limit":255
    },
    "24": {
        "string": "Password Change Request",
        "context": "Reset Password Email",
        "character_limit":255
    },
    "25": {
        "string": "Tu informe - <reportname>",
        "context": "Export Report HTML Email",
        "character_limit":255
    },
    "26": {
        "string": "Your Data Export - <reportname>",
        "context": "Export Report Email",
        "character_limit":255
    },
    "27": {
        "string": "Payment pre-authorisation failure to finalise",
        "context": "Failed Payment Fulfilment Email",
        "character_limit":255
    },
    "28": {
        "string": "<shop_name> order still awaiting approval",
        "context": "Order Approval Reminder HTML",
        "character_limit":255
    },
    "29": {
        "string": "<shop_name> order approval escalation notification",
        "context": "Order Approval Escalation HTML",
        "character_limit":255
    },
    "30": {
        "string": "<shop_name> order awaiting approval notification",
        "context": "Order Approval Approver Notification HTML",
        "character_limit":255
    },
    "31": {
        "string": "Alert administrators that order was created without approval",
        "context": "Order Approval Submission Alert HTML",
        "character_limit":255
    },
    "32": {
        "string": "<shop_name> order approval request declined",
        "context": "Order Approval Decline Notification HTML",
        "character_limit":255
    },
    "33": {
        "string": "<shop_name> order approval timeout notification",
        "context": "Order Approval Timeout HTML",
        "character_limit":255
    },
    "34": {
        "string": "<shop_name> payment still awaiting approval",
        "context": "Payment Approval Reminder HTML",
        "character_limit":255
    },
    "35": {
        "string": "<shop_name> payment approval escalation notification",
        "context": "Payment Approval Escalation HTML",
        "character_limit":255
    },
    "36": {
        "string": "<shop_name> payment awaiting approval notification",
        "context": "Payment Approval Approver Notification HTML",
        "character_limit":255
    },
    "37": {
        "string": "Alert administrators that payment was created without approval",
        "context": "Payment Approval Submission Alert HTML",
        "character_limit":255
    },
    "38": {
        "string": "<shop_name> payment approval request declined",
        "context": "Payment Approval Decline Notification HTML",
        "character_limit":255
    },
    "39": {
        "string": "<shop_name> payment approval timeout notification",
        "context": "Payment Approval Timeout HTML",
        "character_limit":255
    },
    "40": {
        "string": "<shop_name> payment approval request approved",
        "context": "Payment Approval Approve Notification HTML",
        "character_limit":255
    },
    "41": {
        "string": "Tu registro para <shop_name> fue rechazado",
        "context": "Decline User Registration HTML",
        "character_limit":255
    },
    "42": {
        "string": "Su derecho a ser olvidado ha sido aceptado.",
        "context": "Accept Right To Be Forgotten HTML",
        "character_limit":255
    },
    "43": {
        "string": "Su derecho a ser olvidado ha sido cancelado.",
        "context": "Cancel Right To Be Forgotten HTML",
        "character_limit":255
    },
    "44": {
        "string": "Request to be forgotten request needs your approval",
        "context": "Right To Be Forgotten Request HTML",
        "character_limit":255
    },
    "45": {
        "string": "New Supplier User <shop_name>",
        "context": "New Supplier User HTML",
        "character_limit":255
    },
    "46": {
        "string": "New Supplier User <shop_name>",
        "context": "New Supplier User",
        "character_limit":255
    },
    "47": {
        "string": "es-Payment Invoice <shop_name>",
        "context": "Payment Invoice HTML",
        "character_limit":255
    },
    "48": {
        "string": "es-Payment Invoice <shop_name>",
        "context": "Payment Invoice",
        "character_limit":255
    },
    "49": {
        "string": "es-User Records",
        "context": "User Records",
        "character_limit":255
    },
    "50": {
        "string": "es-User Records HTML",
        "context": "User Records HTML",
        "character_limit":255
    },
    "51": {
        "string": "Report Scheduler - <schedule_name>",
        "context": "Admin Scheduled Report",
        "character_limit":255
    },
    "52": {
        "string": "Report Scheduler - <schedule_name>",
        "context": "Admin Scheduled Report HTML",
        "character_limit":255
    }
}