{
    "1": {
        "string": "Diena",
        "context": "Day",
        "character_limit": 50
    },
    "2": {
        "string": "Savaitė",
        "context": "Week",
        "character_limit": 50
    },
    "4": {
        "string": "Mėnuo",
        "context": "Month",
        "character_limit": 50
    },
    "5": {
        "string": "Ketvirtis",
        "context": "Quarter",
        "character_limit": 50
    },
    "6": {
        "string": "Metai",
        "context": "Year",
        "character_limit": 50
    }
}