{
	"E":{
	"string":"EDI Kullanıcıları",
	"context":"EDI Users",
	"character_limit":50
	},
	"F":{
	"string":"{{Shop}} Kullanıcıları",
	"context":"Shop Users",
	"character_limit":50
	},
	"P":{
	"string":"Yönetici Kullanıcılar",
	"context":"Admin Users",
	"character_limit":50
	},
	"S":{
	"string":"Gölge Kullanıcılar",
	"context":"Shadow Users",
	"character_limit":50
	}
}