{
    "1": {
        "SectionName": {
            "string": "Allergene",
            "character_limit": 50
        },
        "SearchLabel": {
            "string": "- Suche nach Produkten, die KOSTENLOS aus den ausgewählten Allergenen sind <br /><u>WICHTIGER HINWEIS - Allergen Informationen können falsch sein, Produktverpackungen müssen vor dem Konsum konsultiert werden</u>",
            "character_limit": 255
        }
    },
    "2": {
        "SectionName": {
            "string": "Ernährungsbedarf",
            "character_limit": 50
        },
        "SearchLabel": {
            "string": "- Suche nach Produkten, die für die ausgewählten Gruppen GEEIGNET sind",
            "character_limit": 255
        }
    },
    "3": {
        "SectionName": {
            "string": "Lebensmittelverwendung",
            "character_limit": 50
        },
        "SearchLabel": {
            "string": "- Suche nach Produkten, die für die ausgewählten Verwendungen GEEIGNET sind",
            "character_limit": 255
        }
    },
    "4": {
        "SectionName": {
            "string": "Handhabung und Lagerung",
            "character_limit": 50
        },
        "SearchLabel": {
            "string": "- Suche nach Produkten, die für die ausgewählten Verwendungen GEEIGNET sind",
            "character_limit": 255
        }
    },
    "5": {
        "SectionName": {
            "string": "Packaging",
            "character_limit": 50
        },
        "SearchLabel": {
            "string": "*",
            "character_limit": 255
        }
    },
    "6": {
        "SectionName": {
            "string": "Certifications",
            "character_limit": 50
        },
        "SearchLabel": {
            "string": "*",
            "character_limit": 255
        }
    }
}