{
    "A": {
        "O": {
            "string": "Basket approved by approver",
            "context": "Basket approved by approver",
			"character_limit":50
        },
        "P": {
            "string": "Payment approved by approver",
            "context": "Payment approved by approver",
			"character_limit":50
        }
    },
    "D": {
        "O": {
            "string": "Basket declined by approver",
            "context": "Basket declined by approver",
			"character_limit":50
        },
        "P": {
            "string": "Payment declined by approver",
            "context": "Payment declined by approver",
			"character_limit":50
        }
    },
    "E": {
        "O": {
            "string": "Approval timeout escalation actioned",
            "context": "Approval timeout escalation actioned",
			"character_limit":50
        },
        "P": {
            "string": "Approval timeout escalation actioned",
            "context": "Approval timeout escalation actioned",
			"character_limit":50
        }
    },
    "L": {
        "O": {
            "string": "Basket locked for editing",
            "context": "Basket locked for editing",
			"character_limit":50
        }
    },
    "M": {
        "O": {
            "string": "Basket modified by approver",
            "context": "Basket modified by approver",
			"character_limit":50
        }
    },
    "O": {
        "O": {
            "string": "Order created from approved basket",
            "context": "Order created from approved basket",
			"character_limit":50
        }
    },
    "R": {
        "O": {
            "string": "Approval reminder actioned",
            "context": "Approval reminder actioned",
			"character_limit":50
        },
        "P": {
            "string": "Approval reminder actioned",
            "context": "Approval reminder actioned",
			"character_limit":50
        }
    },
    "S": {
        "O": {
            "string": "Basket submitted for approval",
            "context": "Basket submitted for approval",
			"character_limit":50
        },
        "P": {
            "string": "Payment submitted for approval",
            "context": "Payment submitted for approval",
			"character_limit":50
        }
    },
    "U": {
        "O": {
            "string": "Basket unlocked",
            "context": "Basket unlocked",
			"character_limit":50
        }
    }
}
