{
    "1": {
        "string": "Finansai ir administravimas",
        "context": "Finance and Administration",
        "character_limit": 50
    },
    "2": {
        "string": "Pardavimai ir rinkodara",
        "context": "Sales and Marketing",
        "character_limit": 50
    },
    "3": {
        "string": "Virtuvės šefas",
        "context": "Executive Chef",
        "character_limit": 50
    },
    "4": {
        "string": "Virtuvės vadovas",
        "context": "Kitchen Manager",
        "character_limit": 50
    },
    "5": {
        "string": "Virtuvės darbuotojas",
        "context": "Kitchen Staff",
        "character_limit": 50
    },
    "6": {
        "string": "Vadyba",
        "context": "Management",
        "character_limit": 50
    },
    "7": {
        "string": "Kita",
        "context": "Other",
        "character_limit": 50
    },
    "8": {
        "string": "Bidfood darbuotojas",
        "context": "Bidvest Staff",
        "character_limit": 50
    },
    "9": {
        "string": "Pirkimai",
        "context": "Purchasing",
        "character_limit": 50
    },
    "10": {
        "string": "Verslo savininkas",
        "context": "Business Owner",
        "character_limit": 50
    },
    "11": {
        "string": "Tiekėjas",
        "context": "Supplier/Manufacturer",
        "character_limit": 50
    },
    "12": {
        "string": "Bidfood logistikos darbuotojas",
        "context": "Bidvest Logistics Staff",
        "character_limit": 50
    }
}