{
    "1": {
        "string": "Día",
        "context": "Day",
        "character_limit": 50
    },
    "2": {
        "string": "Semana",
        "context": "Week",
        "character_limit": 50
    },
    "4": {
        "string": "Mes",
        "context": "Month",
        "character_limit": 50
    },
    "5": {
        "string": "Trimestre",
        "context": "Quarter",
        "character_limit": 50
    },
    "6": {
        "string": "Año",
        "context": "Year",
        "character_limit": 50
    }
}