{
    "1": {
        "string": "Último día de cada mes",
        "context": "Last Day Of Every Month",
        "character_limit": 50
    },
    "2": {
        "string": "Primer día de cada mes",
        "context": "First Day Of Every Month",
        "character_limit": 50
    },
    "3": {
        "string": "El mismo día cada mes que la fecha de inicio",
        "context": "Same Day Each Month As Start Date",
        "character_limit": 50
    }
}