{
    "1": {
        "string": "Kol",
        "context": "Pending"
    },
    "2": {
        "string": "Perdirbta",
        "context": "Processed"
    },
    "3": {
        "string": "Atšauktas",
        "context": "Cancelled"
    }
}