{
    "1_1_101": {
        "ReportColumnName": {
            "string": "Code MPIN",
            "character_limit": 50
        },
        "Aggregate": {
            "string": ""
        }
    },
    "1_1_103": {
        "ReportColumnName": {
            "string": "Description produit"
        },
        "Aggregate": {
            "string": ""
        }
    },
    "1_1_104": {
        "ReportColumnName": {
            "string": "Code de l'article client"
        },
        "Aggregate": {
            "string": ""
        }
    },
    "1_1_105": {
        "ReportColumnName": {
            "string": "Catégorie"
        },
        "Aggregate": {
            "string": ""
        }
    },
    "1_1_107": {
        "ReportColumnName": {
            "string": "Marque"
        },
        "Aggregate": {
            "string": ""
        }
    },
    "1_1_109": {
        "ReportColumnName": {
            "string": "Contenu"
        },
        "Aggregate": {
            "string": ""
        }
    },
    "1_1_110": {
        "ReportColumnName": {
            "string": "Unité de facturation"
        },
        "Aggregate": {
            "string": ""
        }
    },
    "1_1_111": {
        "ReportColumnName": {
            "string": "Prix unitaire"
        },
        "Aggregate": {
            "string": ""
        }
    },
    "1_1_112": {
        "ReportColumnName": {
            "string": "Unité de facturation carton"
        },
        "Aggregate": {
            "string": ""
        }
    },
    "1_1_113": {
        "ReportColumnName": {
            "string": "Prix carton"
        },
        "Aggregate": {
            "string": ""
        }
    },
    "1_1_114": {
        "ReportColumnName": {
            "string": "Quantité achetée"
        },
        "Aggregate": {
            "string": ""
        }
    },
    "1_1_115": {
        "ReportColumnName": {
            "string": "Code produit"
        },
        "Aggregate": {
            "string": ""
        }
    },
    "1_1_116": {
        "ReportColumnName": {
            "string": "Code client"
        },
        "Aggregate": {
            "string": ""
        }
    },
    "1_1_117": {
        "ReportColumnName": {
            "string": "Nom du client"
        },
        "Aggregate": {
            "string": ""
        }
    },
    "1_1_118": {
        "ReportColumnName": {
            "string": "ID utilisateur"
        },
        "Aggregate": {
            "string": ""
        }
    },
    "2_2_200": {
        "ReportColumnName": {
            "string": "Numéro de commande"
        },
        "Aggregate": {
            "string": ""
        }
    },
    "2_2_201": {
        "ReportColumnName": {
            "string": "Date de commande"
        },
        "Aggregate": {
            "string": ""
        }
    },
    "2_2_202": {
        "ReportColumnName": {
            "string": "Numéro de facture"
        },
        "Aggregate": {
            "string": ""
        }
    },
    "2_2_204": {
        "ReportColumnName": {
            "string": "Nom de client"
        },
        "Aggregate": {
            "string": ""
        }
    },
    "2_2_205": {
        "ReportColumnName": {
            "string": "Statut"
        },
        "Aggregate": {
            "string": ""
        }
    },
    "2_2_206": {
        "ReportColumnName": {
            "string": "N/A"
        },
        "Aggregate": {
            "string": ""
        }
    },
    "2_2_207": {
        "ReportColumnName": {
            "string": "Nom de la société (livraison)"
        },
        "Aggregate": {
            "string": ""
        }
    },
    "2_2_208": {
        "ReportColumnName": {
            "string": "Adresse (livraison)"
        },
        "Aggregate": {
            "string": ""
        }
    },
    "2_2_209": {
        "ReportColumnName": {
            "string": "Ville (livraison)"
        },
        "Aggregate": {
            "string": ""
        }
    },
    "2_2_210": {
        "ReportColumnName": {
            "string": "Code postal (livraison)"
        },
        "Aggregate": {
            "string": ""
        }
    },
    "2_2_211": {
        "ReportColumnName": {
            "string": "Lieu de livraison"
        },
        "Aggregate": {
            "string": ""
        }
    },
    "2_2_212": {
        "ReportColumnName": {
            "string": "Adresse de livraison"
        },
        "Aggregate": {
            "string": ""
        }
    },
    "2_2_213": {
        "ReportColumnName": {
            "string": "Ville de livraison"
        },
        "Aggregate": {
            "string": ""
        }
    },
    "2_2_214": {
        "ReportColumnName": {
            "string": "Code postal de livraison"
        },
        "Aggregate": {
            "string": ""
        }
    },
    "2_2_215": {
        "ReportColumnName": {
            "string": "Référence de commande client"
        },
        "Aggregate": {
            "string": ""
        }
    },
    "2_2_216": {
        "ReportColumnName": {
            "string": "Référence web Mybidfood"
        },
        "Aggregate": {
            "string": ""
        }
    },
    "2_2_218": {
        "ReportColumnName": {
            "string": "Nom du site"
        },
        "Aggregate": {
            "string": ""
        }
    },
    "2_2_219": {
        "ReportColumnName": {
            "string": "N/A"
        },
        "Aggregate": {
            "string": ""
        }
    },
    "2_2_220": {
        "ReportColumnName": {
            "string": "Nombre d'articles"
        },
        "Aggregate": {
            "string": ""
        }
    },
    "2_2_221": {
        "ReportColumnName": {
            "string": "Remise"
        },
        "Aggregate": {
            "string": ""
        }
    },
    "2_2_222": {
        "ReportColumnName": {
            "string": "N/A"
        },
        "Aggregate": {
            "string": ""
        }
    },
    "2_2_223": {
        "ReportColumnName": {
            "string": "Autres charges"
        },
        "Aggregate": {
            "string": ""
        }
    },
    "2_2_224": {
        "ReportColumnName": {
            "string": "TVA"
        },
        "Aggregate": {
            "string": ""
        }
    },
    "2_2_225": {
        "ReportColumnName": {
            "string": "Prix total"
        },
        "Aggregate": {
            "string": ""
        }
    },
    "2_2_226": {
        "ReportColumnName": {
            "string": "N/A"
        },
        "Aggregate": {
            "string": ""
        }
    },
    "2_2_227": {
        "ReportColumnName": {
            "string": "Nombre de lignes"
        },
        "Aggregate": {
            "string": ""
        }
    },
    "2_2_229": {
        "ReportColumnName": {
            "string": "Libellé produit"
        },
        "Aggregate": {
            "string": ""
        }
    },
    "2_2_230": {
        "ReportColumnName": {
            "string": "N/A"
        },
        "Aggregate": {
            "string": ""
        }
    },
    "2_2_231": {
        "ReportColumnName": {
            "string": "Unité de commande"
        },
        "Aggregate": {
            "string": ""
        }
    },
    "2_2_232": {
        "ReportColumnName": {
            "string": "Quantité commandée"
        },
        "Aggregate": {
            "string": ""
        }
    },
    "2_2_233": {
        "ReportColumnName": {
            "string": "Article sur commande"
        },
        "Aggregate": {
            "string": ""
        }
    },
    "2_2_234": {
        "ReportColumnName": {
            "string": "Quantité livrable"
        },
        "Aggregate": {
            "string": ""
        }
    },
    "2_2_235": {
        "ReportColumnName": {
            "string": "Prix unitaire"
        },
        "Aggregate": {
            "string": ""
        }
    },
    "2_2_236": {
        "ReportColumnName": {
            "string": "Prix total/article"
        },
        "Aggregate": {
            "string": ""
        }
    },
    "2_2_237": {
        "ReportColumnName": {
            "string": "TVA totale/article"
        },
        "Aggregate": {
            "string": ""
        }
    },
    "2_2_238": {
        "ReportColumnName": {
            "string": "N/A"
        },
        "Aggregate": {
            "string": ""
        }
    },
    "2_2_239": {
        "ReportColumnName": {
            "string": "Marque"
        },
        "Aggregate": {
            "string": ""
        }
    },
    "2_2_240": {
        "ReportColumnName": {
            "string": "Contenu"
        },
        "Aggregate": {
            "string": ""
        }
    },
    "2_2_241": {
        "ReportColumnName": {
            "string": "N/A"
        },
        "Aggregate": {
            "string": ""
        }
    },
    "2_2_242": {
        "ReportColumnName": {
            "string": "N/A"
        },
        "Aggregate": {
            "string": ""
        }
    },
    "2_2_243": {
        "ReportColumnName": {
            "string": "N/A"
        },
        "Aggregate": {
            "string": ""
        }
    },
    "2_2_244": {
        "ReportColumnName": {
            "string": "N/A"
        },
        "Aggregate": {
            "string": ""
        }
    },
    "2_2_245": {
        "ReportColumnName": {
            "string": "N/A3"
        },
        "Aggregate": {
            "string": ""
        }
    },
    "2_2_246": {
        "ReportColumnName": {
            "string": "N/A"
        },
        "Aggregate": {
            "string": ""
        }
    },
    "2_2_247": {
        "ReportColumnName": {
            "string": "N/A"
        },
        "Aggregate": {
            "string": ""
        }
    },
    "2_2_248": {
        "ReportColumnName": {
            "string": "N/A"
        },
        "Aggregate": {
            "string": ""
        }
    },
    "2_2_249": {
        "ReportColumnName": {
            "string": "N/A"
        },
        "Aggregate": {
            "string": ""
        }
    },
    "2_2_250": {
        "ReportColumnName": {
            "string": "Code client"
        },
        "Aggregate": {
            "string": ""
        }
    },
    "2_2_251": {
        "ReportColumnName": {
            "string": "Code produit"
        },
        "Aggregate": {
            "string": ""
        }
    },
    "2_2_252": {
        "ReportColumnName": {
            "string": "N/A"
        },
        "Aggregate": {
            "string": ""
        }
    },
    "2_2_253": {
        "ReportColumnName": {
            "string": "Date de livraison demandée"
        },
        "Aggregate": {
            "string": ""
        }
    },
    "2_2_254": {
        "ReportColumnName": {
            "string": "Code produit client"
        },
        "Aggregate": {
            "string": ""
        }
    },
    "3_3_300": {
        "ReportColumnName": {
            "string": "Numéro de facture"
        },
        "Aggregate": {
            "string": ""
        }
    },
    "3_3_301": {
        "ReportColumnName": {
            "string": "Date de la facture"
        },
        "Aggregate": {
            "string": ""
        }
    },
    "3_3_302": {
        "ReportColumnName": {
            "string": "N/A"
        },
        "Aggregate": {
            "string": ""
        }
    },
    "3_3_304": {
        "ReportColumnName": {
            "string": "Nom du client"
        },
        "Aggregate": {
            "string": ""
        }
    },
    "3_3_305": {
        "ReportColumnName": {
            "string": "Nom de la société (facturation)"
        },
        "Aggregate": {
            "string": ""
        }
    },
    "3_3_306": {
        "ReportColumnName": {
            "string": "Adresse (facturation)"
        },
        "Aggregate": {
            "string": ""
        }
    },
    "3_3_307": {
        "ReportColumnName": {
            "string": "Ville (facturation)"
        },
        "Aggregate": {
            "string": ""
        }
    },
    "3_3_308": {
        "ReportColumnName": {
            "string": "Code postal (facturation)"
        },
        "Aggregate": {
            "string": ""
        }
    },
    "3_3_309": {
        "ReportColumnName": {
            "string": "Nom de la société (livraison)"
        },
        "Aggregate": {
            "string": ""
        }
    },
    "3_3_310": {
        "ReportColumnName": {
            "string": "Adresse (livraison)"
        },
        "Aggregate": {
            "string": ""
        }
    },
    "3_3_311": {
        "ReportColumnName": {
            "string": "Ville (livraison)"
        },
        "Aggregate": {
            "string": ""
        }
    },
    "3_3_312": {
        "ReportColumnName": {
            "string": "Code postal (livraison)"
        },
        "Aggregate": {
            "string": ""
        }
    },
    "3_3_313": {
        "ReportColumnName": {
            "string": "N/A"
        },
        "Aggregate": {
            "string": ""
        }
    },
    "3_3_314": {
        "ReportColumnName": {
            "string": "Référence de commande client"
        },
        "Aggregate": {
            "string": ""
        }
    },
    "3_3_315": {
        "ReportColumnName": {
            "string": "Référence web Mybidfood"
        },
        "Aggregate": {
            "string": ""
        }
    },
    "3_3_317": {
        "ReportColumnName": {
            "string": "Nom du site"
        },
        "Aggregate": {
            "string": ""
        }
    },
    "3_3_318": {
        "ReportColumnName": {
            "string": "Nombre d'articles"
        },
        "Aggregate": {
            "string": ""
        }
    },
    "3_3_319": {
        "ReportColumnName": {
            "string": "N/A"
        },
        "Aggregate": {
            "string": ""
        }
    },
    "3_3_320": {
        "ReportColumnName": {
            "string": "Autres charges"
        },
        "Aggregate": {
            "string": ""
        }
    },
    "3_3_321": {
        "ReportColumnName": {
            "string": "TVA"
        },
        "Aggregate": {
            "string": ""
        }
    },
    "3_3_322": {
        "ReportColumnName": {
            "string": "Total de la facture"
        },
        "Aggregate": {
            "string": ""
        }
    },
    "3_3_323": {
        "ReportColumnName": {
            "string": "Remise"
        },
        "Aggregate": {
            "string": ""
        }
    },
    "3_3_324": {
        "ReportColumnName": {
            "string": "N/A"
        },
        "Aggregate": {
            "string": ""
        }
    },
    "3_3_326": {
        "ReportColumnName": {
            "string": "Libellé produit"
        },
        "Aggregate": {
            "string": ""
        }
    },
    "3_3_327": {
        "ReportColumnName": {
            "string": "N/A"
        },
        "Aggregate": {
            "string": ""
        }
    },
    "3_3_328": {
        "ReportColumnName": {
            "string": "N/A"
        },
        "Aggregate": {
            "string": ""
        }
    },
    "3_3_329": {
        "ReportColumnName": {
            "string": "Unité de commande"
        },
        "Aggregate": {
            "string": ""
        }
    },
    "3_3_330": {
        "ReportColumnName": {
            "string": "Quantité commandée"
        },
        "Aggregate": {
            "string": ""
        }
    },
    "3_3_331": {
        "ReportColumnName": {
            "string": "N/A"
        },
        "Aggregate": {
            "string": ""
        }
    },
    "3_3_332": {
        "ReportColumnName": {
            "string": "Quantité facturée"
        },
        "Aggregate": {
            "string": ""
        }
    },
    "3_3_333": {
        "ReportColumnName": {
            "string": "N/A"
        },
        "Aggregate": {
            "string": ""
        }
    },
    "3_3_334": {
        "ReportColumnName": {
            "string": "N/A"
        },
        "Aggregate": {
            "string": ""
        }
    },
    "3_3_335": {
        "ReportColumnName": {
            "string": "Prix unitaire"
        },
        "Aggregate": {
            "string": ""
        }
    },
    "3_3_336": {
        "ReportColumnName": {
            "string": "Total global"
        },
        "Aggregate": {
            "string": ""
        }
    },
    "3_3_337": {
        "ReportColumnName": {
            "string": "TVA"
        },
        "Aggregate": {
            "string": ""
        }
    },
    "3_3_338": {
        "ReportColumnName": {
            "string": "Marque"
        },
        "Aggregate": {
            "string": ""
        }
    },
    "3_3_339": {
        "ReportColumnName": {
            "string": "N/A"
        },
        "Aggregate": {
            "string": ""
        }
    },
    "3_3_340": {
        "ReportColumnName": {
            "string": "N/A"
        },
        "Aggregate": {
            "string": ""
        }
    },
    "3_3_341": {
        "ReportColumnName": {
            "string": "N/A"
        },
        "Aggregate": {
            "string": ""
        }
    },
    "3_3_342": {
        "ReportColumnName": {
            "string": "N/A"
        },
        "Aggregate": {
            "string": ""
        }
    },
    "3_3_343": {
        "ReportColumnName": {
            "string": "N/A"
        },
        "Aggregate": {
            "string": ""
        }
    },
    "3_3_344": {
        "ReportColumnName": {
            "string": "N/A"
        },
        "Aggregate": {
            "string": ""
        }
    },
    "3_3_345": {
        "ReportColumnName": {
            "string": "N/A"
        },
        "Aggregate": {
            "string": ""
        }
    },
    "3_3_346": {
        "ReportColumnName": {
            "string": "N/A"
        },
        "Aggregate": {
            "string": ""
        }
    },
    "3_3_347": {
        "ReportColumnName": {
            "string": "N/A"
        },
        "Aggregate": {
            "string": ""
        }
    },
    "3_3_348": {
        "ReportColumnName": {
            "string": "Numéro de client"
        },
        "Aggregate": {
            "string": ""
        }
    },
    "3_3_349": {
        "ReportColumnName": {
            "string": "Code produit"
        },
        "Aggregate": {
            "string": ""
        }
    },
    "3_3_350": {
        "ReportColumnName": {
            "string": "N/A"
        },
        "Aggregate": {
            "string": ""
        }
    },
    "3_3_351": {
        "ReportColumnName": {
            "string": "Sous-catégorie"
        },
        "Aggregate": {
            "string": ""
        }
    },
    "3_3_352": {
        "ReportColumnName": {
            "string": "Code produit client"
        },
        "Aggregate": {
            "string": ""
        }
    },
    "4_4_400": {
        "ReportColumnName": {
            "string": "Numéro de note de crédit"
        },
        "Aggregate": {
            "string": ""
        }
    },
    "4_4_402": {
        "ReportColumnName": {
            "string": "Date de note de crédit"
        },
        "Aggregate": {
            "string": ""
        }
    },
    "4_4_404": {
        "ReportColumnName": {
            "string": "Nom de client"
        },
        "Aggregate": {
            "string": ""
        }
    },
    "4_4_405": {
        "ReportColumnName": {
            "string": "N/A"
        },
        "Aggregate": {
            "string": ""
        }
    },
    "4_4_406": {
        "ReportColumnName": {
            "string": "Nom de la société (facturation)"
        },
        "Aggregate": {
            "string": ""
        }
    },
    "4_4_407": {
        "ReportColumnName": {
            "string": "Adresse (facturation)"
        },
        "Aggregate": {
            "string": ""
        }
    },
    "4_4_408": {
        "ReportColumnName": {
            "string": "Ville (facturation)"
        },
        "Aggregate": {
            "string": ""
        }
    },
    "4_4_409": {
        "ReportColumnName": {
            "string": "Code postal (facturation)"
        },
        "Aggregate": {
            "string": ""
        }
    },
    "4_4_410": {
        "ReportColumnName": {
            "string": "Nom de la société (livraison)"
        },
        "Aggregate": {
            "string": ""
        }
    },
    "4_4_411": {
        "ReportColumnName": {
            "string": "Adresse (livraison)"
        },
        "Aggregate": {
            "string": ""
        }
    },
    "4_4_412": {
        "ReportColumnName": {
            "string": "Ville (livraison)"
        },
        "Aggregate": {
            "string": ""
        }
    },
    "4_4_413": {
        "ReportColumnName": {
            "string": "Code postal (livraison)"
        },
        "Aggregate": {
            "string": ""
        }
    },
    "4_4_414": {
        "ReportColumnName": {
            "string": "N/A"
        },
        "Aggregate": {
            "string": ""
        }
    },
    "4_4_415": {
        "ReportColumnName": {
            "string": "N/A"
        },
        "Aggregate": {
            "string": ""
        }
    },
    "4_4_416": {
        "ReportColumnName": {
            "string": "N/A"
        },
        "Aggregate": {
            "string": ""
        }
    },
    "4_4_417": {
        "ReportColumnName": {
            "string": "N/A"
        },
        "Aggregate": {
            "string": ""
        }
    },
    "4_4_418": {
        "ReportColumnName": {
            "string": "N/A"
        },
        "Aggregate": {
            "string": ""
        }
    },
    "4_4_420": {
        "ReportColumnName": {
            "string": "Nom du site"
        },
        "Aggregate": {
            "string": ""
        }
    },
    "4_4_421": {
        "ReportColumnName": {
            "string": "Nombre de lignes"
        },
        "Aggregate": {
            "string": ""
        }
    },
    "4_4_422": {
        "ReportColumnName": {
            "string": "N/A"
        },
        "Aggregate": {
            "string": ""
        }
    },
    "4_4_423": {
        "ReportColumnName": {
            "string": "Autres charges"
        },
        "Aggregate": {
            "string": ""
        }
    },
    "4_4_424": {
        "ReportColumnName": {
            "string": "TVA"
        },
        "Aggregate": {
            "string": ""
        }
    },
    "4_4_425": {
        "ReportColumnName": {
            "string": "Prix total"
        },
        "Aggregate": {
            "string": ""
        }
    },
    "4_4_426": {
        "ReportColumnName": {
            "string": "Remise"
        },
        "Aggregate": {
            "string": ""
        }
    },
    "4_4_427": {
        "ReportColumnName": {
            "string": "N/A"
        },
        "Aggregate": {
            "string": ""
        }
    },
    "4_4_429": {
        "ReportColumnName": {
            "string": "Libellé"
        },
        "Aggregate": {
            "string": ""
        }
    },
    "4_4_430": {
        "ReportColumnName": {
            "string": "N/A"
        },
        "Aggregate": {
            "string": ""
        }
    },
    "4_4_431": {
        "ReportColumnName": {
            "string": "N/A"
        },
        "Aggregate": {
            "string": ""
        }
    },
    "4_4_432": {
        "ReportColumnName": {
            "string": "Quantité commandée"
        },
        "Aggregate": {
            "string": ""
        }
    },
    "4_4_433": {
        "ReportColumnName": {
            "string": "N/A"
        },
        "Aggregate": {
            "string": ""
        }
    },
    "4_4_434": {
        "ReportColumnName": {
            "string": "Quantité facturée"
        },
        "Aggregate": {
            "string": ""
        }
    },
    "4_4_435": {
        "ReportColumnName": {
            "string": "Prix unitaire"
        },
        "Aggregate": {
            "string": ""
        }
    },
    "4_4_436": {
        "ReportColumnName": {
            "string": "Total global"
        },
        "Aggregate": {
            "string": ""
        }
    },
    "4_4_437": {
        "ReportColumnName": {
            "string": "Total TVA"
        },
        "Aggregate": {
            "string": ""
        }
    },
    "4_4_438": {
        "ReportColumnName": {
            "string": "Marque"
        },
        "Aggregate": {
            "string": ""
        }
    },
    "4_4_439": {
        "ReportColumnName": {
            "string": "Contenu"
        },
        "Aggregate": {
            "string": ""
        }
    },
    "4_4_440": {
        "ReportColumnName": {
            "string": "N/A"
        },
        "Aggregate": {
            "string": ""
        }
    },
    "4_4_441": {
        "ReportColumnName": {
            "string": "N/A"
        },
        "Aggregate": {
            "string": ""
        }
    },
    "4_4_442": {
        "ReportColumnName": {
            "string": "N/A"
        },
        "Aggregate": {
            "string": ""
        }
    },
    "4_4_443": {
        "ReportColumnName": {
            "string": "N/A"
        },
        "Aggregate": {
            "string": ""
        }
    },
    "4_4_444": {
        "ReportColumnName": {
            "string": "N/A"
        },
        "Aggregate": {
            "string": ""
        }
    },
    "4_4_445": {
        "ReportColumnName": {
            "string": "Code client"
        },
        "Aggregate": {
            "string": ""
        }
    },
    "4_4_446": {
        "ReportColumnName": {
            "string": "Code produit"
        },
        "Aggregate": {
            "string": ""
        }
    },
    "4_4_447": {
        "ReportColumnName": {
            "string": "N/A"
        },
        "Aggregate": {
            "string": ""
        }
    },
    "4_4_448": {
        "ReportColumnName": {
            "string": "Sous-catégorie"
        },
        "Aggregate": {
            "string": ""
        }
    },
    "4_4_449": {
        "ReportColumnName": {
            "string": "Code produit client"
        },
        "Aggregate": {
            "string": ""
        }
    },
    "5_5_500": {
        "ReportColumnName": {
            "string": "Date du relevé"
        },
        "Aggregate": {
            "string": ""
        }
    },
    "5_5_502": {
        "ReportColumnName": {
            "string": "Numéro de client"
        },
        "Aggregate": {
            "string": ""
        }
    },
    "5_5_503": {
        "ReportColumnName": {
            "string": "Nom du client"
        },
        "Aggregate": {
            "string": ""
        }
    },
    "5_5_504": {
        "ReportColumnName": {
            "string": "Adresse 1"
        },
        "Aggregate": {
            "string": ""
        }
    },
    "5_5_505": {
        "ReportColumnName": {
            "string": "Adresse 2"
        },
        "Aggregate": {
            "string": ""
        }
    },
    "5_5_506": {
        "ReportColumnName": {
            "string": "Adresse 3"
        },
        "Aggregate": {
            "string": ""
        }
    },
    "5_5_507": {
        "ReportColumnName": {
            "string": "Conditions"
        },
        "Aggregate": {
            "string": ""
        }
    },
    "5_5_508": {
        "ReportColumnName": {
            "string": "Message"
        },
        "Aggregate": {
            "string": ""
        }
    },
    "5_5_509": {
        "ReportColumnName": {
            "string": "Contrôle du crédit"
        },
        "Aggregate": {
            "string": ""
        }
    },
    "5_5_510": {
        "ReportColumnName": {
            "string": "Âge actuel"
        },
        "Aggregate": {
            "string": ""
        }
    },
    "5_5_511": {
        "ReportColumnName": {
            "string": "30 ans"
        },
        "Aggregate": {
            "string": ""
        }
    },
    "5_5_512": {
        "ReportColumnName": {
            "string": "60 ans"
        },
        "Aggregate": {
            "string": ""
        }
    },
    "5_5_513": {
        "ReportColumnName": {
            "string": "90 ans"
        },
        "Aggregate": {
            "string": ""
        }
    },
    "5_5_514": {
        "ReportColumnName": {
            "string": "Numéro de transaction"
        },
        "Aggregate": {
            "string": ""
        }
    },
    "5_5_515": {
        "ReportColumnName": {
            "string": "Date de la transaction"
        },
        "Aggregate": {
            "string": ""
        }
    },
    "5_5_516": {
        "ReportColumnName": {
            "string": "Type de transaction "
        },
        "Aggregate": {
            "string": ""
        }
    },
    "5_5_517": {
        "ReportColumnName": {
            "string": "Référence"
        },
        "Aggregate": {
            "string": ""
        }
    },
    "5_5_518": {
        "ReportColumnName": {
            "string": "Numéro de client"
        },
        "Aggregate": {
            "string": ""
        }
    },
    "5_5_519": {
        "ReportColumnName": {
            "string": "Montant"
        },
        "Aggregate": {
            "string": ""
        }
    },
    "5_5_520": {
        "ReportColumnName": {
            "string": "Montant du crédit"
        },
        "Aggregate": {
            "string": ""
        }
    },
    "5_5_521": {
        "ReportColumnName": {
            "string": "Équilibre"
        },
        "Aggregate": {
            "string": ""
        }
    },
    "5_5_522": {
        "ReportColumnName": {
            "string": "Equilibre cumulé"
        },
        "Aggregate": {
            "string": ""
        }
    },
    "5_5_523": {
        "ReportColumnName": {
            "string": "Date du relevé"
        },
        "Aggregate": {
            "string": ""
        }
    },
    "5_5_524": {
        "ReportColumnName": {
            "string": "Nom du client"
        },
        "Aggregate": {
            "string": ""
        }
    },
    "6_6_601": {
        "ReportColumnName": {
            "string": "Nom du site"
        },
        "Aggregate": {
            "string": ""
        }
    },
    "6_6_603": {
        "ReportColumnName": {
            "string": "Marque"
        },
        "Aggregate": {
            "string": ""
        }
    },
    "6_6_605": {
        "ReportColumnName": {
            "string": "Libellé produit"
        },
        "Aggregate": {
            "string": ""
        }
    },
    "6_6_606": {
        "ReportColumnName": {
            "string": "Sous-catégories"
        },
        "Aggregate": {
            "string": ""
        }
    },
    "6_6_607": {
        "ReportColumnName": {
            "string": "N/A"
        },
        "Aggregate": {
            "string": ""
        }
    },
    "6_6_608": {
        "ReportColumnName": {
            "string": "Taux TVA"
        },
        "Aggregate": {
            "string": ""
        }
    },
    "6_6_609": {
        "ReportColumnName": {
            "string": "Conditionnement minimum"
        },
        "Aggregate": {
            "string": ""
        }
    },
    "6_6_610": {
        "ReportColumnName": {
            "string": "Conditionnement maximum"
        },
        "Aggregate": {
            "string": ""
        }
    },
    "6_6_611": {
        "ReportColumnName": {
            "string": "Contenu"
        },
        "Aggregate": {
            "string": ""
        }
    },
    "6_6_612": {
        "ReportColumnName": {
            "string": "Prix unitaire"
        },
        "Aggregate": {
            "string": ""
        }
    },
    "6_6_613": {
        "ReportColumnName": {
            "string": "N/A"
        },
        "Aggregate": {
            "string": ""
        }
    },
    "6_6_614": {
        "ReportColumnName": {
            "string": "Catégorie"
        },
        "Aggregate": {
            "string": ""
        }
    },
    "6_6_616": {
        "ReportColumnName": {
            "string": "N/A"
        },
        "Aggregate": {
            "string": ""
        }
    },
    "6_6_617": {
        "ReportColumnName": {
            "string": "N/A"
        },
        "Aggregate": {
            "string": ""
        }
    },
    "6_6_618": {
        "ReportColumnName": {
            "string": "N/A"
        },
        "Aggregate": {
            "string": ""
        }
    },
    "6_6_619": {
        "ReportColumnName": {
            "string": "N/A"
        },
        "Aggregate": {
            "string": ""
        }
    },
    "6_6_620": {
        "ReportColumnName": {
            "string": "Numéro de client"
        },
        "Aggregate": {
            "string": ""
        }
    },
    "6_6_621": {
        "ReportColumnName": {
            "string": "Code produit"
        },
        "Aggregate": {
            "string": ""
        }
    },
    "6_6_622": {
        "ReportColumnName": {
            "string": "N/A"
        },
        "Aggregate": {
            "string": ""
        }
    },
    "6_6_623": {
        "ReportColumnName": {
            "string": "N/A"
        },
        "Aggregate": {
            "string": ""
        }
    },
    "6_6_624": {
        "ReportColumnName": {
            "string": "Prix conditionnement maximum"
        },
        "Aggregate": {
            "string": ""
        }
    },
    "6_6_625": {
        "ReportColumnName": {
            "string": "Nom du client"
        },
        "Aggregate": {
            "string": ""
        }
    },
    "8_8_800": {
        "ReportColumnName": {
            "string": "Numéro de client"
        },
        "Aggregate": {
            "string": ""
        }
    },
    "8_8_801": {
        "ReportColumnName": {
            "string": "Nom du client"
        },
        "Aggregate": {
            "string": ""
        }
    },
    "8_8_803": {
        "ReportColumnName": {
            "string": "Date de facturation"
        },
        "Aggregate": {
            "string": ""
        }
    },
    "8_8_804": {
        "ReportColumnName": {
            "string": "N/A"
        },
        "Aggregate": {
            "string": ""
        }
    },
    "8_8_805": {
        "ReportColumnName": {
            "string": "Catégorie"
        },
        "Aggregate": {
            "string": ""
        }
    },
    "8_8_807": {
        "ReportColumnName": {
            "string": "Sous-catégorie"
        },
        "Aggregate": {
            "string": ""
        }
    },
    "8_8_810": {
        "ReportColumnName": {
            "string": "Marque"
        },
        "Aggregate": {
            "string": ""
        }
    },
    "8_8_811": {
        "ReportColumnName": {
            "string": "Libellé produit"
        },
        "Aggregate": {
            "string": ""
        }
    },
    "8_8_812": {
        "ReportColumnName": {
            "string": "Contenu"
        },
        "Aggregate": {
            "string": ""
        }
    },
    "8_8_813": {
        "ReportColumnName": {
            "string": "N/A"
        },
        "Aggregate": {
            "string": ""
        }
    },
    "8_8_814": {
        "ReportColumnName": {
            "string": "Conditionnement"
        },
        "Aggregate": {
            "string": ""
        }
    },
    "8_8_815": {
        "ReportColumnName": {
            "string": "Prix unitaire"
        },
        "Aggregate": {
            "string": ""
        }
    },
    "8_8_816": {
        "ReportColumnName": {
            "string": "N/A"
        },
        "Aggregate": {
            "string": ""
        }
    },
    "8_8_817": {
        "ReportColumnName": {
            "string": "N/A"
        },
        "Aggregate": {
            "string": ""
        }
    },
    "8_8_818": {
        "ReportColumnName": {
            "string": "N/A"
        },
        "Aggregate": {
            "string": ""
        }
    },
    "8_8_819": {
        "ReportColumnName": {
            "string": "N/A"
        },
        "Aggregate": {
            "string": ""
        }
    },
    "8_8_820": {
        "ReportColumnName": {
            "string": "N/A"
        },
        "Aggregate": {
            "string": ""
        }
    },
    "8_8_821": {
        "ReportColumnName": {
            "string": "Code produit"
        },
        "Aggregate": {
            "string": ""
        }
    },
    "8_8_822": {
        "ReportColumnName": {
            "string": "Quantité dernière commande"
        },
        "Aggregate": {
            "string": "sum"
        }
    },
    "8_8_823": {
        "ReportColumnName": {
            "string": "TVA"
        },
        "Aggregate": {
            "string": "sum"
        }
    },
    "8_8_824": {
        "ReportColumnName": {
            "string": "Total"
        },
        "Aggregate": {
            "string": "sum"
        }
    },
    "8_8_825": {
        "ReportColumnName": {
            "string": "N/A"
        },
        "Aggregate": {
            "string": ""
        }
    },
    "9_9_901": {
        "ReportColumnName": {
            "string": "Code client"
        },
        "Aggregate": {
            "string": ""
        }
    },
    "9_9_902": {
        "ReportColumnName": {
            "string": "Nom de client"
        },
        "Aggregate": {
            "string": ""
        }
    },
    "9_9_904": {
        "ReportColumnName": {
            "string": "N/A"
        },
        "Aggregate": {
            "string": ""
        }
    },
    "9_9_905": {
        "ReportColumnName": {
            "string": "Nom du site"
        },
        "Aggregate": {
            "string": ""
        }
    },
    "9_9_907": {
        "ReportColumnName": {
            "string": "Code produit"
        },
        "Aggregate": {
            "string": ""
        }
    },
    "9_9_908": {
        "ReportColumnName": {
            "string": "Libellé produit"
        },
        "Aggregate": {
            "string": ""
        }
    },
    "9_9_909": {
        "ReportColumnName": {
            "string": "N/A"
        },
        "Aggregate": {
            "string": ""
        }
    },
    "9_9_910": {
        "ReportColumnName": {
            "string": "Sous-catégorie"
        },
        "Aggregate": {
            "string": ""
        }
    },
    "9_9_912": {
        "ReportColumnName": {
            "string": "Marque"
        },
        "Aggregate": {
            "string": ""
        }
    },
    "9_9_914": {
        "ReportColumnName": {
            "string": "Conditionnement minimum"
        },
        "Aggregate": {
            "string": ""
        }
    },
    "9_9_915": {
        "ReportColumnName": {
            "string": "Conditionnement maximum"
        },
        "Aggregate": {
            "string": ""
        }
    },
    "9_9_916": {
        "ReportColumnName": {
            "string": "Prix unitaire/conditionnement de base"
        },
        "Aggregate": {
            "string": ""
        }
    },
    "9_9_917": {
        "ReportColumnName": {
            "string": "Prix unitaire/conditionnement supérieur"
        },
        "Aggregate": {
            "string": ""
        }
    },
    "9_9_918": {
        "ReportColumnName": {
            "string": "Contenu"
        },
        "Aggregate": {
            "string": ""
        }
    },
    "9_9_919": {
        "ReportColumnName": {
            "string": "N/A"
        },
        "Aggregate": {
            "string": ""
        }
    },
    "9_9_920": {
        "ReportColumnName": {
            "string": "Dépôt"
        },
        "Aggregate": {
            "string": ""
        }
    },
    "9_9_921": {
        "ReportColumnName": {
            "string": "Taux TVA"
        },
        "Aggregate": {
            "string": ""
        }
    },
    "9_9_922": {
        "ReportColumnName": {
            "string": "N/A"
        },
        "Aggregate": {
            "string": ""
        }
    },
    "9_9_923": {
        "ReportColumnName": {
            "string": "N/A"
        },
        "Aggregate": {
            "string": ""
        }
    },
    "10_10_1000": {
        "ReportColumnName": {
            "string": "Catégorie"
        },
        "Aggregate": {
            "string": ""
        }
    },
    "10_10_1002": {
        "ReportColumnName": {
            "string": "Sous-catégorie"
        },
        "Aggregate": {
            "string": ""
        }
    },
    "10_10_1005": {
        "ReportColumnName": {
            "string": "Marque"
        },
        "Aggregate": {
            "string": ""
        }
    },
    "10_10_1007": {
        "ReportColumnName": {
            "string": "Description"
        },
        "Aggregate": {
            "string": ""
        }
    },
    "10_10_1008": {
        "ReportColumnName": {
            "string": "Contenu"
        },
        "Aggregate": {
            "string": ""
        }
    },
    "10_10_1009": {
        "ReportColumnName": {
            "string": "N/A"
        },
        "Aggregate": {
            "string": ""
        }
    },
    "10_10_1010": {
        "ReportColumnName": {
            "string": "Unité de commande"
        },
        "Aggregate": {
            "string": ""
        }
    },
    "10_10_1011": {
        "ReportColumnName": {
            "string": "Prix le plus élevé payé"
        },
        "Aggregate": {
            "string": ""
        }
    },
    "10_10_1013": {
        "ReportColumnName": {
            "string": "Date de l'enregistrement"
        },
        "Aggregate": {
            "string": ""
        }
    },
    "10_10_1014": {
        "ReportColumnName": {
            "string": "N/A"
        },
        "Aggregate": {
            "string": ""
        }
    },
    "10_10_1015": {
        "ReportColumnName": {
            "string": "N/A"
        },
        "Aggregate": {
            "string": ""
        }
    },
    "10_10_1016": {
        "ReportColumnName": {
            "string": "N/A"
        },
        "Aggregate": {
            "string": ""
        }
    },
    "10_10_1017": {
        "ReportColumnName": {
            "string": "N/A"
        },
        "Aggregate": {
            "string": ""
        }
    },
    "10_10_1018": {
        "ReportColumnName": {
            "string": "Numéro de client"
        },
        "Aggregate": {
            "string": ""
        }
    },
    "10_10_1019": {
        "ReportColumnName": {
            "string": "Nom du client"
        },
        "Aggregate": {
            "string": ""
        }
    },
    "10_10_1020": {
        "ReportColumnName": {
            "string": "Code produit"
        },
        "Aggregate": {
            "string": ""
        }
    },
    "10_10_1021": {
        "ReportColumnName": {
            "string": "N/A"
        },
        "Aggregate": {
            "string": ""
        }
    },
    "10_10_1022": {
        "ReportColumnName": {
            "string": "N/A"
        },
        "Aggregate": {
            "string": ""
        }
    },
    "11_11_1101": {
        "ReportColumnName": {
            "string": "Nom du client"
        },
        "Aggregate": {
            "string": ""
        }
    },
    "11_11_1102": {
        "ReportColumnName": {
            "string": "N/A"
        },
        "Aggregate": {
            "string": ""
        }
    },
    "11_11_1103": {
        "ReportColumnName": {
            "string": "N/A"
        },
        "Aggregate": {
            "string": ""
        }
    },
    "11_11_1106": {
        "ReportColumnName": {
            "string": "Code produit"
        },
        "Aggregate": {
            "string": ""
        }
    },
    "11_11_1107": {
        "ReportColumnName": {
            "string": "Libellé produit"
        },
        "Aggregate": {
            "string": ""
        }
    },
    "11_11_1108": {
        "ReportColumnName": {
            "string": "Contenu"
        },
        "Aggregate": {
            "string": ""
        }
    },
    "11_11_1109": {
        "ReportColumnName": {
            "string": "Sous-catégorie"
        },
        "Aggregate": {
            "string": ""
        }
    },
    "11_11_1111": {
        "ReportColumnName": {
            "string": "Marque"
        },
        "Aggregate": {
            "string": ""
        }
    },
    "11_11_1113": {
        "ReportColumnName": {
            "string": "Conditionnement minimum"
        },
        "Aggregate": {
            "string": ""
        }
    },
    "11_11_1114": {
        "ReportColumnName": {
            "string": "Conditionnement maximum"
        },
        "Aggregate": {
            "string": ""
        }
    },
    "11_11_1115": {
        "ReportColumnName": {
            "string": "Code article alternatif"
        },
        "Aggregate": {
            "string": ""
        }
    },
    "11_11_1116": {
        "ReportColumnName": {
            "string": "Marque alternative"
        },
        "Aggregate": {
            "string": ""
        }
    },
    "11_11_1118": {
        "ReportColumnName": {
            "string": "Code produit alternatif"
        },
        "Aggregate": {
            "string": ""
        }
    },
    "11_11_1119": {
        "ReportColumnName": {
            "string": "Libellé du produit alternatif"
        },
        "Aggregate": {
            "string": ""
        }
    },
    "11_11_1120": {
        "ReportColumnName": {
            "string": "Contenu du produit alternatif"
        },
        "Aggregate": {
            "string": ""
        }
    },
    "11_11_1121": {
        "ReportColumnName": {
            "string": "Taux TVA du produit alternatif"
        },
        "Aggregate": {
            "string": ""
        }
    },
    "11_11_1122": {
        "ReportColumnName": {
            "string": "Sous-catégorie du produit alternatif"
        },
        "Aggregate": {
            "string": ""
        }
    },
    "11_11_1124": {
        "ReportColumnName": {
            "string": "Conditionnement minimal produit alternatief"
        },
        "Aggregate": {
            "string": ""
        }
    },
    "11_11_1125": {
        "ReportColumnName": {
            "string": "Conditionnement maximal produit alternatief"
        },
        "Aggregate": {
            "string": ""
        }
    },
    "11_11_1126": {
        "ReportColumnName": {
            "string": "Taux TVA"
        },
        "Aggregate": {
            "string": ""
        }
    },
    "11_11_1127": {
        "ReportColumnName": {
            "string": "Login demandeur"
        },
        "Aggregate": {
            "string": ""
        }
    },
    "12_12_1201": {
        "ReportColumnName": {
            "string": "Numéro de client"
        },
        "Aggregate": {
            "string": ""
        }
    },
    "12_12_1202": {
        "ReportColumnName": {
            "string": "Nom du client"
        },
        "Aggregate": {
            "string": ""
        }
    },
    "12_12_1204": {
        "ReportColumnName": {
            "string": "N/A"
        },
        "Aggregate": {
            "string": ""
        }
    },
    "12_12_1207": {
        "ReportColumnName": {
            "string": "Code produit"
        },
        "Aggregate": {
            "string": ""
        }
    },
    "12_12_1208": {
        "ReportColumnName": {
            "string": "Libellé produit"
        },
        "Aggregate": {
            "string": ""
        }
    },
    "12_12_1209": {
        "ReportColumnName": {
            "string": "Contenu"
        },
        "Aggregate": {
            "string": ""
        }
    },
    "12_12_1210": {
        "ReportColumnName": {
            "string": "Sous-catégorie"
        },
        "Aggregate": {
            "string": ""
        }
    },
    "12_12_1212": {
        "ReportColumnName": {
            "string": "Marque"
        },
        "Aggregate": {
            "string": ""
        }
    },
    "12_12_1214": {
        "ReportColumnName": {
            "string": "Conditionnement minimum"
        },
        "Aggregate": {
            "string": ""
        }
    },
    "12_12_1215": {
        "ReportColumnName": {
            "string": "Conditionnement maximum"
        },
        "Aggregate": {
            "string": ""
        }
    },
    "12_12_1216": {
        "ReportColumnName": {
            "string": "Contenu carton"
        },
        "Aggregate": {
            "string": ""
        }
    },
    "12_12_1217": {
        "ReportColumnName": {
            "string": "Prix unitaire/conditionnement de base"
        },
        "Aggregate": {
            "string": ""
        }
    },
    "12_12_1218": {
        "ReportColumnName": {
            "string": "Prix unitaire/conditionnement supérieur"
        },
        "Aggregate": {
            "string": ""
        }
    },
    "12_12_1219": {
        "ReportColumnName": {
            "string": "Date fin de promo"
        },
        "Aggregate": {
            "string": ""
        }
    },
    "12_12_1220": {
        "ReportColumnName": {
            "string": "Taux TVA"
        },
        "Aggregate": {
            "string": ""
        }
    },
    "12_12_1221": {
        "ReportColumnName": {
            "string": "Login demandeur"
        },
        "Aggregate": {
            "string": ""
        }
    }
}