{
   "1":{
      "string":"Error de sistema al actualizar resultado de ERP",
      "context":"System error when updating result from ERP",
      "character_limit":500
   },
   "2":{
      "string":"Error de sistema al deserializar el mensaje devuelto desde ERP.",
      "context":"System error when deserializing the message returned from ERP.",
      "character_limit":500
   },
   "3":{
      "string":"El servicio Live Sync está desactivado.",
      "context":"Live Sync Service is off.",
      "character_limit":500
   },
   "4":{
      "string":"Protocolo de comunicacion (= Desconocido) no está configurado correctamente.",
      "context":"CommunicationProtocol(=Unknown) is not set correctly.",
      "character_limit":500
   },
   "5":{
      "string":"Detalles de la cuenta recuperados con éxito, la cuenta se actualizará en breve",
      "context":"Account details successfully retrieved, the account will be updated shortly",
      "character_limit":500
   },
   "6":{
      "string":"Código de cuenta no válido.",
      "context":"Invalid Account Code.",
      "character_limit":500
   },
   "7":{
      "string":"Ha ocurrido un error general",
      "context":"General Error occurred.",
      "character_limit":500
   },
   "1000":{
      "string":"Registro de aprobación desconocido",
      "context":"Unknown approval record",
      "character_limit":500
   },
   "1001":{
      "string":"Cesta de compras ya aprobada",
      "context":"Basket already approved",
      "character_limit":500
   },
   "1002":{
      "string":"Cesta de compras ya rechazado",
      "context":"Basket already declined",
      "character_limit":500
   },
   "1003":{
      "string":"Cesta de compras bloqueada para editar",
      "context":"Basket locked for editing",
      "character_limit":500
   },
   "1004":{
      "string":"Cesta de compras aprobada por el usuario",
      "context":"Basket already approved by user",
      "character_limit":500
   },
   "1005":{
      "string":"Cestas de compras aprobadas pero requiere aprobación (es) adicional (es)",
      "context":"Basket approved but requires additional approval(s)",
      "character_limit":500
   },
   "1006":{
      "string":"Cesta de compras completamente aprobada y pedido creado",
      "context":"Basket fully approved and order created",
      "character_limit":500
   },
   "1007":{
      "string":"Cestas de compras ya no bloqueadas",
      "context":"Basket no longer locked",
      "character_limit":500
   },
   "1008":{
      "string":"Cesta de compras desbloqueada correctamente",
      "context":"Basket successfully unlocked",
      "character_limit":500
   },
   "1009":{
      "string":"Cesta de compras rechazada",
      "context":"Basket declined",
      "character_limit":500
   },
   "1010":{
      "string":"La cesta de compras ya ha sido editada y solo se permite un cambio",
      "context":"Basket has already been edited and only one change allowed",
      "character_limit":500
   },
   "1011":{
      "string":"La cesta de compras se bloqueó correctamente para editarla",
      "context":"Basket successfully locked for editing",
      "character_limit":500
   },
   "1012":{
      "string":"Error al crear usuario sombra",
      "context":"Failed to create shadow user",
      "character_limit":500
   },
   "1013":{
      "string":"Error al crear una copia del cesta de compras para el usuario sombra",
      "context":"Failed to create copy of basket for shadow user",
      "character_limit":500
   },
   "1014":{
      "string":"El grupo de aprobación no se puede eliminar porque está siendo referenciado por una o más cuentas y / o usuarios",
      "context":"Approval group cannot be deleted because it is being referenced by one or more accounts and/or users",
      "character_limit":500
   },
   "1015":{
      "string":"No se puede eliminar el esquema de aprobación porque contiene uno o más grupos de aprobación",
      "context":"Approval scheme cannot be deleted because it contains one or more approval groups",
      "character_limit":500
   },
   "1016":{
      "string":"Cesta de compras guardada correctamente",
      "context":"Basket successfully saved",
      "character_limit":500
   },
   "1017":{
      "string":"No se puede eliminar el grupo de aprobación que tiene uno o más grupos asociados",
      "context":"Cannot remove approval group that has one or more children",
      "character_limit":500
   },
   "1018":{
      "string":"Su límite de aprobación es insuficiente para aprobar el valor del pedido",
      "context":"Your approval limit is insufficient to approve order value",
      "character_limit":500
   },
   "1019":{
      "string":"Su límite de gasto es <currency symbol><spend limit> para un pedido. Pedidos iguales o superiores a las que se presentarán para su aprobación.",
      "context":"Your spend limit is <currency symbol><spend limit> for an order. Orders equal or above that will be submitted for approval.",
      "character_limit":500
   },
   "1020":{
      "string":"Su límite de gasto para este <períod> es <currency symbol><spend limit>. Con su compra <períod> tiene menos de <currency symbol><balance> para gastar antes de que se envíe para su aprobación.",
      "context":"Your spend limit for this <period> is <currency symbol><spend limit>. With your purchase this <period> you have less than <currency symbol><balance> to spend before it is submitted for approval.",
      "character_limit":500
   },
   "1021":{
      "string":"Ha alcanzado el límite de gastos para este <períod>. Su pedido será enviado para su aprobación.",
      "context":"You have reached your spend limit for this <period>. Your order will be submitted for approval.",
      "character_limit":500
   },
   "1022":{
      "string":"El esquema de aprobación no se puede eliminar porque el usuario no tiene acceso para hacerlo o el esquema ya no existe",
      "context":"Approval scheme can not be deleted because the user does not have access to do so or the scheme no longer exists",
      "character_limit":500
   },
   "1023":{
      "string":"El grupo de aprobación no se puede eliminar porque el usuario no tiene acceso para hacerlo o el grupo ya no existe",
      "context":"Approval group can not be deleted because the user does not have access to do so or the group no longer exists",
      "character_limit":500
   },
   "1024":{
      "string":"Los límites de gasto incluyen impuestos.",
      "context":"Spend limits are inclusive of tax.",
      "character_limit":500
   },
   "1025":{
      "string":"Los límites de gasto no incluyen impuestos.",
      "context":"Spend limits are exclusive of tax.",
      "character_limit":500
   },
   "1026":{
      "string":"El grupo de aprobación no se puede eliminar porque hay pedidos pendientes",
      "context":"Approval group can not be deleted because there are pending orders.",
      "character_limit":500
   },
   "1027":{
      "string":"El grupo de aprobación no se puede eliminar porque estos grupos de clientes hacen referencia a él:",
      "context":"Approval group cannot be deleted because it is being referenced by these customer groups:",
      "character_limit":500
   },
   "1028":{
      "string":"El grupo de aprobación no se puede eliminar porque estas cuentas hacen referencia a él:",
      "context":"Approval group cannot be deleted because it is being referenced by these accounts:",
      "character_limit":500
   },
   "1029":{
      "string":"El grupo de aprobación no se puede eliminar porque estos usuarios hacen referencia a él:",
      "context":"Approval group cannot be deleted because it is being referenced by these users:",
      "character_limit":500
   },
   "2000":{
      "string":"Su límite es <currency symbol><spend limit> por pago. Pagos iguales o superiores a los que se presentarán para su aprobación.",
      "context":"Your limit is <currency symbol><spend limit> per payment. Payments equal or above that will be submitted for approval.",
      "character_limit":500
   },
   "2001":{
      "string":"Pago ya aprobado",
      "context":"Payment already approved",
      "character_limit":500
   },
   "2002":{
      "string":"El pago ya se ha rechazado",
      "context":"Payment already declined",
      "character_limit":500
   },
   "2003":{
      "string":"Pago ya aprobado por el usuario",
      "context":"Payment already approved by user",
      "character_limit":500
   },
   "2004":{
      "string":"Su límite de aprobación es insuficiente para aprobar el valor de pago",
      "context":"Your approval limit is insufficient to approve payment value",
      "character_limit":500
   },
   "2005":{
      "string":"Pago aprobado pero requiere aprobación (es) adicional (es)",
      "context":"Payment approved but requires additional approval(s)",
      "character_limit":500
   },
   "2006":{
      "string":"Pago totalmente aprobado y pago puede ser ejecutado",
      "context":"Payment fully approved and payment can be made",
      "character_limit":500
   },
   "2007":{
      "string":"Pago rechazado",
      "context":"Payment declined",
      "character_limit":500
   }
}