\relax 
\citation{grieco2004performance}
\citation{brakmo1995tcp}
\citation{grieco2004performance}
\citation{rossi2010ledbat}
\citation{carofiglio2010quest}
\citation{hayes2011revisiting}
\citation{shewmaker2016tcp}
\citation{lundin2012google}
\citation{de2013experimental}
\citation{bosshart2013forwarding}
\citation{katabi2002internet}
\citation{sharma17evaluating}
\citation{lundin2012google}
\citation{shewmaker2016tcp}
\citation{lundin2012google}
\citation{lundin2012google}
\citation{mcquistin2016tcp}
\@writefile{toc}{\contentsline {section}{\numberline {I}Introduction}{}}
\@writefile{toc}{\contentsline {section}{\numberline {II}{Why TCP?}}{}}
\citation{honda2011still}
\citation{lundin2012google}
\citation{katabi2002internet}
\citation{dukkipati2007rate}
\@writefile{lof}{\contentsline {figure}{\numberline {1}{\ignorespaces Work flow of NC-TCP\relax }}{}}
\providecommand*\caption@xref[2]{\@setref\relax\@undefined{#1}}
\newlabel{workflow}{{1}{}}
\@writefile{toc}{\contentsline {section}{\numberline {III}NC-TCP Algorithm}{}}
\@writefile{toc}{\contentsline {section}{\numberline {IV}Congestion Control}{}}
\@writefile{toc}{\contentsline {subsection}{\numberline {\unhbox \voidb@x \hbox {IV-A}}Delay Controller}{}}
\newlabel{eq1}{{1}{}}
\@writefile{toc}{\contentsline {subsection}{\numberline {\unhbox \voidb@x \hbox {IV-B}}Fairness Controller}{}}
\@writefile{toc}{\contentsline {subsection}{\numberline {\unhbox \voidb@x \hbox {IV-C}}Stability Analysis}{}}
\newlabel{eq5}{{2}{}}
\citation{lantz2010network}
\newlabel{eq3}{{3}{}}
\newlabel{eq4}{{4}{}}
\@writefile{toc}{\contentsline {subsection}{\numberline {\unhbox \voidb@x \hbox {IV-D}}Encoder Rate Control}{}}
\@writefile{lof}{\contentsline {figure}{\numberline {2}{\ignorespaces Topology\relax }}{}}
\newlabel{topology}{{2}{}}
\@writefile{toc}{\contentsline {section}{\numberline {V}Implementation}{}}
\@writefile{toc}{\contentsline {section}{\numberline {VI}Experimental Setup}{}}
\citation{45646}
\citation{hayes2011revisiting}
\citation{shewmaker2016tcp}
\citation{katabi2002internet}
\citation{dukkipati2007rate}
\citation{dukkipati2007rate}
\@writefile{lof}{\contentsline {figure}{\numberline {3}{\ignorespaces Comparison among NC-TCP, XCP and TCP Inigo in an interactive VDN\relax }}{}}
\newlabel{im-cubuc}{{3}{}}
\@writefile{toc}{\contentsline {section}{\numberline {VII}Evaluation}{}}
\newlabel{flows-cdg}{{4a}{}}
\newlabel{sub@flows-cdg}{{a}{}}
\newlabel{flows-im}{{4b}{}}
\newlabel{sub@flows-im}{{b}{}}
\@writefile{lof}{\contentsline {figure}{\numberline {4}{\ignorespaces NC-TCP and TCP Inigo self-fairness comparison\relax }}{}}
\newlabel{fairness}{{4}{}}
\@writefile{lof}{\contentsline {figure}{\numberline {5}{\ignorespaces Parking lot topology with multiple bottleneck links\relax }}{}}
\newlabel{parkinglot}{{5}{}}
\@writefile{lof}{\contentsline {figure}{\numberline {6}{\ignorespaces Evaluating RTT fairness for three flows with different RTTs in interactive VDN\relax }}{}}
\newlabel{rtt-fairness}{{6}{}}
\bibstyle{IEEEtran}
\bibdata{bibtemplate_samples}
\bibcite{grieco2004performance}{1}
\bibcite{brakmo1995tcp}{2}
\bibcite{rossi2010ledbat}{3}
\bibcite{carofiglio2010quest}{4}
\bibcite{hayes2011revisiting}{5}
\bibcite{shewmaker2016tcp}{6}
\bibcite{lundin2012google}{7}
\bibcite{de2013experimental}{8}
\bibcite{bosshart2013forwarding}{9}
\bibcite{katabi2002internet}{10}
\bibcite{sharma17evaluating}{11}
\bibcite{mcquistin2016tcp}{12}
\bibcite{honda2011still}{13}
\bibcite{dukkipati2007rate}{14}
\bibcite{lantz2010network}{15}
\bibcite{45646}{16}
\@writefile{lof}{\contentsline {figure}{\numberline {7}{\ignorespaces Comparison among NC-TCP, XCP and TCP Inigo in an interactive VDN with multiple bottleneck links\relax }}{}}
\newlabel{parkinglotres}{{7}{}}
\@writefile{lot}{\contentsline {table}{\numberline {I}{\ignorespaces Number of visual interruptions\relax }}{}}
\newlabel{visual}{{I}{}}
\@writefile{toc}{\contentsline {section}{\numberline {VIII}Conclusions}{}}
\@writefile{toc}{\contentsline {section}{References}{}}
