%!PS-Adobe-2.0 EPSF-2.0
%%Title: one.fig
%%Creator: fig2dev Version 3.2 Patchlevel 4
%%CreationDate: Tue Dec 12 02:40:15 2006
%%For: tclouser@bones (Thomas Clouser)
%%BoundingBox: 0 0 220 106
%%Magnification: 1.0000
%%EndComments
/$F2psDict 200 dict def
$F2psDict begin
$F2psDict /mtrx matrix put
/col-1 {0 setgray} bind def
/col0 {0.000 0.000 0.000 srgb} bind def
/col1 {0.000 0.000 1.000 srgb} bind def
/col2 {0.000 1.000 0.000 srgb} bind def
/col3 {0.000 1.000 1.000 srgb} bind def
/col4 {1.000 0.000 0.000 srgb} bind def
/col5 {1.000 0.000 1.000 srgb} bind def
/col6 {1.000 1.000 0.000 srgb} bind def
/col7 {1.000 1.000 1.000 srgb} bind def
/col8 {0.000 0.000 0.560 srgb} bind def
/col9 {0.000 0.000 0.690 srgb} bind def
/col10 {0.000 0.000 0.820 srgb} bind def
/col11 {0.530 0.810 1.000 srgb} bind def
/col12 {0.000 0.560 0.000 srgb} bind def
/col13 {0.000 0.690 0.000 srgb} bind def
/col14 {0.000 0.820 0.000 srgb} bind def
/col15 {0.000 0.560 0.560 srgb} bind def
/col16 {0.000 0.690 0.690 srgb} bind def
/col17 {0.000 0.820 0.820 srgb} bind def
/col18 {0.560 0.000 0.000 srgb} bind def
/col19 {0.690 0.000 0.000 srgb} bind def
/col20 {0.820 0.000 0.000 srgb} bind def
/col21 {0.560 0.000 0.560 srgb} bind def
/col22 {0.690 0.000 0.690 srgb} bind def
/col23 {0.820 0.000 0.820 srgb} bind def
/col24 {0.500 0.190 0.000 srgb} bind def
/col25 {0.630 0.250 0.000 srgb} bind def
/col26 {0.750 0.380 0.000 srgb} bind def
/col27 {1.000 0.500 0.500 srgb} bind def
/col28 {1.000 0.630 0.630 srgb} bind def
/col29 {1.000 0.750 0.750 srgb} bind def
/col30 {1.000 0.880 0.880 srgb} bind def
/col31 {1.000 0.840 0.000 srgb} bind def
/col32 {0.773 0.711 0.578 srgb} bind def
/col33 {0.934 0.965 0.996 srgb} bind def
/col34 {0.867 0.793 0.645 srgb} bind def
/col35 {0.258 0.254 0.258 srgb} bind def
/col36 {0.516 0.508 0.516 srgb} bind def
/col37 {0.738 0.742 0.738 srgb} bind def
/col38 {0.867 0.871 0.867 srgb} bind def
/col39 {0.547 0.555 0.547 srgb} bind def
/col40 {0.676 0.664 0.676 srgb} bind def
/col41 {0.320 0.332 0.320 srgb} bind def
/col42 {0.258 0.254 0.258 srgb} bind def
/col43 {0.516 0.508 0.516 srgb} bind def
/col44 {0.738 0.742 0.738 srgb} bind def
/col45 {0.516 0.508 0.516 srgb} bind def
/col46 {0.738 0.742 0.738 srgb} bind def
/col47 {0.867 0.871 0.867 srgb} bind def
/col48 {0.547 0.555 0.547 srgb} bind def
/col49 {0.547 0.555 0.547 srgb} bind def
/col50 {0.258 0.254 0.258 srgb} bind def
/col51 {0.516 0.508 0.516 srgb} bind def
/col52 {0.738 0.742 0.738 srgb} bind def
/col53 {0.867 0.871 0.867 srgb} bind def
/col54 {0.258 0.254 0.258 srgb} bind def
/col55 {0.516 0.508 0.516 srgb} bind def
/col56 {0.738 0.742 0.738 srgb} bind def
/col57 {0.867 0.871 0.867 srgb} bind def
/col58 {0.516 0.508 0.516 srgb} bind def
/col59 {0.738 0.742 0.738 srgb} bind def
/col60 {0.867 0.871 0.867 srgb} bind def
/col61 {0.773 0.711 0.578 srgb} bind def
/col62 {0.934 0.965 0.996 srgb} bind def
/col63 {0.867 0.793 0.645 srgb} bind def
/col64 {0.773 0.711 0.578 srgb} bind def
/col65 {0.934 0.965 0.996 srgb} bind def
/col66 {0.867 0.793 0.645 srgb} bind def
/col67 {0.676 0.664 0.676 srgb} bind def
/col68 {0.320 0.332 0.320 srgb} bind def
/col69 {0.547 0.555 0.547 srgb} bind def
/col70 {0.836 0.840 0.836 srgb} bind def
/col71 {0.547 0.555 0.547 srgb} bind def
/col72 {0.258 0.254 0.258 srgb} bind def
/col73 {0.516 0.508 0.516 srgb} bind def
/col74 {0.738 0.742 0.738 srgb} bind def
/col75 {0.867 0.871 0.867 srgb} bind def
/col76 {0.676 0.680 0.676 srgb} bind def
/col77 {0.258 0.254 0.258 srgb} bind def
/col78 {0.516 0.508 0.516 srgb} bind def
/col79 {0.738 0.742 0.738 srgb} bind def
/col80 {0.867 0.871 0.867 srgb} bind def
/col81 {0.516 0.508 0.516 srgb} bind def
/col82 {0.738 0.742 0.738 srgb} bind def
/col83 {0.867 0.871 0.867 srgb} bind def
/col84 {0.258 0.254 0.258 srgb} bind def
/col85 {0.516 0.508 0.516 srgb} bind def
/col86 {0.738 0.742 0.738 srgb} bind def
/col87 {0.676 0.680 0.676 srgb} bind def
/col88 {0.547 0.555 0.547 srgb} bind def
/col89 {0.547 0.555 0.547 srgb} bind def
/col90 {0.547 0.555 0.547 srgb} bind def
/col91 {0.258 0.254 0.258 srgb} bind def
/col92 {0.738 0.742 0.738 srgb} bind def
/col93 {0.867 0.871 0.867 srgb} bind def
/col94 {0.258 0.254 0.258 srgb} bind def
/col95 {0.516 0.508 0.516 srgb} bind def
/col96 {0.738 0.742 0.738 srgb} bind def
/col97 {0.547 0.555 0.547 srgb} bind def
/col98 {0.258 0.254 0.258 srgb} bind def
/col99 {0.516 0.508 0.516 srgb} bind def
/col100 {0.738 0.742 0.738 srgb} bind def
/col101 {0.867 0.871 0.867 srgb} bind def
/col102 {0.258 0.254 0.258 srgb} bind def
/col103 {0.516 0.508 0.516 srgb} bind def
/col104 {0.738 0.742 0.738 srgb} bind def
/col105 {0.867 0.871 0.867 srgb} bind def
/col106 {0.738 0.742 0.738 srgb} bind def
/col107 {0.320 0.316 0.320 srgb} bind def
/col108 {0.902 0.887 0.902 srgb} bind def
/col109 {0.000 0.000 0.289 srgb} bind def
/col110 {0.320 0.316 0.320 srgb} bind def
/col111 {0.738 0.742 0.738 srgb} bind def
/col112 {0.480 0.473 0.480 srgb} bind def
/col113 {0.191 0.203 0.191 srgb} bind def
/col114 {0.320 0.316 0.320 srgb} bind def
/col115 {0.738 0.742 0.738 srgb} bind def
/col116 {0.480 0.473 0.480 srgb} bind def
/col117 {0.191 0.203 0.191 srgb} bind def
/col118 {0.320 0.316 0.320 srgb} bind def
/col119 {0.258 0.254 0.258 srgb} bind def
/col120 {0.773 0.711 0.578 srgb} bind def
/col121 {0.738 0.742 0.738 srgb} bind def
/col122 {0.480 0.473 0.480 srgb} bind def
/col123 {0.191 0.203 0.191 srgb} bind def
/col124 {0.320 0.316 0.320 srgb} bind def
/col125 {0.191 0.203 0.191 srgb} bind def
/col126 {0.320 0.316 0.320 srgb} bind def
/col127 {0.547 0.555 0.547 srgb} bind def
/col128 {0.258 0.270 0.258 srgb} bind def
/col129 {0.547 0.555 0.547 srgb} bind def
/col130 {0.738 0.742 0.738 srgb} bind def
/col131 {0.480 0.473 0.480 srgb} bind def
/col132 {0.191 0.203 0.191 srgb} bind def
/col133 {0.320 0.316 0.320 srgb} bind def
/col134 {0.738 0.742 0.738 srgb} bind def
/col135 {0.480 0.473 0.480 srgb} bind def
/col136 {0.191 0.203 0.191 srgb} bind def
/col137 {0.320 0.316 0.320 srgb} bind def
/col138 {0.480 0.473 0.480 srgb} bind def
/col139 {0.191 0.203 0.191 srgb} bind def
/col140 {0.320 0.316 0.320 srgb} bind def
/col141 {0.258 0.254 0.258 srgb} bind def
/col142 {0.516 0.508 0.516 srgb} bind def
/col143 {0.738 0.742 0.738 srgb} bind def
/col144 {0.867 0.871 0.867 srgb} bind def
/col145 {0.258 0.270 0.258 srgb} bind def
/col146 {0.738 0.742 0.738 srgb} bind def
/col147 {0.738 0.742 0.738 srgb} bind def
/col148 {0.738 0.742 0.738 srgb} bind def
/col149 {0.738 0.742 0.738 srgb} bind def
/col150 {0.609 0.000 0.000 srgb} bind def
/col151 {0.547 0.539 0.547 srgb} bind def
/col152 {0.258 0.254 0.258 srgb} bind def
/col153 {0.547 0.539 0.547 srgb} bind def
/col154 {0.258 0.254 0.258 srgb} bind def
/col155 {0.547 0.539 0.547 srgb} bind def
/col156 {0.258 0.254 0.258 srgb} bind def
/col157 {0.547 0.539 0.547 srgb} bind def
/col158 {0.258 0.254 0.258 srgb} bind def
/col159 {0.547 0.539 0.547 srgb} bind def
/col160 {0.258 0.254 0.258 srgb} bind def
/col161 {0.547 0.539 0.547 srgb} bind def
/col162 {0.258 0.254 0.258 srgb} bind def
/col163 {0.547 0.539 0.547 srgb} bind def
/col164 {0.258 0.254 0.258 srgb} bind def
/col165 {0.547 0.539 0.547 srgb} bind def
/col166 {0.258 0.254 0.258 srgb} bind def
/col167 {0.547 0.539 0.547 srgb} bind def
/col168 {0.258 0.254 0.258 srgb} bind def
/col169 {0.547 0.539 0.547 srgb} bind def
/col170 {0.258 0.254 0.258 srgb} bind def
/col171 {0.547 0.539 0.547 srgb} bind def
/col172 {0.258 0.254 0.258 srgb} bind def
/col173 {0.547 0.539 0.547 srgb} bind def
/col174 {0.258 0.254 0.258 srgb} bind def
/col175 {0.547 0.539 0.547 srgb} bind def
/col176 {0.258 0.254 0.258 srgb} bind def
/col177 {0.547 0.539 0.547 srgb} bind def
/col178 {0.258 0.254 0.258 srgb} bind def
/col179 {0.547 0.539 0.547 srgb} bind def
/col180 {0.258 0.254 0.258 srgb} bind def
/col181 {0.547 0.539 0.547 srgb} bind def
/col182 {0.258 0.254 0.258 srgb} bind def
/col183 {0.547 0.539 0.547 srgb} bind def
/col184 {0.258 0.254 0.258 srgb} bind def
/col185 {0.547 0.539 0.547 srgb} bind def
/col186 {0.258 0.254 0.258 srgb} bind def
/col187 {0.387 0.379 0.387 srgb} bind def
/col188 {0.805 0.793 0.805 srgb} bind def
/col189 {0.418 0.426 0.418 srgb} bind def
/col190 {0.805 0.793 0.805 srgb} bind def
/col191 {0.418 0.426 0.418 srgb} bind def
/col192 {0.547 0.555 0.547 srgb} bind def

end
save
newpath 0 106 moveto 0 0 lineto 220 0 lineto 220 106 lineto closepath clip newpath
-45.4 188.8 translate
1 -1 scale

/cp {closepath} bind def
/ef {eofill} bind def
/gr {grestore} bind def
/gs {gsave} bind def
/sa {save} bind def
/rs {restore} bind def
/l {lineto} bind def
/m {moveto} bind def
/rm {rmoveto} bind def
/n {newpath} bind def
/s {stroke} bind def
/sh {show} bind def
/slc {setlinecap} bind def
/slj {setlinejoin} bind def
/slw {setlinewidth} bind def
/srgb {setrgbcolor} bind def
/rot {rotate} bind def
/sc {scale} bind def
/sd {setdash} bind def
/ff {findfont} bind def
/sf {setfont} bind def
/scf {scalefont} bind def
/sw {stringwidth} bind def
/tr {translate} bind def
/tnt {dup dup currentrgbcolor
  4 -2 roll dup 1 exch sub 3 -1 roll mul add
  4 -2 roll dup 1 exch sub 3 -1 roll mul add
  4 -2 roll dup 1 exch sub 3 -1 roll mul add srgb}
  bind def
/shd {dup dup currentrgbcolor 4 -2 roll mul 4 -2 roll mul
  4 -2 roll mul srgb} bind def
 /DrawEllipse {
	/endangle exch def
	/startangle exch def
	/yrad exch def
	/xrad exch def
	/y exch def
	/x exch def
	/savematrix mtrx currentmatrix def
	x y tr xrad yrad sc 0 0 1 startangle endangle arc
	closepath
	savematrix setmatrix
	} def

/$F2psBegin {$F2psDict begin /$F2psEnteredState save def} def
/$F2psEnd {$F2psEnteredState restore end} def

$F2psBegin
10 setmiterlimit
0 slj 0 slc
 0.06299 0.06299 sc
%
% Fig objects follow
%
% 
% here starts figure with depth 51
% Ellipse
7.500 slw
n 782 2162 28 28 0 360 DrawEllipse gs 0.00 setgray ef gr gs col0 s gr

% Ellipse
n 1457 2162 28 28 0 360 DrawEllipse gs 0.00 setgray ef gr gs col0 s gr

% Ellipse
n 2132 2162 28 28 0 360 DrawEllipse gs 0.00 setgray ef gr gs col0 s gr

% Ellipse
n 2807 2160 28 28 0 360 DrawEllipse gs 0.00 setgray ef gr gs col0 s gr

% Ellipse
n 3482 2160 28 28 0 360 DrawEllipse gs 0.00 setgray ef gr gs col0 s gr

% Ellipse
n 4157 2160 28 28 0 360 DrawEllipse gs 0.00 setgray ef gr gs col0 s gr

% Ellipse
n 2160 2160 827 827 0 360 DrawEllipse gs col0 s gr

% Ellipse
 [15 45] 45 sd
1 slc
n 2835 2160 830 830 0 360 DrawEllipse gs col0 s gr
 [] 0 sd
% Polyline
0 slc
gs  clippath
2760 2190 m 2760 2130 l 2609 2130 l 2729 2160 l 2609 2190 l cp
eoclip
n 2160 2160 m
 2745 2160 l gs col0 s gr gr

% arrowhead
n 2609 2190 m 2729 2160 l 2609 2130 l 2609 2190 l  cp gs 0.00 setgray ef gr  col0 s
% Polyline
n 810 2160 m
 1440 2160 l gs col0 s gr 
% Polyline
n 1485 2160 m
 2115 2160 l gs col0 s gr 
% Polyline
n 2835 2160 m
 3465 2160 l gs col0 s gr 
% Polyline
n 3510 2160 m
 4140 2160 l gs col0 s gr 
% Polyline
2 slj
 [60 24 15 18 15 18 15 24 ] 0 sd
gs  clippath
735 2099 m 770 2148 l 893 2061 l 778 2106 l 858 2012 l cp
eoclip
n 1485 2160 m 1483 2159 l 1480 2157 l 1474 2154 l 1464 2149 l 1452 2142 l
 1436 2134 l 1418 2125 l 1397 2115 l 1375 2105 l 1352 2095 l
 1327 2084 l 1302 2074 l 1275 2065 l 1247 2056 l 1217 2047 l
 1185 2040 l 1151 2033 l 1116 2028 l 1080 2025 l 1041 2024 l
 1005 2025 l 972 2028 l 943 2033 l 917 2039 l 894 2046 l
 873 2054 l 853 2063 l 835 2071 l 819 2080 l 804 2089 l
 792 2097 l 782 2103 l
 765 2115 l gs col0 s gr gr
 [] 0 sd
% arrowhead
0 slj
n 858 2012 m 778 2106 l 893 2061 l 858 2012 l  cp gs 0.00 setgray ef gr  col0 s
% Polyline
2 slj
 [60 24 15 18 15 18 15 24 ] 0 sd
gs  clippath
3480 2098 m 3514 2148 l 3639 2064 l 3523 2106 l 3606 2014 l cp
eoclip
n 4185 2160 m 4183 2159 l 4179 2156 l 4172 2152 l 4162 2145 l 4148 2137 l
 4131 2127 l 4112 2117 l 4091 2105 l 4068 2094 l 4044 2082 l
 4019 2071 l 3992 2061 l 3963 2051 l 3932 2042 l 3898 2035 l
 3862 2029 l 3825 2025 l 3788 2024 l 3754 2025 l 3722 2028 l
 3694 2033 l 3668 2039 l 3645 2046 l 3623 2054 l 3603 2063 l
 3585 2071 l 3567 2080 l 3552 2089 l 3539 2097 l 3528 2103 l

 3510 2115 l gs col0 s gr gr
 [] 0 sd
% arrowhead
0 slj
n 3606 2014 m 3523 2106 l 3639 2064 l 3606 2014 l  cp gs 0.00 setgray ef gr  col0 s
/Times-Roman ff 180.00 scf sf
720 2340 m
gs 1 -1 sc (A) col0 sh gr
/Times-Roman ff 180.00 scf sf
1395 2340 m
gs 1 -1 sc (B) col0 sh gr
/Times-Roman ff 180.00 scf sf
2070 2340 m
gs 1 -1 sc (C) col0 sh gr
/Times-Roman ff 180.00 scf sf
2745 2340 m
gs 1 -1 sc (D) col0 sh gr
/Times-Roman ff 180.00 scf sf
3420 2340 m
gs 1 -1 sc (E) col0 sh gr
/Times-Roman ff 180.00 scf sf
4095 2340 m
gs 1 -1 sc (F) col0 sh gr
% here ends figure;
$F2psEnd
rs
showpage
