\relax 
\citation{Sandvine:2015:SandvineWeb}
\citation{PPStream:2014:PPStream}
\citation{SopCast:2014:SopCast}
\citation{PPLive:2014:PPLive}
\citation{HTTPLiveAdv:2011:HTTPLiveAdvWeb}
\citation{HTTPLiveAdv:2011:HTTPLiveAdvWeb1}
\citation{HLS:stanford}
\citation{MPEG-4:MPEG}
\citation{GENI:2014:GENIWebpage}
\@writefile{toc}{\contentsline {section}{\numberline {I}Introduction}{}}
\citation{Libswift:2014:Libswift}
\citation{GENI:2014:GENIWebpage}
\citation{RSpec:2014:RSpec}
\@writefile{toc}{\contentsline {section}{\numberline {II}VIDEO SEGMENTATION}{}}
\@writefile{toc}{\contentsline {subsection}{\numberline {\unhbox \voidb@x \hbox {II-A}}GOP Based Segmentation}{}}
\@writefile{toc}{\contentsline {subsection}{\numberline {\unhbox \voidb@x \hbox {II-B}}Duration Based Segmentation}{}}
\@writefile{toc}{\contentsline {section}{\numberline {III}DOWNLOADING POLICY}{}}
\newlabel{eq1}{{1}{}}
\@writefile{toc}{\contentsline {section}{\numberline {IV}Segment Size}{}}
\@writefile{toc}{\contentsline {section}{\numberline {V}EXPERIMENTAL SETUP}{}}
\citation{Xuggler:2014:XugglerWebpage}
\citation{FFmpeg:2014:FFmpegWebpage}
\citation{VLCJ:2014:VLCJWebpage}
\citation{LibVLC:2014:LibVLCWebpage}
\citation{P2PTV:UserBehaviour}
\@writefile{lof}{\contentsline {figure}{\numberline {1}{\ignorespaces RSpec snippet of a link\relax }}{}}
\providecommand*\caption@xref[2]{\@setref\relax\@undefined{#1}}
\newlabel{Rspec}{{1}{}}
\@writefile{toc}{\contentsline {section}{\numberline {VI}EXPERIMENTAL RESULTS}{}}
\@writefile{toc}{\contentsline {subsection}{\numberline {\unhbox \voidb@x \hbox {VI-A}}Comparison between Splicing Techniques}{}}
\@writefile{toc}{\contentsline {subsection}{\numberline {\unhbox \voidb@x \hbox {VI-B}}Effect of Downloading Policy}{}}
\citation{BitTorrent:2014:BitTorrent}
\citation{libswift:performance}
\citation{PPSPP:2012:PPSPP}
\citation{HLS:stanford}
\citation{LayerP2P:2009:LayerP2P}
\citation{PPLive:2014:PPLive}
\citation{VSM:VSM}
\citation{PPLive:Study}
\citation{GENICinema:2014:GENICinemaWeb}
\citation{RINA:2014:RINAWebpage}
\@writefile{lof}{\contentsline {figure}{\numberline {2}{\ignorespaces Total number of stalls for different bandwidths\relax }}{}}
\newlabel{stalls_bandwidth}{{2}{}}
\@writefile{lof}{\contentsline {figure}{\numberline {3}{\ignorespaces Total stall duration for different bandwidths\relax }}{}}
\newlabel{stallduration_bandwidth}{{3}{}}
\@writefile{lof}{\contentsline {figure}{\numberline {4}{\ignorespaces Startup time for different bandwidths\relax }}{}}
\newlabel{startuptime_bandwidth}{{4}{}}
\@writefile{lof}{\contentsline {figure}{\numberline {5}{\ignorespaces Total number of stalls for different pool sizes\relax }}{}}
\newlabel{threadpool_stalls}{{5}{}}
\@writefile{toc}{\contentsline {section}{\numberline {VII}RELATED WORKS}{}}
\@writefile{toc}{\contentsline {section}{\numberline {VIII}Conclusion and Future Work}{}}
\bibstyle{IEEEtran}
\bibdata{bibtemplate_samples}
\bibcite{Sandvine:2015:SandvineWeb}{1}
\bibcite{PPStream:2014:PPStream}{2}
\bibcite{SopCast:2014:SopCast}{3}
\bibcite{PPLive:2014:PPLive}{4}
\bibcite{HTTPLiveAdv:2011:HTTPLiveAdvWeb}{5}
\bibcite{HTTPLiveAdv:2011:HTTPLiveAdvWeb1}{6}
\bibcite{HLS:stanford}{7}
\bibcite{MPEG-4:MPEG}{8}
\bibcite{GENI:2014:GENIWebpage}{9}
\bibcite{Libswift:2014:Libswift}{10}
\bibcite{RSpec:2014:RSpec}{11}
\bibcite{Xuggler:2014:XugglerWebpage}{12}
\bibcite{FFmpeg:2014:FFmpegWebpage}{13}
\bibcite{VLCJ:2014:VLCJWebpage}{14}
\bibcite{LibVLC:2014:LibVLCWebpage}{15}
\bibcite{P2PTV:UserBehaviour}{16}
\bibcite{BitTorrent:2014:BitTorrent}{17}
\bibcite{libswift:performance}{18}
\bibcite{PPSPP:2012:PPSPP}{19}
\bibcite{LayerP2P:2009:LayerP2P}{20}
\bibcite{VSM:VSM}{21}
\bibcite{PPLive:Study}{22}
\bibcite{GENICinema:2014:GENICinemaWeb}{23}
\bibcite{RINA:2014:RINAWebpage}{24}
\@writefile{toc}{\contentsline {section}{References}{}}
