{
  "label": "Example Screen for Team: A",
  "environments": [
    "build",
    "ci",
    "development",
    "preprod",
    "prod"
  ],
  "serverNames": [
    "server_name_1",
    "server_name_2",
    "server_name_3",
    "server_name_4"
  ],
  "liimaServers": [
    "server_name_1",
    "server_name_2",
    "server_name_3",
    "server_name_4"
  ],
  "teamCityBuilds": [
    {
      "configId": "ConfigId_1",
      "label": "rc",
      "buildNumberIsVersion": true,
      "serverName": "server_name_1",
      "applicationName": "application_name_1",
      "environment": "build"
    },
    {
      "configId": "ConfigId_1_sys",
      "label": "sys",
      "serverName": "server_name_1",
      "applicationName": "application_name_1",
      "environment": "build"
    },
    {
      "configId": "ConfigId_2",
      "label": "rc",
      "serverName": "server_name_2",
      "applicationName": "application_name_2",
      "environment": "build"
    },
    {
      "configId": "ConfigId_3",
      "label": "rc",
      "serverName": "server_name_3",
      "applicationName": "application_name_3",
      "environment": "build"
    },
    {
      "configId": "ConfigId_4",
      "label": "rc",
      "serverName": "server_name_4",
      "applicationName": "application_name_4",
      "environment": "build"
    }
  ],
  "sonarProjects": [
    {
      "projectKey": "project_key_4",
      "serverName": "server_name_4",
      "applicationName": "application_name_4",
      "environment": "build"
    }
  ],
  "restServices": [
    {
      "swaggerUri": "https://${env}.host.domain/path/swagger.json",
      "serverName": "server_name_4",
      "applicationName": "application_name_4"
    }
  ]
}
