<?xml version="1.0" encoding="UTF-8" standalone="no"?>
<svg width="18px" height="28px" viewBox="0 0 18 28" version="1.1" xmlns="http://www.w3.org/2000/svg" xmlns:xlink="http://www.w3.org/1999/xlink">
    <!-- Generator: Sketch 3.8.3 (29802) - http://www.bohemiancoding.com/sketch -->
    <title>Group</title>
    <desc>Created with Sketch.</desc>
    <defs></defs>
    <g id="Page-1" stroke="none" stroke-width="1" fill="none" fill-rule="evenodd">
        <g id="Карточка-товаров+выбор-любого-товара-(категория-товаров)" transform="translate(-591.000000, -20.000000)" stroke-width="2" stroke="#59D9A0">
            <g id="menu">
                <g id="Group-2" transform="translate(565.000000, 20.000000)">
                    <g id="1466381793_Icon_Element_Water_02" transform="translate(26.075560, 0.560074)">
                        <g id="Calque_1">
                            <g id="Group" transform="translate(1.000000, 2.000000)">
                                <path d="M15.7841488,16.6868382 C15.7841488,20.76109 12.3545779,24.0644669 8.12266791,24.0644669 C3.89075793,24.0644669 0.461187034,20.7619591 0.461187034,16.6868382" id="Shape"></path>
                                <path d="M0.66515625,12.9350155 C1.87904384,8.32280257 8.12266791,0.019602605 8.12266791,0.019602605 C8.12266791,0.019602605 14.2877729,8.21764377 15.5567141,12.8472383" id="Shape"></path>
                            </g>
                        </g>
                    </g>
                </g>
            </g>
        </g>
    </g>
</svg>