<?xml version="1.0" standalone="no"?>
<!DOCTYPE svg PUBLIC "-//W3C//DTD SVG 1.1//EN" "http://www.w3.org/Graphics/SVG/1.1/DTD/svg11.dtd">
<svg xmlns="http://www.w3.org/2000/svg">
<metadata>Copyright (C) 2016 by original authors @ fontello.com</metadata>
<defs>
<font id="fontello" horiz-adv-x="1000" >
<font-face font-family="fontello" font-weight="400" font-stretch="normal" units-per-em="1000" ascent="850" descent="-150" />
<missing-glyph horiz-adv-x="1000" />
<glyph glyph-name="beer" unicode="&#xf0fc;" d="M357 350v214h-143v-143q0-29 21-50t51-21h71z m572-250v-107h-643v107l71 107h-71q-89 0-152 63t-63 151v179l-35 36 18 71h267l18 72h536l18-108-36-17v-447z" horiz-adv-x="928.6" />

<glyph glyph-name="won" unicode="&#xf159;" d="M287 183l45 167h-89l42-167q1-1 1-2t0-2q0 1 1 2t0 2z m65 238l19 72h-163l18-72h126z m107 0h77l-19 72h-39z m250-238l44 167h-91l46-167q0 0 0-2t1-2q0 1 0 2t0 2z m62 238l19 72h-166l19-72h128z m229-17v-36q0-8-5-13t-13-5h-119l-91-344q-4-13-17-13h-89q-14 0-18 13l-92 344h-117l-93-344q-4-13-17-13h-89q-6 0-11 4t-6 9l-89 344h-116q-8 0-13 5t-5 13v36q0 7 5 12t13 5h98l-19 72h-79q-8 0-13 5t-5 13v35q0 8 5 13t13 5h61l-50 192q-3 9 3 16 5 7 14 7h77q14 0 17-14l50-201h201l54 201q4 14 17 14h70q14 0 18-14l54-201h204l52 201q3 14 17 14h77q9 0 14-7 6-7 3-16l-51-192h62q8 0 13-5t5-13v-35q0-8-5-13t-13-5h-81l-19-72h100q8 0 13-5t5-12z" horiz-adv-x="1000" />

<glyph glyph-name="viacoin" unicode="&#xf237;" d="M857 850l-107-250h107v-107h-153l-30-72h183v-107h-229l-199-464-200 464h-229v107h184l-31 72h-153v107h107l-107 250h143l180-429h211l180 429h143z m-428-679l60 143h-121z" horiz-adv-x="857.1" />
</font>
</defs>
</svg>