$ mcs 581b.cs -r:System.Numerics.dll
$ mono 581b.exe  # 17-smooth
10:52: 1 1 
10:52: 2 3 
...
10:52: 16 136 
10:52: 17 153 
10:52: 20 173 
10:52: 21 194 
10:52: 24 218 
10:52: 25 243 
...
10:52: 194480 532064 
10:52: 336140 868204 
11:33: 10000000000 868204 *
...
(108 numbers)


$ mono 581b.exe  # 47-smooth
119,094,299 4,479,825,823 16GB Memory

