mov     byte ptr [esp+2Fh], 66h
mov     byte ptr [esp+2Eh], 6Ch
mov     byte ptr [esp+2Dh], 61h
mov     byte ptr [esp+2Ch], 67h
mov     byte ptr [esp+2Bh], 7Bh
mov     byte ptr [esp+2Ah], 52h
mov     byte ptr [esp+29h], 65h
mov     byte ptr [esp+28h], 5Fh
mov     byte ptr [esp+27h], 31h
mov     byte ptr [esp+26h], 73h
mov     byte ptr [esp+25h], 5Fh
mov     byte ptr [esp+24h], 53h
mov     byte ptr [esp+23h], 30h
mov     byte ptr [esp+22h], 5Fh
mov     byte ptr [esp+21h], 43h
mov     byte ptr [esp+20h], 30h
mov     byte ptr [esp+1Fh], 4Fh
mov     byte ptr [esp+1Eh], 4Ch
mov     byte ptr [esp+1Dh], 7Dh
