27adddbaada886da93fb6c78ec5759086bf4fb5b7d08693b9130bc4c08d423a6 0 insmod
f3f646b0432139a13cabfa747b9495eff450562e473bf57e04fd4c128c072ab5 0 iptables
d5d3520993355530d66db7664bebdf47276219bc7a2f58cba74bea62b3f51dd8 0 iwevent
c5653b61dcab53102aab820857dc99d4cfcdbe5ea5b2ae5c1acfca3e84edfd58 0 reboot
