你的老板刚刚得到了一卷磁带，但与一般的磁带不同的是，在这圈磁带上有一些字符'o'和下划线'_'。由于你学过计算机和信息加解密，自然而然，解码磁带的这项任务就落到了你肩上。为了帮助你解码，下面会先给出一个解码样例： 解码样例： 
o____o_ 
oo__o_o 
oo_o__o 
oo_o_o_ 
oo_o__o 
oo_ooo_ 
oo__ooo 
_o_ooo_ 
上面的磁带片段解码为：Beijing. 
----------------------------------------------------------------------------------------------------------------- 

o_o_ooo 
oo_o___ 
oo__o_o 
ooo__o_ 
oo__o_o 
_o_____ 
ooo_o__ 
oo_o___ 
oo__o_o 
ooo__o_ 
oo__o_o 
_o_____ 
oo_o__o 
ooo__oo 
_o_____ 
oo____o 
_o_____ 
ooo_ooo 
oo_o__o 
oo_oo__ 
oo_oo__ 
_o_oo__ 
ooo_o__ 
oo_o___ 
oo__o_o 
ooo__o_ 
oo__o_o 
_o_____ 
oo_o__o 
ooo__oo 
_o_____ 
oo____o 
_o_____ 
ooo_ooo 
oo____o 
oooo__o 
_o_ooo_ 
那么，现在该你解码了...... 

key格式：simCTF{}