ERR605617.fastq.gz
ERR605618.fastq.gz
ERR605619.fastq.gz
ERR605620.fastq.gz
ERR605621.fastq.gz
ERR605622.fastq.gz
ERR605623.fastq.gz
ERR605624.fastq.gz
ERR605625.fastq.gz
ERR605626.fastq.gz
ERR605627.fastq.gz
ERR605628.fastq.gz
ERR605629.fastq.gz
ERR605630.fastq.gz
ERR605631.fastq.gz
ERR605632.fastq.gz
ERR605633.fastq.gz
ERR605634.fastq.gz
ERR605635.fastq.gz
ERR605636.fastq.gz
ERR605637.fastq.gz
ERR605638.fastq.gz
ERR605639.fastq.gz
ERR605640.fastq.gz
ERR605641.fastq.gz
ERR605642.fastq.gz
ERR605643.fastq.gz
ERR605644.fastq.gz
ERR605645.fastq.gz
ERR605646.fastq.gz
ERR605647.fastq.gz
ERR605648.fastq.gz
ERR605649.fastq.gz
ERR605650.fastq.gz
ERR605651.fastq.gz
ERR605652.fastq.gz
ERR605653.fastq.gz
ERR605654.fastq.gz
ERR605655.fastq.gz
ERR605656.fastq.gz
ERR605657.fastq.gz
ERR605658.fastq.gz
ERR605659.fastq.gz
ERR605660.fastq.gz
ERR605661.fastq.gz
ERR605662.fastq.gz
ERR605663.fastq.gz
ERR605664.fastq.gz
