acacia,acacia,acacia,acacia,acacia,acacia,acacia,brachypodium,brachypodium,brachypodium,brachypodium,brachypodium,brachypodium,brachypodium,brachypodium,brachypodium,brachypodium,brachypodium,brachypodium,brachypodium,brachypodium,brachypodium,brachypodium,brachypodium,brachypodium,eucalypts,eucalypts,virus,virus,virus,virus,virus
A1,A2,A3,A4,A5,A6,A7,10a,10b,11,13,14,15,17,18,19,20,21,22,23,24,2,3,4,5,152,_006,BBT_Haw,BBT_Nig,BBT_Viet,CFD_1990,CFD_2013
,,,,,,,,,,,,,,,,,,,,,,,,,,,,,,,
35114228823,26490313774,27556629597,24919676263,25281766157,24763344557,27870717328,22212483666,22059792024,23317329642,23302075682,23022611711,22691782685,23138108229,23353545436,23281796042,23377438931,23385034637,23208055290,23323617753,23408594593,22259056970,22308867091,22413962181,22034401590,23259133728,23681587714,23144715246,23313530797,23157477026,22882549652,24003058830
26490313774,34994013140,31903728467,24521614230,23954095650,23937597641,32187330004,20719863112,20551142016,21736464280,21725530747,21502871736,21164558020,21628031612,21756533919,21676670677,21786415547,21788065331,21622583455,21737954999,21825394761,20744885851,20789873700,20892629029,20537243522,21836348694,22159312966,21670791623,21612746024,21644311463,21907090189,23771895690
27556629597,31903728467,38195991663,26042535472,25286690336,25221027969,36921418315,22440968821,22272919880,23532344657,23517670028,23258802407,22937841884,23391895993,23552098093,23495016895,23583256140,23587908185,23429196683,23549589277,23636868788,22467273029,22505564388,22619959915,22261968331,23414905385,23791070405,23479174235,23456488962,23411330968,23260110883,24463111595
24919676263,24521614230,26042535472,29734930094,24462544770,24797689653,26380443551,22172327367,22026624086,23285870683,23268789011,22969348062,22646007904,23087359327,23320034262,23250338100,23345300229,23352892142,23174150631,23294359177,23367185603,22223468000,22276556530,22376652720,22003172059,23279056529,23739246478,24252722902,23567622723,23174748436,23001098812,24321563710
25281766157,23954095650,25286690336,24462544770,28919497828,24591215806,25700825329,22596041365,22457244017,23725583839,23707928076,23403036525,23083194810,23509288639,23770696711,23708551324,23791578497,23797591637,23622708302,23738562559,23812163224,22650883063,22699659980,22803908108,22423727653,23569505742,24031075438,23860119147,23874096438,23644278724,23257929565,24360227287
24763344557,23937597641,25221027969,24797689653,24591215806,25997832974,25586443824,22494646446,22302278212,23549795062,23504679980,23327299121,22981926182,23422567273,23551362552,23521549561,23598699229,23591936878,23427747942,23586141729,23655436365,22484561783,22517445399,22634521905,22293017718,23594367548,23977721192,23689451134,23616150319,23713595063,23108296056,24468021750
27870717328,32187330004,36921418315,26380443551,25700825329,25586443824,37531192714,22771074852,22610233667,23903244200,23891309203,23605814543,23269810661,23749403749,23927439744,23849107857,23953226547,23957429096,23794093798,23900255762,23988123227,22813946224,22858557130,22973113251,22581351112,23755405992,24149310061,23800195193,23730266658,23737646759,24150016526,25450263611
22212483666,20719863112,22440968821,22172327367,22596041365,22494646446,22771074852,23263392371,22875887247,24386758592,24313907839,24040705125,23563757624,24080158313,24557362937,24192723500,24417664871,24482987808,24244510134,23918506299,23925002816,23296518801,23449843027,23384065295,22468885061,22297720474,22697695212,23385652551,22764073910,22590308074,22245679315,22614429802
22059792024,20551142016,22272919880,22026624086,22457244017,22302278212,22610233667,22875887247,22888061393,24213055728,24157370429,23732971106,23370542828,23824309631,24406176255,24026891603,24214340182,24320652433,24110996699,23765703818,23782325990,23110762671,23279909477,23208057367,22334370547,22109651246,22533965219,22801042932,22726593533,22456513537,22191389530,22537403258
23317329642,21736464280,23532344657,23285870683,23725583839,23549795062,23903244200,24386758592,24213055728,26184195367,25954528021,25422120036,24875971209,25600331992,26234751547,25636473289,26001744855,26146351916,25832270681,25325736268,25383807343,24763590624,25002766766,24874517307,23723236412,23380369621,23798893136,24022607611,23817780067,23984550041,23272791546,23660870610
23302075682,21725530747,23517670028,23268789011,23707928076,23504679980,23891309203,24313907839,24157370429,25954528021,26181288082,25370629363,24803361668,25585092830,26226928886,25608824580,26038724746,26156537868,25809687286,25320097942,25436448833,24756372070,24994094862,24893135628,23718996433,23364295245,23767799805,23922148283,23720309496,23673477599,23929946184,24480144431
23022611711,21502871736,23258802407,22969348062,23403036525,23327299121,23605814543,24040705125,23732971106,25422120036,25370629363,25494431444,24446168973,25263539214,25630623404,25150165007,25564987901,25586255034,25181645302,24928752939,24942429166,24295361881,24440964749,24401715114,23314519869,23155145282,23512062433,23513646839,23376724820,23298081825,23653937469,23541128623
22691782685,21164558020,22937841884,22646007904,23083194810,22981926182,23269810661,23563757624,23370542828,24875971209,24803361668,24446168973,24479453162,24537230902,25106595343,24760992496,24886878578,25108972442,24793961445,24482657186,24517364234,23822955940,23973009949,23873208318,23058033555,22787513630,23183164433,23287866015,23073790127,22987141609,22689556925,23123917028
23138108229,21628031612,23391895993,23087359327,23509288639,23422567273,23749403749,24080158313,23824309631,25600331992,25585092830,25263539214,24537230902,25676251473,25768661157,25225900842,25682749834,25828041650,25365116441,25169979560,25233227467,24411225252,24604330544,24544329238,23559961213,23287373740,23617579156,23619201939,23471012831,23381851521,22982393633,23419791623
23353545436,21756533919,23552098093,23320034262,23770696711,23551362552,23927439744,24557362937,24406176255,26234751547,26226928886,25630623404,25106595343,25768661157,26822186533,25917891287,26300428536,26505511290,26106631072,25554588107,25635600582,25053112752,25361693900,25134551735,23929614580,23401626543,23824815541,23927955022,23775860532,23759958496,23417740617,23725965232
23281796042,21676670677,23495016895,23250338100,23708551324,23521549561,23849107857,24192723500,24026891603,25636473289,25608824580,25150165007,24760992496,25225900842,25917891287,25669732915,25716706377,25822976327,25535763045,25174667223,25205950490,24524519998,24699323045,24612465432,23647913191,23322510359,23771964480,25170671794,24102827882,23811652124,23437451945,23794551772
23377438931,21786415547,23583256140,23345300229,23791578497,23598699229,23953226547,24417664871,24214340182,26001744855,26038724746,25564987901,24886878578,25682749834,26300428536,25716706377,26348835419,26223386493,25820432060,25411147663,25501146800,24858816153,25067264458,24991083904,23783411872,23436006573,23851556604,24269378369,24362368634,23813902847,23449573189,23777458767
23385034637,21788065331,23587908185,23352892142,23797591637,23591936878,23957429096,24482987808,24320652433,26146351916,26156537868,25586255034,25108972442,25828041650,26505511290,25822976327,26223386493,27168078344,26011568707,25611788985,25771419604,24990742225,25249858974,25063987408,24031027824,23445306538,23856436928,24133368405,23905481568,24184077436,23374292907,23766911267
23208055290,21622583455,23429196683,23174150631,23622708302,23427747942,23794093798,24244510134,24110996699,25832270681,25809687286,25181645302,24793961445,25365116441,26106631072,25535763045,25820432060,26011568707,25929457693,25180993360,25252673554,24621986950,24870453365,24723357716,23632256636,23268459404,23693255876,23807516604,23606656396,23593022043,23742281411,24274265617
23323617753,21737954999,23549589277,23294359177,23738562559,23586141729,23900255762,23918506299,23765703818,25325736268,25320097942,24928752939,24482657186,25169979560,25554588107,25174667223,25411147663,25611788985,25180993360,33770438224,32402511688,24195540317,24360243279,24317614988,30701187525,23430428782,23869511966,24372634454,23909131675,23674350675,25139849092,24281258515
23408594593,21825394761,23636868788,23367185603,23812163224,23655436365,23988123227,23925002816,23782325990,25383807343,25436448833,24942429166,24517364234,25233227467,25635600582,25205950490,25501146800,25771419604,25252673554,32402511688,31894527131,24270848559,24442285415,24404820662,29883111077,23528939654,23926812749,24412215698,23980720571,23797882072,23381405751,23839899748
22259056970,20744885851,22467273029,22223468000,22650883063,22484561783,22813946224,23296518801,23110762671,24763590624,24756372070,24295361881,23822955940,24411225252,25053112752,24524519998,24858816153,24990742225,24621986950,24195540317,24270848559,23877149882,23899891624,23784277371,22701010043,22316045836,22714296084,22855263913,22685508114,22610023795,23232776845,22956802087
22308867091,20789873700,22505564388,22276556530,22699659980,22517445399,22858557130,23449843027,23279909477,25002766766,24994094862,24440964749,23973009949,24604330544,25361693900,24699323045,25067264458,25249858974,24870453365,24360243279,24442285415,23899891624,24336372808,23978142886,22833463064,22362838591,22761463566,22846548175,22706459016,22686749815,22296193982,22719889524
22413962181,20892629029,22619959915,22376652720,22803908108,22634521905,22973113251,23384065295,23208057367,24874517307,24893135628,24401715114,23873208318,24544329238,25134551735,24612465432,24991083904,25063987408,24723357716,24317614988,24404820662,23784277371,23978142886,24061339148,22798770642,22470199836,22867688161,22984752399,22819712377,22760149596,22460065015,22880966077
22034401590,20537243522,22261968331,22003172059,22423727653,22293017718,22581351112,22468885061,22334370547,23723236412,23718996433,23314519869,23058033555,23559961213,23929614580,23647913191,23783411872,24031027824,23632256636,30701187525,29883111077,22701010043,22833463064,22798770642,28511369428,22148747852,22556706947,22854216164,22521966452,22290464582,21961154379,22436535074
23259133728,21836348694,23414905385,23279056529,23569505742,23594367548,23755405992,22297720474,22109651246,23380369621,23364295245,23155145282,22787513630,23287373740,23401626543,23322510359,23436006573,23445306538,23268459404,23430428782,23528939654,22316045836,22362838591,22470199836,22148747852,25576099818,25162768751,23358233265,23383104276,23511799555,23053557732,23844507144
23681587714,22159312966,23791070405,23739246478,24031075438,23977721192,24149310061,22697695212,22533965219,23798893136,23767799805,23512062433,23183164433,23617579156,23824815541,23771964480,23851556604,23856436928,23693255876,23869511966,23926812749,22714296084,22761463566,22867688161,22556706947,25162768751,32558668117,23828867978,23916703205,24127348116,23899684357,24772324895
23144715246,21670791623,23479174235,24252722902,23860119147,23689451134,23800195193,23385652551,22801042932,24022607611,23922148283,23513646839,23287866015,23619201939,23927955022,25170671794,24269378369,24133368405,23807516604,24372634454,24412215698,22855263913,22846548175,22984752399,22854216164,23358233265,23828867978,2950026200525,831545940856,225381711766,25041050872,22736031816
23313530797,21612746024,23456488962,23567622723,23874096438,23616150319,23730266658,22764073910,22726593533,23817780067,23720309496,23376724820,23073790127,23471012831,23775860532,24102827882,24362368634,23905481568,23606656396,23909131675,23980720571,22685508114,22706459016,22819712377,22521966452,23383104276,23916703205,831545940856,1518213712127,175708735443,22586851243,26694966002
23157477026,21644311463,23411330968,23174748436,23644278724,23713595063,23737646759,22590308074,22456513537,23984550041,23673477599,23298081825,22987141609,23381851521,23759958496,23811652124,23813902847,24184077436,23593022043,23674350675,23797882072,22610023795,22686749815,22760149596,22290464582,23511799555,24127348116,225381711766,175708735443,764073855731,27693802905,25135774551
22882549652,21907090189,23260110883,23001098812,23257929565,23108296056,24150016526,22245679315,22191389530,23272791546,23929946184,23653937469,22689556925,22982393633,23417740617,23437451945,23449573189,23374292907,23742281411,25139849092,23381405751,23232776845,22296193982,22460065015,21961154379,23053557732,23899684357,25041050872,22586851243,27693802905,6986531139063,1859572522057
24003058830,23771895690,24463111595,24321563710,24360227287,24468021750,25450263611,22614429802,22537403258,23660870610,24480144431,23541128623,23123917028,23419791623,23725965232,23794551772,23777458767,23766911267,24274265617,24281258515,23839899748,22956802087,22719889524,22880966077,22436535074,23844507144,24772324895,22736031816,26694966002,25135774551,1859572522057,2550880517262
