genome/reads-aunt_00.fa.gz,genome/reads-aunt_01.fa.gz,genome/reads-aunt_02.fa.gz,genome/reads-aunt_03.fa.gz,genome/reads-aunt_04.fa.gz,genome/reads-aunt_05.fa.gz,genome/reads-aunt_06.fa.gz,genome/reads-aunt_07.fa.gz,genome/reads-aunt_08.fa.gz,genome/reads-aunt_09.fa.gz,genome/reads-brother_00.fa.gz,genome/reads-brother_01.fa.gz,genome/reads-brother_02.fa.gz,genome/reads-brother_03.fa.gz,genome/reads-brother_04.fa.gz,genome/reads-brother_05.fa.gz,genome/reads-brother_06.fa.gz,genome/reads-brother_07.fa.gz,genome/reads-brother_08.fa.gz,genome/reads-brother_09.fa.gz,genome/reads-brother_10.fa.gz,genome/reads-brother_11.fa.gz,genome/reads-brother_12.fa.gz,genome/reads-brother_13.fa.gz,genome/reads-brother_14.fa.gz,genome/reads-sister_00.fa.gz,genome/reads-sister_01.fa.gz,genome/reads-sister_02.fa.gz,genome/reads-sister_03.fa.gz,genome/reads-sister_04.fa.gz,genome/reads-sister_05.fa.gz,genome/reads-sister_06.fa.gz,genome/reads-sister_07.fa.gz,genome/reads-sister_08.fa.gz,genome/reads-sister_09.fa.gz,genome/reads-sister_10.fa.gz,genome/reads-sister_11.fa.gz,genome/reads-sister_12.fa.gz,genome/reads-sister_13.fa.gz,genome/reads-sister_14.fa.gz,genome/reads-sister_15.fa.gz,genome/reads-sister_16.fa.gz,genome/reads-sister_17.fa.gz,genome/reads-sister_18.fa.gz,genome/reads-sister_19.fa.gz
genome/reads-aunt_00.fa.gz,genome/reads-aunt_01.fa.gz,genome/reads-aunt_02.fa.gz,genome/reads-aunt_03.fa.gz,genome/reads-aunt_04.fa.gz,genome/reads-aunt_05.fa.gz,genome/reads-aunt_06.fa.gz,genome/reads-aunt_07.fa.gz,genome/reads-aunt_08.fa.gz,genome/reads-aunt_09.fa.gz,genome/reads-brother_00.fa.gz,genome/reads-brother_01.fa.gz,genome/reads-brother_02.fa.gz,genome/reads-brother_03.fa.gz,genome/reads-brother_04.fa.gz,genome/reads-brother_05.fa.gz,genome/reads-brother_06.fa.gz,genome/reads-brother_07.fa.gz,genome/reads-brother_08.fa.gz,genome/reads-brother_09.fa.gz,genome/reads-brother_10.fa.gz,genome/reads-brother_11.fa.gz,genome/reads-brother_12.fa.gz,genome/reads-brother_13.fa.gz,genome/reads-brother_14.fa.gz,genome/reads-sister_00.fa.gz,genome/reads-sister_01.fa.gz,genome/reads-sister_02.fa.gz,genome/reads-sister_03.fa.gz,genome/reads-sister_04.fa.gz,genome/reads-sister_05.fa.gz,genome/reads-sister_06.fa.gz,genome/reads-sister_07.fa.gz,genome/reads-sister_08.fa.gz,genome/reads-sister_09.fa.gz,genome/reads-sister_10.fa.gz,genome/reads-sister_11.fa.gz,genome/reads-sister_12.fa.gz,genome/reads-sister_13.fa.gz,genome/reads-sister_14.fa.gz,genome/reads-sister_15.fa.gz,genome/reads-sister_16.fa.gz,genome/reads-sister_17.fa.gz,genome/reads-sister_18.fa.gz,genome/reads-sister_19.fa.gz
,,,,,,,,,,,,,,,,,,,,,,,,,,,,,,,,,,,,,,,,,,,,
3205250,1760185,1761634,1773895,1785430,1762288,1762137,1773630,1743660,1755079,188230,189741,190234,193848,186654,186448,190096,187496,190830,193394,190403,190065,188696,192685,190454,195172,195747,195567,184409,193704,192471,194245,190371,188406,188707,193300,193328,195285,192613,186113,192616,193865,199082,190955,197844
1760185,3160954,1763949,1779292,1795536,1753368,1776034,1773022,1752665,1783562,189942,197977,194516,200566,193849,193160,193068,195731,192327,196775,194103,197344,191725,193033,195212,191957,187832,193771,186018,196652,191029,192478,186290,189026,191791,193962,192545,189178,191577,185407,190971,193300,191321,192041,193519
1761634,1763949,3171438,1787512,1783854,1790347,1779625,1774170,1749089,1762267,187516,194019,190702,197297,189466,192739,190677,189198,190565,193457,194305,194248,187326,191931,194115,196397,190232,185809,182398,195525,192127,189848,189067,188637,187194,192587,190193,189076,189388,183697,190139,190892,189180,186739,196118
1773895,1779292,1787512,3165374,1792954,1786488,1762133,1762205,1737387,1782432,191654,199050,197343,199141,193877,194816,194814,194851,195689,195353,194216,199508,192943,195408,199662,195791,191984,190947,187009,198717,193119,189852,187839,192735,194793,193036,193046,193564,192757,188504,191854,193690,195494,190543,198060
1785430,1795536,1783854,1792954,3196126,1805526,1801018,1791203,1771407,1801669,196399,203668,200996,205280,200770,202011,203961,201982,202174,208189,202549,207961,200257,202024,201147,192652,192822,195592,186557,198120,196237,188736,185003,193415,191354,193286,192039,194645,193985,186710,193154,192357,196483,189060,196870
1762288,1753368,1790347,1786488,1805526,3181040,1746884,1764887,1752767,1772182,193225,196346,196339,198867,188087,193911,199493,195276,193466,196457,196833,201121,191108,193071,197445,195241,193845,193377,183965,196824,194781,194250,188109,189192,193793,195186,190017,194220,194686,188717,189857,191159,196715,193773,198948
1762137,1776034,1779625,1762133,1801018,1746884,3189140,1776010,1738543,1743505,189412,199981,199267,200420,193301,194003,190061,195132,192623,195484,194641,202596,191389,192748,196182,188741,186949,190431,180562,190422,188837,189082,185130,186508,192645,187941,188562,188179,185838,181770,185273,183326,189480,188630,189670
1773630,1773022,1774170,1762205,1791203,1764887,1776010,3191910,1758637,1757796,190753,200057,198089,198999,193637,197888,193430,191565,200959,196429,193915,202767,191793,195818,194736,186961,190464,188304,183131,193136,187680,186636,181981,182482,188186,190227,190166,192425,188853,183586,186325,188073,191175,185306,191944
1743660,1752665,1749089,1737387,1771407,1752767,1738543,1758637,3204870,1728901,188339,194878,199904,198751,190424,193797,194352,196228,193524,193571,194056,200953,190109,193058,197708,188051,190177,187740,183300,190976,189176,189208,185551,188301,188879,189283,182849,189184,187679,182305,188766,192213,190021,187901,195269
1755079,1783562,1762267,1782432,1801669,1772182,1743505,1757796,1728901,3201950,190253,197896,197773,197231,189493,194336,194879,192268,190843,197711,192138,198777,185656,193083,195210,187645,189327,186489,184339,193176,191831,190059,186504,185715,184479,188041,185195,184491,186872,185020,189155,189393,186735,186514,193293
188230,189942,187516,191654,196399,193225,189412,190753,188339,190253,3170392,1765084,1778425,1766705,1752098,1769801,1749886,1765557,1789622,1795551,1765609,1777270,1749174,1750036,1772103,384215,383227,383843,367829,393332,392546,383425,389057,373364,373492,380326,385401,380966,386929,382601,392266,387950,364370,381431,377510
189741,197977,194019,199050,203668,196346,199981,200057,194878,197896,1765084,3204532,1764594,1779999,1750669,1780489,1773558,1773518,1781844,1798767,1767906,1780128,1750899,1749369,1769674,393388,377417,382204,361718,385443,383850,377135,384444,372376,375777,379424,385027,372400,377100,380757,384553,378490,361920,374034,382303
190234,194516,190702,197343,200996,196339,199267,198089,199904,197773,1778425,1764594,3187904,1783274,1757898,1777655,1777634,1775121,1799403,1813227,1795967,1775038,1763749,1777851,1786426,399320,387943,393559,374700,394852,396427,390069,392912,382004,380944,392024,400112,384247,390473,394095,392498,390085,372550,389586,389373
193848,200566,197297,199141,205280,198867,200420,198999,198751,197231,1766705,1779999,1783274,3202212,1756167,1793510,1782475,1754192,1777468,1787103,1779706,1783655,1758457,1756597,1769392,395322,393565,381034,374533,385456,395330,380648,393563,367975,377910,387123,387187,384755,390980,383470,395526,395259,368560,389536,383049
186654,193849,189466,193877,200770,188087,193301,193637,190424,189493,1752098,1750669,1757898,1756167,3181162,1758297,1721456,1741520,1768554,1780837,1741582,1751556,1725279,1748781,1713703,392770,382100,383028,365601,389604,386522,381201,388952,374062,372498,378380,391515,374876,378746,377093,381263,384475,358899,377734,381084
186448,193160,192739,194816,202011,193911,194003,197888,193797,194336,1769801,1780489,1777655,1793510,1758297,3201752,1778161,1765179,1791309,1807961,1788662,1769064,1763035,1750276,1763727,401944,398826,394429,383359,406440,394814,396648,393600,384662,375332,390225,398815,394644,389660,395699,405799,399492,375756,396232,394094
190096,193068,190677,194814,203961,199493,190061,193430,194352,194879,1749886,1773558,1777634,1782475,1721456,1778161,3193080,1746699,1770750,1787827,1762096,1762115,1740706,1759292,1752599,390671,381672,382415,365102,383648,381520,376051,380090,370831,362934,381207,388162,367640,378142,381280,385302,380331,358483,375159,379452
187496,195731,189198,194851,201982,195276,195132,191565,196228,192268,1765557,1773518,1775121,1754192,1741520,1765179,1746699,3183536,1776792,1800231,1766272,1763964,1758817,1740633,1767648,382308,376710,380067,365278,383291,389133,376004,379967,363191,365966,378161,384928,373425,375450,374461,381982,382674,360356,378132,372722
190830,192327,190565,195689,202174,193466,192623,200959,193524,190843,1789622,1781844,1799403,1777468,1768554,1791309,1770750,1776792,3193154,1788510,1787692,1801098,1774038,1769598,1761102,382178,376318,376976,363305,381913,388809,377942,379294,376209,369294,382405,379868,375169,383402,375308,384713,384029,360151,375552,371162
193394,196775,193457,195353,208189,196457,195484,196429,193571,197711,1795551,1798767,1813227,1787103,1780837,1807961,1787827,1800231,1788510,3178362,1793576,1802995,1759120,1787029,1788539,399581,394592,395283,385126,401502,400709,393630,395764,383860,382891,395367,405053,392428,393460,394685,407029,396843,375496,393951,399385
190403,194103,194305,194216,202549,196833,194641,193915,194056,192138,1765609,1767906,1795967,1779706,1741582,1788662,1762096,1766272,1787692,1793576,3182768,1755546,1768247,1764980,1755570,385954,374041,380580,375284,384580,386978,381981,383445,377479,368012,381932,388508,378053,380702,379593,389475,387038,364853,384593,376005
190065,197344,194248,199508,207961,201121,202596,202767,200953,198777,1777270,1780128,1775038,1783655,1751556,1769064,1762115,1763964,1801098,1802995,1755546,3173170,1767210,1759574,1768792,392330,380698,385547,368568,391233,390566,378923,382211,371144,367158,387930,390693,371232,382440,378920,392504,388203,366885,381372,380914
188696,191725,187326,192943,200257,191108,191389,191793,190109,185656,1749174,1750899,1763749,1758457,1725279,1763035,1740706,1758817,1774038,1759120,1768247,1767210,3165516,1761739,1758007,385506,380189,378754,371388,392129,391183,377145,383651,370861,373808,378558,387308,376036,382163,381004,388712,385377,364385,381023,377108
192685,193033,191931,195408,202024,193071,192748,195818,193058,193083,1750036,1749369,1777851,1756597,1748781,1750276,1759292,1740633,1769598,1787029,1764980,1759574,1761739,3193544,1744021,389314,384036,386446,373533,389634,389407,383215,387399,377195,377413,383938,392916,380303,377058,384251,391450,388302,362215,380012,388248
190454,195212,194115,199662,201147,197445,196182,194736,197708,195210,1772103,1769674,1786426,1769392,1713703,1763727,1752599,1767648,1761102,1788539,1755570,1768792,1758007,1744021,3209894,378855,379125,379458,361844,377061,380873,374410,376361,371223,367275,376074,380151,378329,380699,372058,385437,385557,357973,377665,377867
195172,191957,196397,195791,192652,195241,188741,186961,188051,187645,384215,393388,399320,395322,392770,401944,390671,382308,382178,399581,385954,392330,385506,389314,378855,3197460,1760208,1784013,1754239,1777671,1804146,1762966,1782381,1740017,1780677,1780868,1769833,1776895,1756455,1770596,1786792,1784287,1767370,1759544,1778713
195747,187832,190232,191984,192822,193845,186949,190464,190177,189327,383227,377417,387943,393565,382100,398826,381672,376710,376318,394592,374041,380698,380189,384036,379125,1760208,3175336,1774412,1756012,1764688,1766382,1771169,1785295,1745582,1772986,1747417,1777972,1756052,1772221,1765115,1779303,1767773,1737840,1764708,1751917
195567,193771,185809,190947,195592,193377,190431,188304,187740,186489,383843,382204,393559,381034,383028,394429,382415,380067,376976,395283,380580,385547,378754,386446,379458,1784013,1774412,3222906,1771055,1780279,1827968,1801843,1800348,1771598,1795130,1803037,1805999,1777888,1808930,1788371,1820116,1792855,1803963,1815009,1788493
184409,186018,182398,187009,186557,183965,180562,183131,183300,184339,367829,361718,374700,374533,365601,383359,365102,365278,363305,385126,375284,368568,371388,373533,361844,1754239,1756012,1771055,3170600,1762176,1779978,1753763,1781725,1747509,1733595,1783373,1780109,1757914,1752808,1750328,1783278,1769799,1755750,1768666,1744958
193704,196652,195525,198717,198120,196824,190422,193136,190976,193176,393332,385443,394852,385456,389604,406440,383648,383291,381913,401502,384580,391233,392129,389634,377061,1777671,1764688,1780279,1762176,3227766,1820408,1787724,1801656,1781217,1771838,1797438,1792219,1776945,1796273,1789964,1822407,1816435,1769670,1782033,1795228
192471,191029,192127,193119,196237,194781,188837,187680,189176,191831,392546,383850,396427,395330,386522,394814,381520,389133,388809,400709,386978,390566,391183,389407,380873,1804146,1766382,1827968,1779978,1820408,3205070,1805493,1815775,1775320,1792322,1817889,1819219,1806712,1811142,1774637,1828517,1831291,1819112,1792366,1822980
194245,192478,189848,189852,188736,194250,189082,186636,189208,190059,383425,377135,390069,380648,381201,396648,376051,376004,377942,393630,381981,378923,377145,383215,374410,1762966,1771169,1801843,1753763,1787724,1805493,3188424,1787664,1743840,1764735,1764835,1772489,1751107,1773080,1765845,1780311,1800782,1785163,1793541,1771981
190371,186290,189067,187839,185003,188109,185130,181981,185551,186504,389057,384444,392912,393563,388952,393600,380090,379967,379294,395764,383445,382211,383651,387399,376361,1782381,1785295,1800348,1781725,1801656,1815775,1787664,3200026,1787018,1793705,1792263,1793234,1774162,1795832,1781209,1797845,1801215,1784455,1793128,1779162
188406,189026,188637,192735,193415,189192,186508,182482,188301,185715,373364,372376,382004,367975,374062,384662,370831,363191,376209,383860,377479,371144,370861,377195,371223,1740017,1745582,1771598,1747509,1781217,1775320,1743840,1787018,3192780,1750979,1774892,1735495,1753697,1745563,1774901,1759232,1770159,1746129,1760196,1763179
188707,191791,187194,194793,191354,193793,192645,188186,188879,184479,373492,375777,380944,377910,372498,375332,362934,365966,369294,382891,368012,367158,373808,377413,367275,1780677,1772986,1795130,1733595,1771838,1792322,1764735,1793705,1750979,3209694,1776143,1784621,1777388,1783776,1781009,1773814,1776212,1761569,1783360,1772093
193300,193962,192587,193036,193286,195186,187941,190227,189283,188041,380326,379424,392024,387123,378380,390225,381207,378161,382405,395367,381932,387930,378558,383938,376074,1780868,1747417,1803037,1783373,1797438,1817889,1764835,1792263,1774892,1776143,3151148,1800468,1756257,1786998,1762572,1795338,1815699,1766511,1813577,1771971
193328,192545,190193,193046,192039,190017,188562,190166,182849,185195,385401,385027,400112,387187,391515,398815,388162,384928,379868,405053,388508,390693,387308,392916,380151,1769833,1777972,1805999,1780109,1792219,1819219,1772489,1793234,1735495,1784621,1800468,3219168,1784044,1790648,1773008,1762793,1801075,1758680,1785343,1772389
195285,189178,189076,193564,194645,194220,188179,192425,189184,184491,380966,372400,384247,384755,374876,394644,367640,373425,375169,392428,378053,371232,376036,380303,378329,1776895,1756052,1777888,1757914,1776945,1806712,1751107,1774162,1753697,1777388,1756257,1784044,3215226,1782952,1761260,1761142,1783967,1750215,1766335,1768212
192613,191577,189388,192757,193985,194686,185838,188853,187679,186872,386929,377100,390473,390980,378746,389660,378142,375450,383402,393460,380702,382440,382163,377058,380699,1756455,1772221,1808930,1752808,1796273,1811142,1773080,1795832,1745563,1783776,1786998,1790648,1782952,3176756,1749228,1801807,1796948,1770711,1770568,1762711
186113,185407,183697,188504,186710,188717,181770,183586,182305,185020,382601,380757,394095,383470,377093,395699,381280,374461,375308,394685,379593,378920,381004,384251,372058,1770596,1765115,1788371,1750328,1789964,1774637,1765845,1781209,1774901,1781009,1762572,1773008,1761260,1749228,3165172,1785035,1774899,1759331,1752815,1782358
192616,190971,190139,191854,193154,189857,185273,186325,188766,189155,392266,384553,392498,395526,381263,405799,385302,381982,384713,407029,389475,392504,388712,391450,385437,1786792,1779303,1820116,1783278,1822407,1828517,1780311,1797845,1759232,1773814,1795338,1762793,1761142,1801807,1785035,3191048,1788005,1778545,1798727,1802404
193865,193300,190892,193690,192357,191159,183326,188073,192213,189393,387950,378490,390085,395259,384475,399492,380331,382674,384029,396843,387038,388203,385377,388302,385557,1784287,1767773,1792855,1769799,1816435,1831291,1800782,1801215,1770159,1776212,1815699,1801075,1783967,1796948,1774899,1788005,3194612,1775819,1806792,1803628
199082,191321,189180,195494,196483,196715,189480,191175,190021,186735,364370,361920,372550,368560,358899,375756,358483,360356,360151,375496,364853,366885,364385,362215,357973,1767370,1737840,1803963,1755750,1769670,1819112,1785163,1784455,1746129,1761569,1766511,1758680,1750215,1770711,1759331,1778545,1775819,3183784,1759787,1771427
190955,192041,186739,190543,189060,193773,188630,185306,187901,186514,381431,374034,389586,389536,377734,396232,375159,378132,375552,393951,384593,381372,381023,380012,377665,1759544,1764708,1815009,1768666,1782033,1792366,1793541,1793128,1760196,1783360,1813577,1785343,1766335,1770568,1752815,1798727,1806792,1759787,3159764,1786760
197844,193519,196118,198060,196870,198948,189670,191944,195269,193293,377510,382303,389373,383049,381084,394094,379452,372722,371162,399385,376005,380914,377108,388248,377867,1778713,1751917,1788493,1744958,1795228,1822980,1771981,1779162,1763179,1772093,1771971,1772389,1768212,1762711,1782358,1802404,1803628,1771427,1786760,3188144
