data/gantc/A_hydrophila_0.004_00.kc
data/gantc/A_hydrophila_0.004_01.kc
data/gantc/A_hydrophila_0.004_02.kc
data/gantc/A_hydrophila_0.004_03.kc
data/gantc/A_hydrophila_0.004_04.kc
data/gantc/B_cereus_0.004_00.kc
data/gantc/B_cereus_0.004_01.kc
data/gantc/B_cereus_0.004_02.kc
data/gantc/B_cereus_0.004_03.kc
data/gantc/B_cereus_0.004_04.kc
data/gantc/B_fragilis_0.004_00.kc
data/gantc/B_fragilis_0.004_01.kc
data/gantc/B_fragilis_0.004_02.kc
data/gantc/B_fragilis_0.004_03.kc
data/gantc/B_fragilis_0.004_04.kc
data/gantc/M_abscessus_0.0087_00.kc
data/gantc/M_abscessus_0.0087_01.kc
data/gantc/M_abscessus_0.0087_02.kc
data/gantc/M_abscessus_0.0087_03.kc
data/gantc/M_abscessus_0.0087_04.kc
data/gantc/R_sphaeroides_0.00476_00.kc
data/gantc/R_sphaeroides_0.00476_01.kc
data/gantc/R_sphaeroides_0.00476_02.kc
data/gantc/R_sphaeroides_0.00476_03.kc
data/gantc/R_sphaeroides_0.00476_04.kc
data/gantc/S_aureus_0.004_00.kc
data/gantc/S_aureus_0.004_01.kc
data/gantc/S_aureus_0.004_02.kc
data/gantc/S_aureus_0.004_03.kc
data/gantc/S_aureus_0.004_04.kc
data/gantc/V_cholerae_0.00909_00.kc
data/gantc/V_cholerae_0.00909_01.kc
data/gantc/V_cholerae_0.00909_02.kc
data/gantc/V_cholerae_0.00909_03.kc
data/gantc/V_cholerae_0.00909_04.kc
data/gantc/X_axonopodis_0.004_00.kc
data/gantc/X_axonopodis_0.004_01.kc
data/gantc/X_axonopodis_0.004_02.kc
data/gantc/X_axonopodis_0.004_03.kc
data/gantc/X_axonopodis_0.004_04.kc