#CurrentTime InstructionCoverage BranchCoverage
0 0.0 0.0
50093 0.3879350533452322 0.24867945510147346
100101 0.4306112391278288 0.27912149013066445
150037 0.44379770102694566 0.2910758965804837
200003 0.45246879870000134 0.3002502085070892
250130 0.4605538313997629 0.30845148735056993
300006 0.46740013586051654 0.31526271893244373
350028 0.47099644365118476 0.3187378370864609
400005 0.4734739001292007 0.32290797887128164
450113 0.47860196864552396 0.32930219627467333
500095 0.48412962691636585 0.3347233805949402
550126 0.4858745021777642 0.33847650820127884
600249 0.49021671084353396 0.342507645259938
