#CurrentTime InstructionCoverage BranchCoverage
0 0.0 0.0
52765 0.7226867335562988 0.5489795918367347
103352 0.7271460423634337 0.5571428571428572
150006 0.7424749163879598 0.5755102040816327
200001 0.7477703455964325 0.5816326530612245
250006 0.7477703455964325 0.5816326530612245
304447 0.7477703455964325 0.5816326530612245
354083 0.7488851727982163 0.5836734693877551
400000 0.7488851727982163 0.5836734693877551
450278 0.7488851727982163 0.5836734693877551
500314 0.7488851727982163 0.5836734693877551
550296 0.7488851727982163 0.5836734693877551
600004 0.7488851727982163 0.583673469387755
