#CurrentTime InstructionCoverage BranchCoverage
0 0.0 0.0
50001 0.17008566473380868 0.14069917997410444
100002 0.17287108245887567 0.14609408718170047
150005 0.17437766059947796 0.14954682779456194
200003 0.17616453234763416 0.1529995684074234
250009 0.17840688120806544 0.15602071644367718
300001 0.1807017851199131 0.15861027190332327
350051 0.18073682182085735 0.15925766076823478
400012 0.18126237233502093 0.16055243849805784
450046 0.18126237233502093 0.16076823478636168
500004 0.1813324457369094 0.16119982736296937
550019 0.18136748243785364 0.1614156236512732
600024 0.18136748243785364 0.161415623651273
