#CurrentTime InstructionCoverage BranchCoverage
0 0.0 0.0
50028 0.15519781144781145 0.16632443531827515
100011 0.15993265993265993 0.18480492813141683
150040 0.15993265993265993 0.18480492813141683
204764 0.16603535353535354 0.20739219712525667
251226 0.16603535353535354 0.20739219712525667
302230 0.16687710437710437 0.21149897330595482
350017 0.16687710437710437 0.2135523613963039
400801 0.17140151515151514 0.2299794661190965
454354 0.17140151515151514 0.2299794661190965
503433 0.17140151515151514 0.2299794661190965
550041 0.17140151515151514 0.2299794661190965
602985 0.17140151515151514 0.229979466119096
