#CurrentTime InstructionCoverage BranchCoverage
0 0.0 0.0
65559 0.2735895259239911 0.1574468085106383
100041 0.30411714770797965 0.18127659574468086
162420 0.32715162596317093 0.20297872340425532
200006 0.34277458534674154 0.2178723404255319
250020 0.356405903095207 0.2347517730496454
318763 0.37031474467807235 0.24638297872340426
350004 0.3760937704061643 0.2523404255319149
400000 0.39563471333420397 0.2771631205673759
451876 0.4002383439989552 0.28184397163120567
537201 0.40657241739584693 0.2873758865248227
550065 0.40681729136737627 0.28808510638297874
608537 0.41223716860389187 0.2909219858156028
