#CurrentTime InstructionCoverage BranchCoverage
0 0.0 0.0
54904 0.5481160206017891 0.39790575916230364
100656 0.6188669015993494 0.4790575916230366
150012 0.6682027649769585 0.5209424083769634
239971 0.6961236107346165 0.5471204188481675
250166 0.6961236107346165 0.5471204188481675
300087 0.7064245052859853 0.5654450261780105
386595 0.7083220384928165 0.5732984293193717
400291 0.7083220384928165 0.5732984293193717
451471 0.7121171049064787 0.5732984293193717
513345 0.7121171049064787 0.5732984293193717
583034 0.7167253998373543 0.5759162303664922
600363 0.720791542423421 0.58115183246073
