#CurrentTime InstructionCoverage BranchCoverage
0 0.0 0.0
50005 0.6146352777455641 0.5238095238095238
100004 0.6186941899570915 0.5364145658263305
150003 0.6236808535312536 0.5392156862745098
200002 0.6254203873361939 0.5406162464985994
250029 0.6282036414240983 0.5448179271708683
300005 0.6333062739185898 0.5504201680672269
350019 0.6348138698828714 0.5532212885154062
400007 0.6348138698828714 0.5532212885154062
450002 0.6369013104487997 0.5574229691876751
500004 0.6369013104487997 0.5574229691876751
550026 0.6375971239707758 0.5574229691876751
600045 0.6402644091383509 0.570028011204481
