#CurrentTime InstructionCoverage BranchCoverage
0 0.0 0.0
55348 0.6875696767001115 0.48775510204081635
102423 0.6970457079152731 0.5061224489795918
150062 0.6995540691192865 0.5081632653061224
200909 0.7012263099219621 0.5142857142857142
255555 0.717948717948718 0.5408163265306123
305429 0.7190635451505016 0.5428571428571428
350010 0.7190635451505016 0.5428571428571428
400207 0.7212931995540691 0.5469387755102041
450004 0.7212931995540691 0.5489795918367347
500012 0.7212931995540691 0.5489795918367347
550104 0.7212931995540691 0.5510204081632653
600108 0.7212931995540691 0.551020408163265
