#CurrentTime InstructionCoverage BranchCoverage
0 0.0 0.0
50001 0.3037865748709122 0.171875
100594 0.33964429145152036 0.18359375
150021 0.3453815261044177 0.18359375
200221 0.3499713138267355 0.1953125
250472 0.357429718875502 0.20703125
300798 0.35972461273666095 0.21875
350300 0.361732644865175 0.22265625
402356 0.36316695352839934 0.2265625
452653 0.3689041881812966 0.23828125
500213 0.3709122203098107 0.2421875
550390 0.3783706253585772 0.2578125
600843 0.3803786574870912 0.26562
