#CurrentTime InstructionCoverage BranchCoverage
0 0.0 0.0
50018 0.24882494004796163 0.15824765310683953
100034 0.24992805755395683 0.16137684398748323
150194 0.2698800959232614 0.16897630755476084
200003 0.272757793764988 0.1698703620920876
250016 0.2747242206235012 0.17210549843540457
300001 0.27486810551558755 0.17210549843540457
350003 0.27486810551558755 0.17210549843540457
400036 0.2759232613908873 0.17523468931604827
450004 0.2759232613908873 0.17523468931604827
500002 0.2761630695443645 0.17523468931604827
550048 0.2766906474820144 0.17657577112203846
600004 0.2767865707434053 0.1770227983907018
