#CurrentTime InstructionCoverage BranchCoverage
0 0.0 0.0
50077 0.2548586058419644 0.21171171171171171
100014 0.26160828581403467 0.22372372372372373
150006 0.2633538927033632 0.22822822822822822
200003 0.2633538927033632 0.22822822822822822
250006 0.2633538927033632 0.22972972972972974
300042 0.2633538927033632 0.22972972972972974
350066 0.2633538927033632 0.22972972972972974
400083 0.2633538927033632 0.22972972972972974
450160 0.2709181892237868 0.23123123123123124
500152 0.2709181892237868 0.23123123123123124
550014 0.2709181892237868 0.23123123123123124
600040 0.27452577679506573 0.2417417417417417
