#CurrentTime InstructionCoverage BranchCoverage
0 0.0 0.0
50005 0.6558513101378 0.46856772521062867
100000 0.711434365369569 0.5234931950745302
150009 0.7310425215961167 0.5432598833441348
200002 0.7409743401408339 0.559300064808814
250000 0.7455570281188625 0.5651328580686974
300003 0.7524230763089402 0.5716137394685677
350721 0.7543391827805899 0.5743681140635126
400009 0.7568460887476648 0.5771224886584575
450018 0.7596883133472784 0.5839274141283215
500019 0.7609816852156418 0.5853856124432922
550025 0.7620355437750491 0.587653920933247
600122 0.7632171427658997 0.589274141283214
