#CurrentTime InstructionCoverage BranchCoverage
0 0.0 0.0
50140 0.31557665260196904 0.2109375
103223 0.3183895921237693 0.2140625
150025 0.32032348804500704 0.2203125
203914 0.3275316455696203 0.2359375
253112 0.3275316455696203 0.2359375
301737 0.3340365682137834 0.2421875
351760 0.3340365682137834 0.2421875
402135 0.3340365682137834 0.2421875
454275 0.3340365682137834 0.2421875
504078 0.3340365682137834 0.2421875
553752 0.3340365682137834 0.2421875
600023 0.3340365682137834 0.242187
