#CurrentTime InstructionCoverage BranchCoverage
0 0.0 0.0
50038 0.5185953368616794 0.3609845031905196
100002 0.5586468316406809 0.408994226678821
150105 0.581426119296238 0.4369492555454269
200004 0.5882563295665856 0.4472804618656943
250099 0.5955156629952797 0.45730780917654207
300666 0.6060291803747676 0.4679428745062291
350071 0.6089615219568016 0.4706776055910058
400095 0.610713774853383 0.4749316317228806
450868 0.6139321985409812 0.479489516864175
500433 0.6156129309111715 0.48283196596779093
550008 0.6161850951223001 0.48343968398663023
600075 0.6239450722357317 0.4904284412032816
