#CurrentTime InstructionCoverage BranchCoverage
0 0.0 0.0
52635 0.40851022012578614 0.2840806500150466
101628 0.4367138364779874 0.30093289196509176
151148 0.45867727987421386 0.3189888654829973
204801 0.46860259433962265 0.3259103219981944
250023 0.4840310534591195 0.337646704784833
300474 0.4917944182389937 0.3448690941919952
353950 0.500687893081761 0.350887752031297
400074 0.5054048742138365 0.3551008125188083
451696 0.5079599056603774 0.3587120072223894
500051 0.5103675314465409 0.36051760457418
550037 0.5132173742138365 0.3629250677099007
600067 0.514937106918239 0.3638278663857959
