#CurrentTime InstructionCoverage BranchCoverage
0 0.0 0.0
50023 0.24475319283162536 0.1796923624077532
100008 0.3040470653824429 0.2310838445807771
155136 0.30794228328724116 0.2355294745265404
203191 0.31053175959683393 0.23810793989508314
250036 0.331673036436059 0.2584689250466791
300044 0.3627981015397481 0.2867431315017338
350112 0.3795746803500561 0.30408108829021074
401907 0.38721840362086546 0.3134169111763137
450121 0.39051943574357584 0.31821819151773806
500078 0.39287417199110924 0.32248599626567087
552127 0.39576440900521564 0.3255979372277052
601143 0.3978403914290535 0.3285320529919089
