#CurrentTime InstructionCoverage BranchCoverage
0 0.0 0.0
50006 0.07930607187112763 0.09090909090909091
100003 0.07930607187112763 0.09090909090909091
150035 0.07930607187112763 0.09090909090909091
200030 0.07930607187112763 0.09090909090909091
250009 0.07930607187112763 0.09090909090909091
300012 0.07930607187112763 0.09090909090909091
350003 0.07930607187112763 0.09090909090909091
400010 0.07930607187112763 0.09090909090909091
450012 0.07930607187112763 0.09090909090909091
500019 0.07930607187112763 0.09090909090909091
550024 0.07930607187112763 0.09090909090909091
600007 0.07930607187112763 0.0909090909090909
