#CurrentTime InstructionCoverage BranchCoverage
0 0.0 0.0
50013 0.15519781144781145 0.16632443531827515
100016 0.15993265993265993 0.18480492813141683
150009 0.15993265993265993 0.18480492813141683
200008 0.21148989898989898 0.24229979466119098
250026 0.22264309764309764 0.26078028747433263
300075 0.22411616161616163 0.26283367556468173
350171 0.22506313131313133 0.2669404517453799
400004 0.22706228956228955 0.26899383983572894
451814 0.22937710437710437 0.27720739219712526
503652 0.23063973063973064 0.27720739219712526
550011 0.2345328282828283 0.2792607802874743
600015 0.2370580808080808 0.287474332648870
