#CurrentTime InstructionCoverage BranchCoverage
0 0.0 0.0
50002 0.0594888178913738 0.04505813953488372
100010 0.0594888178913738 0.04505813953488372
150012 0.0594888178913738 0.04505813953488372
200002 0.0594888178913738 0.04505813953488372
250019 0.0594888178913738 0.04505813953488372
300006 0.0594888178913738 0.04505813953488372
350044 0.0594888178913738 0.04505813953488372
400037 0.0594888178913738 0.04505813953488372
450017 0.0594888178913738 0.04505813953488372
500005 0.0594888178913738 0.04505813953488372
550001 0.0594888178913738 0.04505813953488372
600003 0.0594888178913738 0.0450581395348837
