#CurrentTime InstructionCoverage BranchCoverage
0 0.0 0.0
50004 0.290829136170666 0.1402688486265342
100021 0.3194205633074149 0.1638418079096045
150010 0.3272113087539372 0.172024157412819
200031 0.3586025350355301 0.2004675628287551
250032 0.37387969993456993 0.21332554061952075
300030 0.38141176828618817 0.2187804402883304
350018 0.3910436859964394 0.22481979349308398
400025 0.39889529664176265 0.2306643288525229
450000 0.4024406944719183 0.23495032144944478
500007 0.4069903680822897 0.2388466783557374
550005 0.41082487560674996 0.2415741281901422
600032 0.4140963800423013 0.244106760179232
