#CurrentTime InstructionCoverage BranchCoverage
0 0.0 0.0
53320 0.14804292929292928 0.15811088295687886
100034 0.1522516835016835 0.16837782340862423
150284 0.16098484848484848 0.1806981519507187
202480 0.16266835016835016 0.1868583162217659
250000 0.16435185185185186 0.19096509240246407
300046 0.16435185185185186 0.19096509240246407
353793 0.1656144781144781 0.1971252566735113
404164 0.1680345117845118 0.2053388090349076
453803 0.16835016835016836 0.2053388090349076
504312 0.16835016835016836 0.20944558521560575
550037 0.16835016835016836 0.20944558521560575
604933 0.16908670033670034 0.213552361396303
