#CurrentTime InstructionCoverage BranchCoverage
0 0.0 0.0
50371 0.131788834029624 0.16170212765957448
103121 0.131788834029624 0.16170212765957448
151482 0.131788834029624 0.16170212765957448
201171 0.131788834029624 0.16170212765957448
250268 0.131788834029624 0.16170212765957448
300449 0.131788834029624 0.16170212765957448
354021 0.131788834029624 0.16170212765957448
404937 0.131788834029624 0.16170212765957448
452473 0.131788834029624 0.16170212765957448
501647 0.131788834029624 0.16170212765957448
551419 0.131788834029624 0.16170212765957448
604561 0.131788834029624 0.1617021276595744
