#CurrentTime InstructionCoverage BranchCoverage
0 0.0 0.0
50012 0.3036260442185669 0.15273719072667055
100010 0.32191603645825406 0.1726086109487629
150004 0.32628311447222264 0.18040132476134815
200038 0.34192547056406825 0.19735047730372102
250009 0.3455165172933246 0.20319501266315995
300012 0.35000532570489507 0.2092343658679135
350149 0.35170955127132186 0.21215663354763295
400073 0.3550267046059739 0.21566335476329632
450071 0.3585416698367291 0.21780635106175725
500045 0.3606110865959616 0.2205338008961621
550058 0.3630304782482996 0.2230664328852523
600004 0.3647955690135273 0.225014611338398
