#CurrentTime InstructionCoverage BranchCoverage
0 0.0 0.0
50014 0.3973565251572327 0.2750526632560939
100009 0.43966194968553457 0.30243755642491726
150017 0.45965998427672955 0.3177851339151369
200184 0.4716489779874214 0.32560938910622933
250092 0.4797071540880503 0.3331327114053566
300044 0.483687106918239 0.3373457718928679
350042 0.4893867924528302 0.34155883238037915
400064 0.48992727987421386 0.3424616310562745
450003 0.4911065251572327 0.344267228408065
500000 0.499312106918239 0.3517905507071923
550016 0.4999508647798742 0.35299428227505264
600058 0.5010318396226415 0.3538970809509479
