#CurrentTime InstructionCoverage BranchCoverage
0 0.0 0.0
50002 0.09293680297397769 0.13636363636363635
100007 0.09293680297397769 0.13636363636363635
150051 0.09293680297397769 0.13636363636363635
200021 0.10780669144981413 0.13636363636363635
250000 0.10780669144981413 0.13636363636363635
300007 0.10780669144981413 0.13636363636363635
350011 0.10780669144981413 0.13636363636363635
400029 0.10780669144981413 0.13636363636363635
450004 0.10780669144981413 0.13636363636363635
500014 0.10780669144981413 0.13636363636363635
550000 0.10780669144981413 0.13636363636363635
600043 0.10780669144981413 0.1363636363636363
