#CurrentTime InstructionCoverage BranchCoverage
0 0.0 0.0
50583 0.27131931166347995 0.16277850589777196
108323 0.3038479923518164 0.18243774574049804
150638 0.3304732313575526 0.19973787680209698
200200 0.3475143403441683 0.20865006553079948
251034 0.3568116634799235 0.21467889908256882
300192 0.37774856596558315 0.2254259501965924
350050 0.3866395793499044 0.23224115334207077
400070 0.39500478011472273 0.236435124508519
450700 0.41068355640535376 0.24220183486238533
500916 0.41539196940726575 0.2456094364351245
550595 0.4296367112810707 0.2508519003931848
606525 0.43955544933078394 0.2550458715596330
