#CurrentTime InstructionCoverage BranchCoverage
0 0.0 0.0
50129 0.2508393285371703 0.16450603486812695
100002 0.25597122302158276 0.1743406347787215
150002 0.2564508393285372 0.17612874385337507
200014 0.26326139088729017 0.1819400983459991
250007 0.2762589928057554 0.186410371032633
300049 0.27654676258992805 0.18730442556995977
350006 0.2888729016786571 0.19713902548055431
400003 0.2983213429256595 0.20205632543585159
450062 0.2992326139088729 0.20339740724184174
500036 0.29952038369304557 0.20339740724184174
550000 0.29952038369304557 0.20339740724184174
600074 0.29952038369304557 0.2033974072418417
