#CurrentTime InstructionCoverage BranchCoverage
0 0.0 0.0
50029 0.42560801144492133 0.2831664580725907
100065 0.4618502622794468 0.3122653316645807
150121 0.4716261325703386 0.3232165206508135
200033 0.4781592751549833 0.33291614518147683
250005 0.4863614687649022 0.3423028785982478
300001 0.5016213638531235 0.3573216520650814
350004 0.5034811635670005 0.3598247809762203
400007 0.5053886504530282 0.36013767209011266
450007 0.5091559370529327 0.3642052565707134
500073 0.5160228898426323 0.36827284105131414
550009 0.5180257510729613 0.37015018773466835
600045 0.519933237958989 0.37327909887359
