#CurrentTime InstructionCoverage BranchCoverage
0 0.0 0.0
50000 0.06345047923322683 0.050387596899224806
100003 0.06408945686900959 0.05135658914728682
150010 0.06408945686900959 0.05135658914728682
200008 0.3035143769968051 0.12693798449612403
254284 0.31763578274760385 0.13517441860465115
300021 0.3192332268370607 0.1375968992248062
350008 0.3363578274760383 0.1560077519379845
400002 0.3447923322683706 0.16521317829457363
452106 0.3447923322683706 0.16521317829457363
500003 0.3447923322683706 0.16521317829457363
550000 0.3447923322683706 0.16521317829457363
600011 0.34773162939297125 0.1705426356589147
