#CurrentTime InstructionCoverage BranchCoverage
0 0.0 0.0
50045 0.488413674724646 0.3403220905499848
100031 0.5357960234587327 0.38255849285931326
150050 0.5588256329566585 0.40960194469766026
200000 0.566978972965241 0.4244910361592221
250039 0.5738091832355886 0.4317836523852932
300027 0.5812473179802603 0.4448495897903373
350023 0.5844657416678587 0.44849589790337285
400010 0.5902231440423401 0.4585232452142206
450462 0.5983407237877271 0.46611972044971134
500044 0.5985195251037048 0.4667274384685506
550001 0.601594907738521 0.4691583105439076
600155 0.6055642969532256 0.4715891826192646
