#CurrentTime InstructionCoverage BranchCoverage
0 0.0 0.0
50006 0.48221268478779206 0.32947434292866085
100000 0.5130185979971388 0.3660826032540676
150005 0.5255126371006199 0.3789111389236546
200005 0.5741535526943252 0.41051314142678347
250030 0.5847877920839294 0.422090112640801
300007 0.5883166428230806 0.4261576971214018
350008 0.5917978063900811 0.4286608260325407
400004 0.5926084883166428 0.4305381727158949
450001 0.5968049594659036 0.434918648310388
500001 0.6040057224606581 0.4399249061326658
553644 0.6054840247973295 0.44180225281602004
604224 0.6079637577491654 0.44524405506883
