#CurrentTime InstructionCoverage BranchCoverage
0 0.0 0.0
50003 0.31651425006466927 0.16481589713617767
100005 0.346307764877737 0.1965712059224625
150020 0.36794534305147675 0.2078706409507111
200009 0.3806813859005767 0.2160529904539256
250002 0.391591472785648 0.2244301578024547
300010 0.39807361645794975 0.23105396454315216
350003 0.4036732147476377 0.23397623222287162
400046 0.406625176889484 0.23533995714007402
450016 0.4205024422161019 0.24800311708552503
500020 0.42213058628402744 0.24956165984804207
550065 0.42334789026004654 0.25073056691992984
600000 0.42588901230998644 0.2530683810637054
