#CurrentTime InstructionCoverage BranchCoverage
0 0.0 0.0
50036 0.5173647148993246 0.3734607906675308
100016 0.5719098791256167 0.4146143875567077
150063 0.6190780334360579 0.4418340894361633
200013 0.647548182093985 0.46581335061568374
250021 0.6613920513516535 0.4755346727154893
300031 0.6756510770115126 0.4873622812702528
350290 0.6882494770626087 0.5004860661049902
400028 0.6948440768358695 0.5077770576798445
450010 0.7000015967553931 0.5129617627997408
500073 0.7042329985469525 0.5179844458846403
550109 0.7087997189710509 0.5228451069345431
600002 0.7129193478850975 0.528515878159429
