#CurrentTime InstructionCoverage BranchCoverage
0 0.0 0.0
50024 0.0594888178913738 0.04505813953488372
100027 0.0594888178913738 0.04505813953488372
150038 0.0594888178913738 0.04505813953488372
200000 0.2994888178913738 0.11385658914728682
250055 0.30869009584664536 0.12451550387596899
300014 0.3151437699680511 0.1298449612403101
350015 0.31757188498402555 0.13372093023255813
400034 0.31757188498402555 0.13372093023255813
450020 0.3180191693290735 0.13372093023255813
500049 0.3205111821086262 0.1375968992248062
550019 0.3226198083067093 0.14147286821705427
600011 0.3226198083067093 0.1414728682170542
