#CurrentTime InstructionCoverage BranchCoverage
0 0.0 0.0
50098 0.8119308298373069 0.4834558823529412
100004 0.8241072342167195 0.5128676470588235
150019 0.8283024659776936 0.5202205882352942
200035 0.8294280159623453 0.5220588235294118
250007 0.8297349841399775 0.5257352941176471
300022 0.8297349841399775 0.5257352941176471
350006 0.8297349841399775 0.5257352941176471
400068 0.8350557658856032 0.53125
450018 0.8350557658856032 0.53125
500021 0.8353627340632355 0.5330882352941176
550037 0.8373068658549063 0.5349264705882353
600009 0.8373068658549063 0.534926470588235
