#CurrentTime InstructionCoverage BranchCoverage
0 0.0 0.0
50028 0.3871309133241613 0.2502732240437158
100162 0.3966557307651603 0.26010928961748636
150001 0.40321727166895965 0.26885245901639343
200090 0.4079796803894592 0.2786885245901639
250063 0.4207852682823579 0.28524590163934427
300192 0.4289342787596571 0.2896174863387978
350002 0.43348502487035667 0.2907103825136612
400207 0.43740078315165626 0.292896174863388
450002 0.439940734469256 0.29508196721311475
500002 0.44036405968885595 0.29617486338797816
550197 0.44068155360355593 0.2972677595628415
600000 0.44248068578685573 0.297267759562841
