#CurrentTime InstructionCoverage BranchCoverage
0 0.0 0.0
62502 0.41013824884792627 0.29842931937172773
100003 0.6297099484955272 0.5
164362 0.6616969368392518 0.5314136125654451
254507 0.7319056654920032 0.56282722513089
301883 0.7655191108701546 0.612565445026178
362646 0.7872052046625102 0.6413612565445026
473339 0.7972350230414746 0.6570680628272252
500742 0.8010300894551369 0.6727748691099477
582345 0.8094334507996747 0.6858638743455497
600008 0.8116020601789102 0.685863874345549
