#CurrentTime InstructionCoverage BranchCoverage
0 0.0 0.0
50004 0.5578485537861554 0.5982019363762102
100041 0.5813021341133139 0.6521438450899032
150008 0.593435164120897 0.6770401106500692
200008 0.6002058281876287 0.690179806362379
250023 0.6080597985050373 0.7026279391424619
300025 0.6112013866320009 0.7081604426002767
350047 0.617809554761131 0.7136929460580913
400028 0.6214386307008991 0.7164591977869986
450011 0.6288051132055031 0.7226832641770401
500003 0.6326508503954068 0.7261410788381742
550067 0.6346549669591594 0.7316735822959889
600032 0.6390965225869353 0.734439834024896
