#CurrentTime InstructionCoverage BranchCoverage
0 0.0 0.0
50010 0.6685455155124786 0.48055735580038883
100007 0.7184441215450205 0.5260855476344782
150008 0.7358327877752407 0.5445560596241089
200020 0.7425072253181535 0.5523331173039533
251688 0.7462276653839398 0.5573558003888529
300210 0.7490858575374838 0.5612443292287751
350244 0.7521196927842624 0.5649708360337006
400007 0.7536366104076516 0.5675631885936487
450005 0.7571814073802035 0.572099805573558
500012 0.7577243042138375 0.5738820479585224
550016 0.7584428441407061 0.5755022683084899
603524 0.7594008973765309 0.577284510693454
