#CurrentTime InstructionCoverage BranchCoverage
0 0.0 0.0
50032 0.3495004570980802 0.22127659574468084
100005 0.38582342954159593 0.2570212765957447
150033 0.41305341517565625 0.2822695035460993
200000 0.42488899046624007 0.2977304964539007
250122 0.42885594880501504 0.3025531914893617
300094 0.43365547864698967 0.3080851063829787
350103 0.44222606765051586 0.31645390070921986
400035 0.4455400287318793 0.3204255319148936
450043 0.449376387619172 0.324822695035461
500226 0.4554819119759697 0.33148936170212767
550010 0.4570980801880632 0.33390070921985815
600211 0.4603793914065561 0.338297872340425
