#CurrentTime InstructionCoverage BranchCoverage
0 0.0 0.0
50005 0.46075362627702227 0.3127606338615513
100008 0.48737962358645126 0.34111759799833197
150002 0.5096101335961746 0.365721434528774
200007 0.5166695525926716 0.3740617180984153
250000 0.5213314330620563 0.380038921323325
300029 0.5225968006180322 0.382262996941896
350003 0.5235158570534252 0.38434806783430636
400008 0.5249011015357566 0.38587711982207396
450001 0.5365558027092185 0.40033361134278567
500005 0.5376213753879351 0.40158465387823183
550039 0.5382074403612291 0.4025576869613567
600407 0.5387402267005874 0.403113705865999
