#CurrentTime InstructionCoverage BranchCoverage
0 0.0 0.0
50150 0.2726543027333024 0.19185306419348971
100011 0.3496261247940518 0.2474995453718858
150024 0.4016729331249208 0.2849609019821786
200099 0.4361454944869249 0.30969267139479906
250026 0.46238012758227365 0.32951445717403166
300000 0.4792150732964387 0.3442444080741953
350050 0.4889527269654852 0.35279141662120383
400394 0.49419120442735837 0.3580651027459538
450005 0.49932406742427443 0.3635206401163848
500049 0.5043090701702505 0.36824877250409166
550091 0.5096954078830637 0.37443171485724674
600020 0.5206793122386042 0.384433533369703
