#CurrentTime InstructionCoverage BranchCoverage
0 0.0 0.0
50283 0.3176864244741874 0.18112712975098297
100024 0.3885516252390057 0.23931847968545217
150275 0.421414913957935 0.2602883355176933
200198 0.44598470363288717 0.2768020969855832
250023 0.4676386233269598 0.29200524246395804
300137 0.4769598470363289 0.30249017038007864
350035 0.49557839388145314 0.30982961992136304
400126 0.5152724665391969 0.3211009174311927
450308 0.5304732313575525 0.33499344692005245
500130 0.5374521988527725 0.3399737876802097
550474 0.5474665391969408 0.34469200524246396
600072 0.552868068833652 0.3483617300131061
