#CurrentTime InstructionCoverage BranchCoverage
0 0.0 0.0
51644 0.24652278177458034 0.15645954403218595
100007 0.25203836930455636 0.1671881984801073
150002 0.25227817745803355 0.16897630755476084
200126 0.25270983213429254 0.17076441662941438
250008 0.25323741007194245 0.17165847116674118
300107 0.25357314148681054 0.17210549843540457
351529 0.2538129496402878 0.17210549843540457
400000 0.2547721822541966 0.1743406347787215
450014 0.2547721822541966 0.1743406347787215
500067 0.2547721822541966 0.1743406347787215
550058 0.2548201438848921 0.17478766204738488
600005 0.2564508393285372 0.177916852928028
