#CurrentTime InstructionCoverage BranchCoverage
0 0.0 0.0
50000 0.07930607187112763 0.09090909090909091
100010 0.07930607187112763 0.09090909090909091
150007 0.07930607187112763 0.09090909090909091
200009 0.07930607187112763 0.09090909090909091
250014 0.07930607187112763 0.09090909090909091
300019 0.07930607187112763 0.09090909090909091
350045 0.07930607187112763 0.09090909090909091
400067 0.07930607187112763 0.09090909090909091
450009 0.07930607187112763 0.09090909090909091
500078 0.07930607187112763 0.09090909090909091
550022 0.07930607187112763 0.09090909090909091
600021 0.07930607187112763 0.0909090909090909
