#CurrentTime InstructionCoverage BranchCoverage
0 0.0 0.0
50022 0.37985181644359467 0.2325032765399738
100032 0.4430927342256214 0.2760157273918742
150039 0.49232791586998087 0.30301441677588464
200290 0.5168499043977055 0.31900393184796855
263537 0.5291826003824092 0.3289646133682831
300080 0.535348948374761 0.33420707732634336
350032 0.5442877629063098 0.3420707732634338
400336 0.5503346080305928 0.34783748361730016
450001 0.5558078393881453 0.35517693315858456
500043 0.5600621414913958 0.36041939711664484
550104 0.5622370936902485 0.3625163826998689
600084 0.5713910133843212 0.366972477064220
