#CurrentTime InstructionCoverage BranchCoverage
0 0.0 0.0
53357 0.3313304423243712 0.1227928509905254
101769 0.40008326105810926 0.18933031869078382
160230 0.4326973113616652 0.223083548664944
215153 0.4369540329575022 0.22728251507321276
256548 0.46125238508239375 0.25296080964685613
313753 0.47578837814397223 0.2662575366063738
350039 0.4890823937554206 0.27772394487510765
402250 0.5011864700780573 0.2891903531438415
455506 0.5056582827406765 0.29521963824289404
501898 0.5059670424978318 0.29565030146425497
567131 0.5125654813529922 0.30329457364341084
601830 0.5140052038161318 0.3043712316968130
