#CurrentTime InstructionCoverage BranchCoverage
0 0.0 0.0
50001 0.6019391181887119 0.677731673582296
100006 0.6204636550752898 0.7136929460580913
150010 0.630700899144188 0.7275242047026279
200031 0.6351424547719641 0.7372060857538036
250011 0.6357924385223703 0.7413554633471646
300003 0.6427255985267035 0.7468879668049793
350001 0.6478171379048857 0.7503457814661134
400003 0.651012891344383 0.7517289073305671
450004 0.6523128588451955 0.7531120331950207
500007 0.6545336366590835 0.7544951590594744
550007 0.6565377532228361 0.7558782849239281
600000 0.6566460838479038 0.756569847856154
