#CurrentTime InstructionCoverage BranchCoverage
0 0.0 0.0
50033 0.06223642172523962 0.04748062015503876
100029 0.06223642172523962 0.04796511627906977
150020 0.06255591054313099 0.04893410852713178
200014 0.06255591054313099 0.04941860465116279
250002 0.06255591054313099 0.04941860465116279
300018 0.06255591054313099 0.04941860465116279
350012 0.06255591054313099 0.04941860465116279
400003 0.06293929712460064 0.050387596899224806
450070 0.06293929712460064 0.050387596899224806
500009 0.06293929712460064 0.050872093023255814
550000 0.06293929712460064 0.050872093023255814
600082 0.06293929712460064 0.05087209302325581
