#CurrentTime InstructionCoverage BranchCoverage
0 0.0 0.0
50004 0.5706845238095238 0.4383561643835616
100044 0.5706845238095238 0.4383561643835616
150073 0.5747767857142857 0.4417808219178082
200100 0.5747767857142857 0.4417808219178082
250014 0.5747767857142857 0.4417808219178082
300020 0.5747767857142857 0.4417808219178082
350077 0.5747767857142857 0.4417808219178082
400048 0.5747767857142857 0.4417808219178082
450061 0.5792410714285714 0.4520547945205479
500069 0.5792410714285714 0.4520547945205479
550083 0.5792410714285714 0.4520547945205479
600028 0.5792410714285714 0.452054794520547
