#CurrentTime InstructionCoverage BranchCoverage
0 0.0 0.0
50054 0.37171696364198165 0.2562853907134768
100009 0.41617742987606 0.2867497168742922
150046 0.4627436170334512 0.3301245753114383
200078 0.47890273629278673 0.34699886749716874
250178 0.49009510076561263 0.3592298980747452
300032 0.49633215458738167 0.36670441676104193
350020 0.5005207081631018 0.3713476783691959
400043 0.505407354001442 0.37768969422423554
450014 0.5103397763815932 0.3827859569648924
500035 0.514013343861938 0.3874292185730464
550046 0.5156612993671393 0.3887882219705549
600106 0.5176754672068299 0.391053227633069
