#CurrentTime InstructionCoverage BranchCoverage
0 0.0 0.0
50028 0.07930607187112763 0.09090909090909091
100004 0.07930607187112763 0.09090909090909091
150007 0.07930607187112763 0.09090909090909091
200003 0.09417596034696406 0.09090909090909091
250022 0.09417596034696406 0.09090909090909091
300020 0.09417596034696406 0.09090909090909091
350014 0.09417596034696406 0.09090909090909091
400016 0.09417596034696406 0.09090909090909091
450000 0.09417596034696406 0.09090909090909091
500010 0.09417596034696406 0.09090909090909091
550001 0.09417596034696406 0.09090909090909091
600015 0.09417596034696406 0.0909090909090909
