#CurrentTime InstructionCoverage BranchCoverage
0 0.0 0.0
50001 0.4055343839049679 0.27440543601359
100003 0.43777251347546947 0.3075877689694224
150035 0.4421327290829814 0.3131370328425821
204315 0.44324281022190176 0.3141562853907135
252569 0.44324281022190176 0.3142695356738392
303410 0.4446389947471418 0.3158550396375991
353446 0.44502809535253657 0.31630804077010194
400556 0.44577196415696774 0.3171007927519819
451842 0.4463212826587015 0.31755379388448474
500062 0.44737414312035795 0.3184597961494904
553021 0.44774035545484714 0.3186862967157418
600570 0.4491250958446344 0.319818799546998
