#CurrentTime InstructionCoverage BranchCoverage
0 0.0 0.0
50109 0.3023900573613767 0.15884665792922673
100084 0.374282982791587 0.20419397116644822
150045 0.42827437858508605 0.23302752293577983
200023 0.4932122370936903 0.28256880733944956
250008 0.5153441682600383 0.29908256880733947
300067 0.5232313575525812 0.30747051114023594
350000 0.5317877629063098 0.3182175622542595
400028 0.5366634799235181 0.3229357798165138
450048 0.5450286806883365 0.32870249017038006
500001 0.5525812619502868 0.3363040629095675
550177 0.554206500956023 0.3381389252948886
600224 0.555736137667304 0.3389252948885976
