#CurrentTime InstructionCoverage BranchCoverage
0 0.0 0.0
50008 0.25562483057739227 0.20157068062827224
125691 0.2908647329899702 0.22251308900523561
151976 0.34020059636757927 0.2879581151832461
209983 0.3567362428842505 0.31151832460732987
267404 0.378964489021415 0.3193717277486911
310830 0.4001084304689618 0.32460732984293195
359939 0.4304689617782597 0.35602094240837695
409095 0.43751694226077525 0.36387434554973824
451923 0.48143128219029546 0.387434554973822
538679 0.5177554892924912 0.4083769633507853
551612 0.5367308213608024 0.42408376963350786
600013 0.5944700460829493 0.4659685863874345
