#CurrentTime InstructionCoverage BranchCoverage
0 0.0 0.0
50153 0.3116123642439432 0.21132502831257077
100065 0.4061294789485128 0.28573046432616084
150004 0.4326569849280736 0.31121177802944505
200003 0.4362275551893432 0.3143827859569649
250022 0.44261338277199846 0.3217440543601359
300000 0.4458177406987789 0.32536806342015856
350007 0.4571932113388494 0.3360135900339751
402423 0.4596994770030098 0.3390713476783692
450005 0.4612101028827777 0.3407701019252548
500167 0.46627985488836243 0.3463193657984145
550023 0.46850001716620315 0.347678369195923
603741 0.4700793078586878 0.3503963759909
