#CurrentTime InstructionCoverage BranchCoverage
0 0.0 0.0
50000 0.34710269650028686 0.19140625
100014 0.35857716580608145 0.1953125
150010 0.35857716580608145 0.1953125
200014 0.3602983362019507 0.203125
250004 0.3602983362019507 0.203125
300000 0.3623063683304647 0.20703125
350026 0.36374067699368906 0.2109375
401759 0.36374067699368906 0.2109375
450307 0.36374067699368906 0.2109375
500041 0.36374067699368906 0.2109375
550030 0.3657487091222031 0.21484375
600002 0.36775674125071717 0.2187
