#CurrentTime InstructionCoverage BranchCoverage
0 0.0 0.0
50003 0.23338397265476643 0.29148936170212764
100001 0.23338397265476643 0.29148936170212764
150004 0.23870110140524117 0.30425531914893617
200039 0.24022028104823395 0.31063829787234043
250042 0.24022028104823395 0.31063829787234043
300029 0.24135966578047854 0.3127659574468085
350022 0.24135966578047854 0.3127659574468085
400009 0.24135966578047854 0.3127659574468085
450024 0.24135966578047854 0.3127659574468085
500001 0.25902012913026967 0.3446808510638298
550037 0.25902012913026967 0.3446808510638298
600029 0.25902012913026967 0.344680851063829
